{
  "uid": {
    "@xsi:type": "IdActeur_type",
    "#text": "PA404073"
  },
  "etatCivil": {
    "ident": {
      "civ": "M.",
      "prenom": "Louis",
      "nom": "Pinton",
      "alpha": "PINTON LOUIS",
      "trigramme": null
    },
    "infoNaissance": {
      "dateNais": "1948-10-24T01:00:00.000+01:00",
      "villeNais": null,
      "depNais": null,
      "paysNais": null
    },
    "dateDeces": "2016-11-17T01:00:00.000+01:00"
  },
  "mandats": {
    "mandat": [
      {
        "@xsi:type": "MandatSimple_Type",
        "uid": "PM405194",
        "acteurRef": "PA404073",
        "legislature": null,
        "typeOrgane": "COMSENAT",
        "dateDebut": "2007-12-03T01:00:00.000+01:00",
        "datePublication": null,
        "dateFin": "2016-11-17T01:00:00.000+01:00",
        "preseance": "10",
        "nominPrincipale": "1",
        "infosQualite": {
          "codeQualite": "Membre",
          "libQualite": "Membre",
          "libQualiteSex": "Membre"
        },
        "organes": {
          "organeRef": "PO211493"
        }
      },
      {
        "@xsi:type": "MandatSimple_Type",
        "uid": "PM406068",
        "acteurRef": "PA404073",
        "legislature": null,
        "typeOrgane": "GROUPESENAT",
        "dateDebut": "2007-11-30T01:00:00.000+01:00",
        "datePublication": null,
        "dateFin": "2016-11-17T01:00:00.000+01:00",
        "preseance": "4",
        "nominPrincipale": "1",
        "infosQualite": {
          "codeQualite": "Membre",
          "libQualite": "Membre",
          "libQualiteSex": "Membre"
        },
        "organes": {
          "organeRef": "PO286005"
        }
      },
      {
        "@xsi:type": "MandatParlementaire_type",
        "uid": "PM415596",
        "acteurRef": "PA404073",
        "legislature": null,
        "typeOrgane": "SENAT",
        "dateDebut": "2008-10-01T02:00:00.000+02:00",
        "datePublication": null,
        "dateFin": "2014-09-30T02:00:00.000+02:00",
        "preseance": "20",
        "nominPrincipale": "1",
        "infosQualite": {
          "codeQualite": "Sénateur",
          "libQualite": "SENATEUR",
          "libQualiteSex": "SENATEUR"
        },
        "organes": {
          "organeRef": "PO78718"
        },
        "suppleants": null,
        "election": {
          "lieu": {
            "region": null,
            "regionType": null,
            "departement": null,
            "numDepartement": "36",
            "numCirco": null
          },
          "causeMandat": null
        },
        "InfosHorsSIAN": {
          "HATVP_URI": null
        },
        "mandature": {
          "datePriseFonction": null,
          "causeFin": null,
          "premiereElection": null,
          "placeHemicycle": null,
          "mandatRemplaceRef": null
        }
      },
      {
        "@xsi:type": "MandatSimple_Type",
        "uid": "PM713990",
        "acteurRef": "PA404073",
        "legislature": null,
        "typeOrgane": "COMSPSENAT",
        "dateDebut": "2016-06-22T02:00:00.000+02:00",
        "datePublication": null,
        "dateFin": "2016-07-07T02:00:00.000+02:00",
        "preseance": null,
        "nominPrincipale": "1",
        "infosQualite": {
          "codeQualite": null,
          "libQualite": "Membre",
          "libQualiteSex": "Membre"
        },
        "organes": {
          "organeRef": "PO713965"
        }
      },
      {
        "@xsi:type": "MandatSimple_Type",
        "uid": "PM714244",
        "acteurRef": "PA404073",
        "legislature": null,
        "typeOrgane": "COMSPSENAT",
        "dateDebut": "2016-07-07T02:00:00.000+02:00",
        "datePublication": null,
        "dateFin": "2016-11-17T01:00:00.000+01:00",
        "preseance": null,
        "nominPrincipale": "1",
        "infosQualite": {
          "codeQualite": null,
          "libQualite": "Membre",
          "libQualiteSex": "Membre"
        },
        "organes": {
          "organeRef": "PO714224"
        }
      },
      {
        "@xsi:type": "MandatParlementaire_type",
        "uid": "PM703552",
        "acteurRef": "PA404073",
        "legislature": null,
        "typeOrgane": "SENAT",
        "dateDebut": "2014-10-01T02:00:00.000+02:00",
        "datePublication": null,
        "dateFin": "2016-11-17T01:00:00.000+01:00",
        "preseance": "20",
        "nominPrincipale": "1",
        "infosQualite": {
          "codeQualite": "Sénateur",
          "libQualite": "SENATEUR",
          "libQualiteSex": "SENATEUR"
        },
        "organes": {
          "organeRef": "PO78718"
        },
        "suppleants": null,
        "election": {
          "lieu": {
            "region": null,
            "regionType": null,
            "departement": null,
            "numDepartement": "36",
            "numCirco": null
          },
          "causeMandat": null
        },
        "InfosHorsSIAN": {
          "HATVP_URI": null
        },
        "mandature": {
          "datePriseFonction": null,
          "causeFin": null,
          "premiereElection": null,
          "placeHemicycle": null,
          "mandatRemplaceRef": null
        }
      },
      {
        "@xsi:type": "MandatSimple_Type",
        "uid": "PM704909",
        "acteurRef": "PA404073",
        "legislature": null,
        "typeOrgane": "DELEGSENAT",
        "dateDebut": "2014-10-29T01:00:00.000+01:00",
        "datePublication": null,
        "dateFin": "2016-11-17T01:00:00.000+01:00",
        "preseance": "4",
        "nominPrincipale": "1",
        "infosQualite": {
          "codeQualite": "Membre",
          "libQualite": "Membre",
          "libQualiteSex": "Membre"
        },
        "organes": {
          "organeRef": "PO420387"
        }
      }
    ]
  }
}