{
  "uid": {
    "@xsi:type": "IdActeur_type",
    "#text": "PA707706"
  },
  "etatCivil": {
    "ident": {
      "civ": "Mme",
      "prenom": "Lana",
      "nom": "Tetuanui",
      "alpha": "TETUANUI_LANA",
      "trigramme": null
    },
    "infoNaissance": {
      "dateNais": "1970-02-23T01:00:00.000+01:00",
      "villeNais": null,
      "depNais": null,
      "paysNais": null
    },
    "dateDeces": null
  },
  "uri_hatvp": null,
  "mandats": {
    "mandat": [
      {
        "@xsi:type": "MandatParlementaire_type",
        "uid": "PM707717",
        "acteurRef": "PA707706",
        "legislature": null,
        "typeOrgane": "SENAT",
        "dateDebut": "2015-05-04T02:00:00.000+02:00",
        "datePublication": null,
        "dateFin": null,
        "preseance": "20",
        "nominPrincipale": "1",
        "infosQualite": {
          "codeQualite": "Sénateur",
          "libQualite": "SENATEUR",
          "libQualiteSex": "Sénateur 5ème République"
        },
        "organes": {
          "organeRef": "PO78718"
        },
        "suppleants": null,
        "election": {
          "lieu": {
            "region": null,
            "regionType": null,
            "departement": null,
            "numDepartement": "987",
            "numCirco": null
          },
          "causeMandat": null
        },
        "InfosHorsSIAN": {
          "HATVP_URI": null
        },
        "mandature": {
          "datePriseFonction": null,
          "causeFin": null,
          "premiereElection": null,
          "placeHemicycle": null,
          "mandatRemplaceRef": null
        }
      },
      {
        "@xsi:type": "MandatSimple_Type",
        "uid": "PM707715",
        "acteurRef": "PA707706",
        "legislature": null,
        "typeOrgane": "GROUPESENAT",
        "dateDebut": "2015-05-04T02:00:00.000+02:00",
        "datePublication": null,
        "dateFin": "2015-05-11T02:00:00.000+02:00",
        "preseance": "4",
        "nominPrincipale": "1",
        "infosQualite": {
          "codeQualite": "Membre",
          "libQualite": "Membre",
          "libQualiteSex": "Membre du"
        },
        "organes": {
          "organeRef": "PO77708"
        }
      },
      {
        "@xsi:type": "MandatSimple_Type",
        "uid": "PM707714",
        "acteurRef": "PA707706",
        "legislature": null,
        "typeOrgane": "DELEGSENAT",
        "dateDebut": "2015-05-04T02:00:00.000+02:00",
        "datePublication": null,
        "dateFin": null,
        "preseance": "4",
        "nominPrincipale": "1",
        "infosQualite": {
          "codeQualite": "Membre",
          "libQualite": "Membre",
          "libQualiteSex": "Membre"
        },
        "organes": {
          "organeRef": "PO436945"
        }
      },
      {
        "@xsi:type": "MandatSimple_Type",
        "uid": "PM714165",
        "acteurRef": "PA707706",
        "legislature": null,
        "typeOrgane": "CMP",
        "dateDebut": "2016-06-30T02:00:00.000+02:00",
        "datePublication": "2016-07-07T02:00:00.000+02:00",
        "dateFin": "2016-07-13T02:00:00.000+02:00",
        "preseance": "20",
        "nominPrincipale": "1",
        "infosQualite": {
          "codeQualite": "Titulaire",
          "libQualite": "Membre titulaire",
          "libQualiteSex": "Membre titulaire"
        },
        "organes": {
          "organeRef": "PO714027"
        }
      },
      {
        "@xsi:type": "MandatSimple_Type",
        "uid": "PM716688",
        "acteurRef": "PA707706",
        "legislature": null,
        "typeOrgane": "CMP",
        "dateDebut": "2017-01-24T01:00:00.000+01:00",
        "datePublication": "2017-02-01T01:00:00.000+01:00",
        "dateFin": "2017-02-02T01:00:00.000+01:00",
        "preseance": "20",
        "nominPrincipale": "1",
        "infosQualite": {
          "codeQualite": "Titulaire",
          "libQualite": "Membre titulaire",
          "libQualiteSex": "Membre titulaire"
        },
        "organes": {
          "organeRef": "PO716574"
        }
      },
      {
        "@xsi:type": "MandatSimple_Type",
        "uid": "PM716827",
        "acteurRef": "PA707706",
        "legislature": null,
        "typeOrgane": "CMP",
        "dateDebut": "2017-02-09T01:00:00.000+01:00",
        "datePublication": "2017-02-10T01:00:00.000+01:00",
        "dateFin": "2017-02-14T01:00:00.000+01:00",
        "preseance": "20",
        "nominPrincipale": "1",
        "infosQualite": {
          "codeQualite": "Titulaire",
          "libQualite": "Membre titulaire",
          "libQualiteSex": "Membre titulaire"
        },
        "organes": {
          "organeRef": "PO716801"
        }
      },
      {
        "@xsi:type": "MandatSimple_Type",
        "uid": "PM716860",
        "acteurRef": "PA707706",
        "legislature": null,
        "typeOrgane": "CMP",
        "dateDebut": "2017-02-09T01:00:00.000+01:00",
        "datePublication": "2017-02-10T01:00:00.000+01:00",
        "dateFin": "2017-02-14T01:00:00.000+01:00",
        "preseance": "20",
        "nominPrincipale": "1",
        "infosQualite": {
          "codeQualite": "Titulaire",
          "libQualite": "Membre titulaire",
          "libQualiteSex": "Membre titulaire"
        },
        "organes": {
          "organeRef": "PO716835"
        }
      },
      {
        "@xsi:type": "MandatSimple_Type",
        "uid": "PM716881",
        "acteurRef": "PA707706",
        "legislature": null,
        "typeOrgane": "CMP",
        "dateDebut": "2017-02-08T01:00:00.000+01:00",
        "datePublication": "2017-02-11T01:00:00.000+01:00",
        "dateFin": "2017-02-14T01:00:00.000+01:00",
        "preseance": "20",
        "nominPrincipale": "1",
        "infosQualite": {
          "codeQualite": "Titulaire",
          "libQualite": "Membre titulaire",
          "libQualiteSex": "Membre titulaire"
        },
        "organes": {
          "organeRef": "PO716786"
        }
      },
      {
        "@xsi:type": "MandatSimple_Type",
        "uid": "PM714122",
        "acteurRef": "PA707706",
        "legislature": null,
        "typeOrgane": "CMP",
        "dateDebut": "2016-06-30T02:00:00.000+02:00",
        "datePublication": "2016-07-07T02:00:00.000+02:00",
        "dateFin": "2016-07-13T02:00:00.000+02:00",
        "preseance": "20",
        "nominPrincipale": "1",
        "infosQualite": {
          "codeQualite": "Titulaire",
          "libQualite": "Membre titulaire",
          "libQualiteSex": "Membre titulaire"
        },
        "organes": {
          "organeRef": "PO714021"
        }
      },
      {
        "@xsi:type": "MandatSimple_Type",
        "uid": "PM707771",
        "acteurRef": "PA707706",
        "legislature": null,
        "typeOrgane": "GROUPESENAT",
        "dateDebut": "2015-05-12T02:00:00.000+02:00",
        "datePublication": null,
        "dateFin": null,
        "preseance": "8",
        "nominPrincipale": "1",
        "infosQualite": {
          "codeQualite": "Membre apparenté",
          "libQualite": "Membre apparenté",
          "libQualiteSex": "Apparentée au"
        },
        "organes": {
          "organeRef": "PO309463"
        }
      },
      {
        "@xsi:type": "MandatSimple_Type",
        "uid": "PM707769",
        "acteurRef": "PA707706",
        "legislature": null,
        "typeOrgane": "COMSENAT",
        "dateDebut": "2015-05-12T02:00:00.000+02:00",
        "datePublication": null,
        "dateFin": null,
        "preseance": "10",
        "nominPrincipale": "1",
        "infosQualite": {
          "codeQualite": "Membre",
          "libQualite": "Membre",
          "libQualiteSex": "Membre"
        },
        "organes": {
          "organeRef": "PO211495"
        }
      },
      {
        "@xsi:type": "MandatSimple_Type",
        "uid": "PM709462",
        "acteurRef": "PA707706",
        "legislature": null,
        "typeOrgane": "CMP",
        "dateDebut": "2015-09-16T02:00:00.000+02:00",
        "datePublication": "2015-09-25T02:00:00.000+02:00",
        "dateFin": "2015-10-07T02:00:00.000+02:00",
        "preseance": "20",
        "nominPrincipale": "1",
        "infosQualite": {
          "codeQualite": "Titulaire",
          "libQualite": "Membre titulaire",
          "libQualiteSex": "Membre titulaire"
        },
        "organes": {
          "organeRef": "PO709067"
        }
      },
      {
        "@xsi:type": "MandatSimple_Type",
        "uid": "PM714157",
        "acteurRef": "PA707706",
        "legislature": null,
        "typeOrgane": "CMP",
        "dateDebut": "2016-06-30T02:00:00.000+02:00",
        "datePublication": "2016-07-07T02:00:00.000+02:00",
        "dateFin": "2016-07-13T02:00:00.000+02:00",
        "preseance": "20",
        "nominPrincipale": "1",
        "infosQualite": {
          "codeQualite": "Titulaire",
          "libQualite": "Membre titulaire",
          "libQualiteSex": "Membre titulaire"
        },
        "organes": {
          "organeRef": "PO714015"
        }
      },
      {
        "@xsi:type": "MandatSimple_Type",
        "uid": "PM741535",
        "acteurRef": "PA707706",
        "legislature": null,
        "typeOrgane": "DELEGSENAT",
        "dateDebut": "2017-10-18T02:00:00.000+02:00",
        "datePublication": null,
        "dateFin": null,
        "preseance": "4",
        "nominPrincipale": "1",
        "infosQualite": {
          "codeQualite": "Membre",
          "libQualite": "Membre",
          "libQualiteSex": "Membre"
        },
        "organes": {
          "organeRef": "PO436945"
        }
      }
    ]
  }
}