{
  "@xsi:type": "OrganeParlementaire_Type",
  "uid": "PO695475",
  "codeType": "CMP",
  "libelle": "Commission mixte paritaire chargée de proposer un texte sur les dispositions restant en discussion du projet de loi relatif à l'enseignement supérieur et à la recherche",
  "libelleEdition": "du projet de loi relatif à l'enseignement supérieur et à la recherche",
  "libelleAbrege": "Enseignement supérieur et recherche",
  "libelleAbrev": "CMP_835",
  "viMoDe": {
    "dateDebut": "2013-06-24T02:00:00.000+02:00",
    "dateAgrement": null,
    "dateFin": "2013-07-16T02:00:00.000+02:00"
  },
  "regime": "5ème République",
  "legislature": "14",
  "secretariat": {
    "secretaire01": null,
    "secretaire02": null
  }
}