{
  "uid": {
    "@xsi:type": "IdActeur_type",
    "#text": "PA2825"
  },
  "etatCivil": {
    "ident": {
      "civ": "Mme",
      "prenom": "Marisol",
      "nom": "Touraine",
      "alpha": "Touraine M",
      "trigramme": null
    },
    "infoNaissance": {
      "dateNais": "1959-03-07T01:00:00.000+01:00",
      "villeNais": "Paris",
      "depNais": "Paris",
      "paysNais": null
    },
    "dateDeces": null
  },
  "uri_hatvp": null,
  "mandats": {
    "mandat": [
      {
        "@xsi:type": "MandatSimple_Type",
        "uid": "PM591176",
        "acteurRef": "PA2825",
        "legislature": null,
        "typeOrgane": "MINISTERE",
        "dateDebut": "2012-05-17T02:00:00.000+02:00",
        "datePublication": "2012-05-17T02:00:00.000+02:00",
        "dateFin": "2012-06-18T02:00:00.000+02:00",
        "preseance": "30",
        "nominPrincipale": "1",
        "infosQualite": {
          "codeQualite": "Ministre",
          "libQualite": "Ministre",
          "libQualiteSex": "Ministre"
        },
        "organes": {
          "organeRef": "PO591174"
        }
      },
      {
        "@xsi:type": "MandatParlementaire_type",
        "uid": "PM645568",
        "acteurRef": "PA2825",
        "legislature": "14",
        "typeOrgane": "ASSEMBLEE",
        "dateDebut": "2012-06-20T02:00:00.000+02:00",
        "datePublication": null,
        "dateFin": "2012-07-21T02:00:00.000+02:00",
        "preseance": "50",
        "nominPrincipale": "1",
        "infosQualite": {
          "codeQualite": "membre",
          "libQualite": "membre",
          "libQualiteSex": "membre"
        },
        "organes": {
          "organeRef": "PO644420"
        },
        "suppleants": {
          "suppleant": {
            "dateDebut": "2012-06-20T02:00:00.000+02:00",
            "dateFin": "2012-07-21T02:00:00.000+02:00",
            "suppleantRef": "PA342332"
          }
        },
        "election": {
          "lieu": {
            "region": "Centre-Val de Loire",
            "regionType": "Métropolitain",
            "departement": "Indre-et-Loire",
            "numDepartement": "37",
            "numCirco": "3"
          },
          "causeMandat": "élections générales",
          "refCirconscription": "PO644594"
        },
        "mandature": {
          "datePriseFonction": "2012-06-20T02:00:00.000+02:00",
          "causeFin": "Nomination comme membre du Gouvernement",
          "premiereElection": "1",
          "placeHemicycle": null,
          "mandatRemplaceRef": null
        }
      },
      {
        "@xsi:type": "MandatSimple_Type",
        "uid": "PM653254",
        "acteurRef": "PA2825",
        "legislature": null,
        "typeOrgane": "MINISTERE",
        "dateDebut": "2012-06-22T02:00:00.000+02:00",
        "datePublication": "2012-06-22T02:00:00.000+02:00",
        "dateFin": "2014-03-31T02:00:00.000+02:00",
        "preseance": "30",
        "nominPrincipale": "1",
        "infosQualite": {
          "codeQualite": "Ministre",
          "libQualite": "Ministre",
          "libQualiteSex": "Ministre"
        },
        "organes": {
          "organeRef": "PO653252"
        }
      },
      {
        "@xsi:type": "MandatSimple_Type",
        "uid": "PM656288",
        "acteurRef": "PA2825",
        "legislature": "14",
        "typeOrgane": "GP",
        "dateDebut": "2012-06-26T02:00:00.000+02:00",
        "datePublication": "2012-06-27T02:00:00.000+02:00",
        "dateFin": "2012-07-21T02:00:00.000+02:00",
        "preseance": "20",
        "nominPrincipale": "1",
        "infosQualite": {
          "codeQualite": "Membre",
          "libQualite": "Membre du",
          "libQualiteSex": "Membre du"
        },
        "organes": {
          "organeRef": "PO656002"
        }
      },
      {
        "@xsi:type": "MandatSimple_Type",
        "uid": "PM15715812",
        "acteurRef": "PA2825",
        "legislature": null,
        "typeOrgane": "GOUVERNEMENT",
        "dateDebut": "2016-12-07T01:00:00.000+01:00",
        "datePublication": "2016-12-07T01:00:00.000+01:00",
        "dateFin": "2017-05-17T02:00:00.000+02:00",
        "preseance": "50",
        "nominPrincipale": "1",
        "infosQualite": {
          "codeQualite": "membre",
          "libQualite": "membre",
          "libQualiteSex": "membre"
        },
        "organes": {
          "organeRef": "PO715793"
        }
      },
      {
        "@xsi:type": "MandatSimple_Type",
        "uid": "PM657503",
        "acteurRef": "PA2825",
        "legislature": "14",
        "typeOrgane": "COMPER",
        "dateDebut": "2012-06-28T02:00:00.000+02:00",
        "datePublication": "2012-06-28T02:00:00.000+02:00",
        "dateFin": "2012-07-21T02:00:00.000+02:00",
        "preseance": "32",
        "nominPrincipale": "1",
        "infosQualite": {
          "codeQualite": "Membre",
          "libQualite": "Membre",
          "libQualiteSex": "Membre"
        },
        "organes": {
          "organeRef": "PO59048"
        }
      },
      {
        "@xsi:type": "MandatSimple_Type",
        "uid": "PM15591176",
        "acteurRef": "PA2825",
        "legislature": null,
        "typeOrgane": "GOUVERNEMENT",
        "dateDebut": "2012-05-17T02:00:00.000+02:00",
        "datePublication": "2012-05-17T02:00:00.000+02:00",
        "dateFin": "2012-06-18T02:00:00.000+02:00",
        "preseance": "50",
        "nominPrincipale": "1",
        "infosQualite": {
          "codeQualite": "membre",
          "libQualite": "membre",
          "libQualiteSex": "membre"
        },
        "organes": {
          "organeRef": "PO590011"
        }
      },
      {
        "@xsi:type": "MandatSimple_Type",
        "uid": "PM15653254",
        "acteurRef": "PA2825",
        "legislature": null,
        "typeOrgane": "GOUVERNEMENT",
        "dateDebut": "2012-06-22T02:00:00.000+02:00",
        "datePublication": "2012-06-22T02:00:00.000+02:00",
        "dateFin": "2014-03-31T02:00:00.000+02:00",
        "preseance": "50",
        "nominPrincipale": "1",
        "infosQualite": {
          "codeQualite": "membre",
          "libQualite": "membre",
          "libQualiteSex": "membre"
        },
        "organes": {
          "organeRef": "PO653199"
        }
      },
      {
        "@xsi:type": "MandatParlementaire_type",
        "uid": "PM718630",
        "acteurRef": "PA2825",
        "legislature": "14",
        "typeOrgane": "ASSEMBLEE",
        "dateDebut": "2012-06-20T02:00:00.000+02:00",
        "datePublication": null,
        "dateFin": "2017-06-20T02:00:00.000+02:00",
        "preseance": "50",
        "nominPrincipale": "1",
        "infosQualite": {
          "codeQualite": "membre",
          "libQualite": "membre",
          "libQualiteSex": "membre"
        },
        "organes": {
          "organeRef": "PO644420"
        },
        "suppleants": {
          "suppleant": {
            "dateDebut": "2012-06-20T02:00:00.000+02:00",
            "dateFin": "2017-06-20T02:00:00.000+02:00",
            "suppleantRef": "PA342332"
          }
        },
        "election": {
          "lieu": {
            "region": "Centre-Val de Loire",
            "regionType": "Métropolitain",
            "departement": "Indre-et-Loire",
            "numDepartement": "37",
            "numCirco": "3"
          },
          "causeMandat": "reprise de l'exercice du mandat d'un ancien membre du Gouvernement",
          "refCirconscription": "PO644594"
        },
        "mandature": {
          "datePriseFonction": "2017-06-18T02:00:00.000+02:00",
          "causeFin": "Fin de législature",
          "premiereElection": "1",
          "placeHemicycle": null,
          "mandatRemplaceRef": "645568"
        }
      },
      {
        "@xsi:type": "MandatSimple_Type",
        "uid": "PM718661",
        "acteurRef": "PA2825",
        "legislature": "14",
        "typeOrgane": "GP",
        "dateDebut": "2017-06-18T02:00:00.000+02:00",
        "datePublication": null,
        "dateFin": "2017-06-20T02:00:00.000+02:00",
        "preseance": "28",
        "nominPrincipale": "1",
        "infosQualite": {
          "codeQualite": "Député non-inscrit",
          "libQualite": "Député non-inscrit",
          "libQualiteSex": "Députée non-inscrite"
        },
        "organes": {
          "organeRef": "PO645633"
        }
      },
      {
        "@xsi:type": "MandatSimple_Type",
        "uid": "PM700732",
        "acteurRef": "PA2825",
        "legislature": null,
        "typeOrgane": "MINISTERE",
        "dateDebut": "2014-04-03T02:00:00.000+02:00",
        "datePublication": "2014-04-03T02:00:00.000+02:00",
        "dateFin": "2014-08-26T02:00:00.000+02:00",
        "preseance": "30",
        "nominPrincipale": "1",
        "infosQualite": {
          "codeQualite": "Ministre",
          "libQualite": "Ministre",
          "libQualiteSex": "Ministre"
        },
        "organes": {
          "organeRef": "PO700730"
        }
      },
      {
        "@xsi:type": "MandatSimple_Type",
        "uid": "PM15700732",
        "acteurRef": "PA2825",
        "legislature": null,
        "typeOrgane": "GOUVERNEMENT",
        "dateDebut": "2014-04-03T02:00:00.000+02:00",
        "datePublication": "2014-04-03T02:00:00.000+02:00",
        "dateFin": "2014-08-26T02:00:00.000+02:00",
        "preseance": "50",
        "nominPrincipale": "1",
        "infosQualite": {
          "codeQualite": "membre",
          "libQualite": "membre",
          "libQualiteSex": "membre"
        },
        "organes": {
          "organeRef": "PO700706"
        }
      },
      {
        "@xsi:type": "MandatSimple_Type",
        "uid": "PM702962",
        "acteurRef": "PA2825",
        "legislature": null,
        "typeOrgane": "MINISTERE",
        "dateDebut": "2014-08-27T02:00:00.000+02:00",
        "datePublication": "2014-08-27T02:00:00.000+02:00",
        "dateFin": "2016-02-12T01:00:00.000+01:00",
        "preseance": "30",
        "nominPrincipale": "1",
        "infosQualite": {
          "codeQualite": "Ministre",
          "libQualite": "Ministre",
          "libQualiteSex": "Ministre"
        },
        "organes": {
          "organeRef": "PO702892"
        }
      },
      {
        "@xsi:type": "MandatSimple_Type",
        "uid": "PM15702962",
        "acteurRef": "PA2825",
        "legislature": null,
        "typeOrgane": "GOUVERNEMENT",
        "dateDebut": "2014-08-27T02:00:00.000+02:00",
        "datePublication": "2014-08-27T02:00:00.000+02:00",
        "dateFin": "2016-12-06T01:00:00.000+01:00",
        "preseance": "50",
        "nominPrincipale": "1",
        "infosQualite": {
          "codeQualite": "membre",
          "libQualite": "membre",
          "libQualiteSex": "membre"
        },
        "organes": {
          "organeRef": "PO702883"
        }
      },
      {
        "@xsi:type": "MandatSimple_Type",
        "uid": "PM715812",
        "acteurRef": "PA2825",
        "legislature": null,
        "typeOrgane": "MINISTERE",
        "dateDebut": "2016-12-07T01:00:00.000+01:00",
        "datePublication": "2016-12-07T01:00:00.000+01:00",
        "dateFin": "2017-05-17T02:00:00.000+02:00",
        "preseance": "30",
        "nominPrincipale": "1",
        "infosQualite": {
          "codeQualite": "Ministre",
          "libQualite": "Ministre",
          "libQualiteSex": "Ministre"
        },
        "organes": {
          "organeRef": "PO715810"
        }
      },
      {
        "@xsi:type": "MandatSimple_Type",
        "uid": "PM711565",
        "acteurRef": "PA2825",
        "legislature": null,
        "typeOrgane": "MINISTERE",
        "dateDebut": "2016-02-12T01:00:00.000+01:00",
        "datePublication": "2016-02-12T01:00:00.000+01:00",
        "dateFin": "2016-12-06T01:00:00.000+01:00",
        "preseance": "30",
        "nominPrincipale": "1",
        "infosQualite": {
          "codeQualite": "Ministre",
          "libQualite": "Ministre",
          "libQualiteSex": "Ministre"
        },
        "organes": {
          "organeRef": "PO711563"
        }
      }
    ]
  }
}