{
  "@xsi:type": "OrganeParlementaire_Type",
  "uid": "PO715651",
  "codeType": "CMP",
  "libelle": "Commission mixte paritaire chargée de proposer un texte commun sur le projet de loi de finances pour 2017",
  "libelleEdition": "de la commission mixte paritaire chargée de proposer un texte commun sur le projet de loi de finances pour 2017",
  "libelleAbrege": "Projet de loi de finances pour 2017",
  "libelleAbrev": "4061",
  "viMoDe": {
    "dateDebut": "2016-11-30T01:00:00.000+01:00",
    "dateAgrement": null,
    "dateFin": "2016-12-16T01:00:00.000+01:00"
  },
  "regime": "5ème République",
  "legislature": "14",
  "secretariat": {
    "secretaire01": null,
    "secretaire02": null
  }
}