{
  "uid": {
    "@xsi:type": "IdActeur_type",
    "#text": "PA429861"
  },
  "etatCivil": {
    "ident": {
      "civ": "M.",
      "prenom": "Maurice",
      "nom": "Vincent",
      "alpha": "VINCENT_MAURICE_C4858",
      "trigramme": null
    },
    "infoNaissance": {
      "dateNais": "1955-09-20T01:00:00.000+01:00",
      "villeNais": null,
      "depNais": null,
      "paysNais": null
    },
    "dateDeces": null
  },
  "uri_hatvp": null,
  "mandats": {
    "mandat": [
      {
        "@xsi:type": "MandatParlementaire_type",
        "uid": "PM429919",
        "acteurRef": "PA429861",
        "legislature": null,
        "typeOrgane": "SENAT",
        "dateDebut": "2011-10-01T02:00:00.000+02:00",
        "datePublication": null,
        "dateFin": "2017-10-01T02:00:00.000+02:00",
        "preseance": "20",
        "nominPrincipale": "1",
        "infosQualite": {
          "codeQualite": "Sénateur",
          "libQualite": "SENATEUR",
          "libQualiteSex": "SENATEUR"
        },
        "organes": {
          "organeRef": "PO78718"
        },
        "suppleants": null,
        "election": {
          "lieu": {
            "region": null,
            "regionType": null,
            "departement": null,
            "numDepartement": "42",
            "numCirco": null
          },
          "causeMandat": null
        },
        "InfosHorsSIAN": {
          "HATVP_URI": null
        },
        "mandature": {
          "datePriseFonction": null,
          "causeFin": null,
          "premiereElection": null,
          "placeHemicycle": null,
          "mandatRemplaceRef": null
        }
      },
      {
        "@xsi:type": "MandatSimple_Type",
        "uid": "PM430248",
        "acteurRef": "PA429861",
        "legislature": null,
        "typeOrgane": "COMSENAT",
        "dateDebut": "2011-10-01T02:00:00.000+02:00",
        "datePublication": null,
        "dateFin": "2014-07-21T02:00:00.000+02:00",
        "preseance": "10",
        "nominPrincipale": "1",
        "infosQualite": {
          "codeQualite": "Membre",
          "libQualite": "Membre",
          "libQualiteSex": "Membre"
        },
        "organes": {
          "organeRef": "PO211490"
        }
      },
      {
        "@xsi:type": "MandatSimple_Type",
        "uid": "PM430479",
        "acteurRef": "PA429861",
        "legislature": null,
        "typeOrgane": "GROUPESENAT",
        "dateDebut": "2011-10-01T02:00:00.000+02:00",
        "datePublication": null,
        "dateFin": "2017-06-27T02:00:00.000+02:00",
        "preseance": "4",
        "nominPrincipale": "1",
        "infosQualite": {
          "codeQualite": "Membre",
          "libQualite": "Membre",
          "libQualiteSex": "Membre"
        },
        "organes": {
          "organeRef": "PO77710"
        }
      },
      {
        "@xsi:type": "MandatSimple_Type",
        "uid": "PM712819",
        "acteurRef": "PA429861",
        "legislature": null,
        "typeOrgane": "CMP",
        "dateDebut": "2016-05-12T02:00:00.000+02:00",
        "datePublication": "2016-05-13T02:00:00.000+02:00",
        "dateFin": "2016-06-01T02:00:00.000+02:00",
        "preseance": "28",
        "nominPrincipale": "1",
        "infosQualite": {
          "codeQualite": "Suppléant",
          "libQualite": "Membre suppléant",
          "libQualiteSex": "Membre suppléant"
        },
        "organes": {
          "organeRef": "PO712775"
        }
      },
      {
        "@xsi:type": "MandatSimple_Type",
        "uid": "PM708435",
        "acteurRef": "PA429861",
        "legislature": null,
        "typeOrgane": "CMP",
        "dateDebut": "2015-06-09T02:00:00.000+02:00",
        "datePublication": "2015-06-10T02:00:00.000+02:00",
        "dateFin": "2015-06-12T02:00:00.000+02:00",
        "preseance": "28",
        "nominPrincipale": "1",
        "infosQualite": {
          "codeQualite": "Suppléant",
          "libQualite": "Membre suppléant",
          "libQualiteSex": "Membre suppléant"
        },
        "organes": {
          "organeRef": "PO708315"
        }
      },
      {
        "@xsi:type": "MandatSimple_Type",
        "uid": "PM716262",
        "acteurRef": "PA429861",
        "legislature": null,
        "typeOrgane": "CMP",
        "dateDebut": "2016-12-16T01:00:00.000+01:00",
        "datePublication": "2016-12-17T01:00:00.000+01:00",
        "dateFin": "2016-12-20T01:00:00.000+01:00",
        "preseance": "28",
        "nominPrincipale": "1",
        "infosQualite": {
          "codeQualite": "Suppléant",
          "libQualite": "Membre suppléant",
          "libQualiteSex": "Membre suppléant"
        },
        "organes": {
          "organeRef": "PO716192"
        }
      },
      {
        "@xsi:type": "MandatSimple_Type",
        "uid": "PM732470",
        "acteurRef": "PA429861",
        "legislature": null,
        "typeOrgane": "GROUPESENAT",
        "dateDebut": "2017-06-28T02:00:00.000+02:00",
        "datePublication": null,
        "dateFin": "2017-10-01T02:00:00.000+02:00",
        "preseance": "4",
        "nominPrincipale": "1",
        "infosQualite": {
          "codeQualite": "Membre",
          "libQualite": "Membre",
          "libQualiteSex": "Membre"
        },
        "organes": {
          "organeRef": "PO732421"
        }
      },
      {
        "@xsi:type": "MandatSimple_Type",
        "uid": "PM702878",
        "acteurRef": "PA429861",
        "legislature": null,
        "typeOrgane": "COMSENAT",
        "dateDebut": "2014-07-22T02:00:00.000+02:00",
        "datePublication": null,
        "dateFin": "2017-10-01T02:00:00.000+02:00",
        "preseance": "10",
        "nominPrincipale": "1",
        "infosQualite": {
          "codeQualite": "Membre",
          "libQualite": "Membre",
          "libQualiteSex": "Membre"
        },
        "organes": {
          "organeRef": "PO211494"
        }
      },
      {
        "@xsi:type": "MandatSimple_Type",
        "uid": "PM714211",
        "acteurRef": "PA429861",
        "legislature": null,
        "typeOrgane": "CMP",
        "dateDebut": "2016-07-08T02:00:00.000+02:00",
        "datePublication": "2016-07-09T02:00:00.000+02:00",
        "dateFin": "2016-07-13T02:00:00.000+02:00",
        "preseance": "28",
        "nominPrincipale": "1",
        "infosQualite": {
          "codeQualite": "Suppléant",
          "libQualite": "Membre suppléant",
          "libQualiteSex": "Membre suppléant"
        },
        "organes": {
          "organeRef": "PO714186"
        }
      },
      {
        "@xsi:type": "MandatSimple_Type",
        "uid": "PM709002",
        "acteurRef": "PA429861",
        "legislature": null,
        "typeOrgane": "CMP",
        "dateDebut": "2015-07-10T02:00:00.000+02:00",
        "datePublication": "2015-07-11T02:00:00.000+02:00",
        "dateFin": "2015-07-16T02:00:00.000+02:00",
        "preseance": "28",
        "nominPrincipale": "1",
        "infosQualite": {
          "codeQualite": "Suppléant",
          "libQualite": "Membre suppléant",
          "libQualiteSex": "Membre suppléant"
        },
        "organes": {
          "organeRef": "PO708938"
        }
      },
      {
        "@xsi:type": "MandatSimple_Type",
        "uid": "PM715978",
        "acteurRef": "PA429861",
        "legislature": null,
        "typeOrgane": "CMP",
        "dateDebut": "2016-11-30T01:00:00.000+01:00",
        "datePublication": "2016-12-09T01:00:00.000+01:00",
        "dateFin": "2016-12-16T01:00:00.000+01:00",
        "preseance": "20",
        "nominPrincipale": "1",
        "infosQualite": {
          "codeQualite": "Titulaire",
          "libQualite": "Membre titulaire",
          "libQualiteSex": "Membre titulaire"
        },
        "organes": {
          "organeRef": "PO715651"
        }
      },
      {
        "@xsi:type": "MandatSimple_Type",
        "uid": "PM710690",
        "acteurRef": "PA429861",
        "legislature": null,
        "typeOrgane": "CMP",
        "dateDebut": "2015-12-07T01:00:00.000+01:00",
        "datePublication": "2015-12-10T01:00:00.000+01:00",
        "dateFin": "2015-12-11T01:00:00.000+01:00",
        "preseance": "28",
        "nominPrincipale": "1",
        "infosQualite": {
          "codeQualite": "Suppléant",
          "libQualite": "Membre suppléant",
          "libQualiteSex": "Membre suppléant"
        },
        "organes": {
          "organeRef": "PO710669"
        }
      },
      {
        "@xsi:type": "MandatSimple_Type",
        "uid": "PM710790",
        "acteurRef": "PA429861",
        "legislature": null,
        "typeOrgane": "CMP",
        "dateDebut": "2015-12-11T01:00:00.000+01:00",
        "datePublication": "2015-12-12T01:00:00.000+01:00",
        "dateFin": "2015-12-15T01:00:00.000+01:00",
        "preseance": "28",
        "nominPrincipale": "1",
        "infosQualite": {
          "codeQualite": "Suppléant",
          "libQualite": "Membre suppléant",
          "libQualiteSex": "Membre suppléant"
        },
        "organes": {
          "organeRef": "PO710744"
        }
      }
    ]
  }
}