{
  "uid": {
    "@xsi:type": "IdActeur_type",
    "#text": "PA711156"
  },
  "etatCivil": {
    "ident": {
      "civ": "M.",
      "prenom": "Jean-François",
      "nom": "Rapin",
      "alpha": "RAPIN JEAN FRANCOIS",
      "trigramme": null
    },
    "infoNaissance": {
      "dateNais": "1966-05-11T01:00:00.000+01:00",
      "villeNais": null,
      "depNais": null,
      "paysNais": null
    },
    "dateDeces": null
  },
  "uri_hatvp": null,
  "mandats": {
    "mandat": [
      {
        "@xsi:type": "MandatParlementaire_type",
        "uid": "PM736319",
        "acteurRef": "PA711156",
        "legislature": null,
        "typeOrgane": "SENAT",
        "dateDebut": "2017-10-02T02:00:00.000+02:00",
        "datePublication": null,
        "dateFin": null,
        "preseance": "20",
        "nominPrincipale": "1",
        "infosQualite": {
          "codeQualite": "Sénateur",
          "libQualite": "SENATEUR",
          "libQualiteSex": "SENATEUR"
        },
        "organes": {
          "organeRef": "PO78718"
        },
        "suppleants": null,
        "election": {
          "lieu": {
            "region": null,
            "regionType": null,
            "departement": null,
            "numDepartement": "62",
            "numCirco": null
          },
          "causeMandat": null
        },
        "InfosHorsSIAN": {
          "HATVP_URI": null
        },
        "mandature": {
          "datePriseFonction": null,
          "causeFin": null,
          "premiereElection": null,
          "placeHemicycle": null,
          "mandatRemplaceRef": null
        }
      },
      {
        "@xsi:type": "MandatSimple_Type",
        "uid": "PM715607",
        "acteurRef": "PA711156",
        "legislature": null,
        "typeOrgane": "CMP",
        "dateDebut": "2016-11-23T01:00:00.000+01:00",
        "datePublication": "2016-11-25T01:00:00.000+01:00",
        "dateFin": "2016-12-01T01:00:00.000+01:00",
        "preseance": "20",
        "nominPrincipale": "1",
        "infosQualite": {
          "codeQualite": "Titulaire",
          "libQualite": "Membre titulaire",
          "libQualiteSex": "Membre titulaire"
        },
        "organes": {
          "organeRef": "PO715055"
        }
      },
      {
        "@xsi:type": "MandatSimple_Type",
        "uid": "PM715665",
        "acteurRef": "PA711156",
        "legislature": null,
        "typeOrgane": "CMP",
        "dateDebut": "2016-11-30T01:00:00.000+01:00",
        "datePublication": "2016-12-01T01:00:00.000+01:00",
        "dateFin": "2016-12-01T01:00:00.000+01:00",
        "preseance": "16",
        "nominPrincipale": "1",
        "infosQualite": {
          "codeQualite": "Rapporteur",
          "libQualite": "Rapporteur",
          "libQualiteSex": "Rapporteur"
        },
        "organes": {
          "organeRef": "PO715055"
        }
      },
      {
        "@xsi:type": "MandatParlementaire_type",
        "uid": "PM711160",
        "acteurRef": "PA711156",
        "legislature": null,
        "typeOrgane": "SENAT",
        "dateDebut": "2016-01-12T01:00:00.000+01:00",
        "datePublication": null,
        "dateFin": "2017-10-01T02:00:00.000+02:00",
        "preseance": "20",
        "nominPrincipale": "1",
        "infosQualite": {
          "codeQualite": "Sénateur",
          "libQualite": "SENATEUR",
          "libQualiteSex": "SENATEUR"
        },
        "organes": {
          "organeRef": "PO78718"
        },
        "suppleants": null,
        "election": {
          "lieu": {
            "region": null,
            "regionType": null,
            "departement": null,
            "numDepartement": "62",
            "numCirco": null
          },
          "causeMandat": null
        },
        "InfosHorsSIAN": {
          "HATVP_URI": null
        },
        "mandature": {
          "datePriseFonction": null,
          "causeFin": null,
          "premiereElection": null,
          "placeHemicycle": null,
          "mandatRemplaceRef": null
        }
      },
      {
        "@xsi:type": "MandatSimple_Type",
        "uid": "PM711157",
        "acteurRef": "PA711156",
        "legislature": null,
        "typeOrgane": "COMSENAT",
        "dateDebut": "2016-01-12T01:00:00.000+01:00",
        "datePublication": null,
        "dateFin": "2017-10-03T02:00:00.000+02:00",
        "preseance": "10",
        "nominPrincipale": "1",
        "infosQualite": {
          "codeQualite": "Membre",
          "libQualite": "Membre",
          "libQualiteSex": "Membre"
        },
        "organes": {
          "organeRef": "PO516754"
        }
      },
      {
        "@xsi:type": "MandatSimple_Type",
        "uid": "PM711159",
        "acteurRef": "PA711156",
        "legislature": null,
        "typeOrgane": "GROUPESENAT",
        "dateDebut": "2016-01-12T01:00:00.000+01:00",
        "datePublication": null,
        "dateFin": null,
        "preseance": "4",
        "nominPrincipale": "1",
        "infosQualite": {
          "codeQualite": "Membre",
          "libQualite": "Membre",
          "libQualiteSex": "Membre"
        },
        "organes": {
          "organeRef": "PO286005"
        }
      },
      {
        "@xsi:type": "MandatSimple_Type",
        "uid": "PM712246",
        "acteurRef": "PA711156",
        "legislature": null,
        "typeOrgane": "CMP",
        "dateDebut": "2016-03-31T02:00:00.000+02:00",
        "datePublication": "2016-04-01T02:00:00.000+02:00",
        "dateFin": "2016-04-07T02:00:00.000+02:00",
        "preseance": "28",
        "nominPrincipale": "1",
        "infosQualite": {
          "codeQualite": "Suppléant",
          "libQualite": "Membre suppléant",
          "libQualiteSex": "Membre suppléant"
        },
        "organes": {
          "organeRef": "PO712133"
        }
      },
      {
        "@xsi:type": "MandatSimple_Type",
        "uid": "PM741157",
        "acteurRef": "PA711156",
        "legislature": null,
        "typeOrgane": "COMSENAT",
        "dateDebut": "2017-10-04T02:00:00.000+02:00",
        "datePublication": null,
        "dateFin": null,
        "preseance": "10",
        "nominPrincipale": "1",
        "infosQualite": {
          "codeQualite": "Membre",
          "libQualite": "Membre",
          "libQualiteSex": "Membre"
        },
        "organes": {
          "organeRef": "PO211494"
        }
      },
      {
        "@xsi:type": "MandatSimple_Type",
        "uid": "PM741470",
        "acteurRef": "PA711156",
        "legislature": null,
        "typeOrgane": "DELEGSENAT",
        "dateDebut": "2017-10-18T02:00:00.000+02:00",
        "datePublication": null,
        "dateFin": null,
        "preseance": "4",
        "nominPrincipale": "1",
        "infosQualite": {
          "codeQualite": "Membre",
          "libQualite": "Membre",
          "libQualiteSex": "Membre"
        },
        "organes": {
          "organeRef": "PO436945"
        }
      }
    ]
  }
}