{
  "uid": {
    "@xsi:type": "IdActeur_type",
    "#text": "PA415469"
  },
  "etatCivil": {
    "ident": {
      "civ": "M.",
      "prenom": "René",
      "nom": "Vestri",
      "alpha": "VESTRI RENÉ",
      "trigramme": null
    },
    "infoNaissance": {
      "dateNais": "1938-10-25T00:00:00.000+00:00",
      "villeNais": null,
      "depNais": null,
      "paysNais": null
    },
    "dateDeces": "2013-02-06T01:00:00.000+01:00"
  },
  "mandats": {
    "mandat": [
      {
        "@xsi:type": "MandatSimple_Type",
        "uid": "PM421656",
        "acteurRef": "PA415469",
        "legislature": null,
        "typeOrgane": "DELEGSENAT",
        "dateDebut": "2009-09-23T02:00:00.000+02:00",
        "datePublication": null,
        "dateFin": "2013-02-06T01:00:00.000+01:00",
        "preseance": "4",
        "nominPrincipale": "1",
        "infosQualite": {
          "codeQualite": "Membre",
          "libQualite": "Membre",
          "libQualiteSex": "Membre"
        },
        "organes": {
          "organeRef": "PO420387"
        }
      },
      {
        "@xsi:type": "MandatSimple_Type",
        "uid": "PM437054",
        "acteurRef": "PA415469",
        "legislature": null,
        "typeOrgane": "DELEGSENAT",
        "dateDebut": "2011-11-30T01:00:00.000+01:00",
        "datePublication": null,
        "dateFin": "2013-02-06T01:00:00.000+01:00",
        "preseance": "4",
        "nominPrincipale": "1",
        "infosQualite": {
          "codeQualite": "Membre",
          "libQualite": "Membre",
          "libQualiteSex": "Membre"
        },
        "organes": {
          "organeRef": "PO420388"
        }
      },
      {
        "@xsi:type": "MandatSimple_Type",
        "uid": "PM516842",
        "acteurRef": "PA415469",
        "legislature": null,
        "typeOrgane": "COMSENAT",
        "dateDebut": "2012-02-21T01:00:00.000+01:00",
        "datePublication": null,
        "dateFin": "2013-02-06T01:00:00.000+01:00",
        "preseance": "10",
        "nominPrincipale": "1",
        "infosQualite": {
          "codeQualite": "Membre",
          "libQualite": "Membre",
          "libQualiteSex": "Membre"
        },
        "organes": {
          "organeRef": "PO516754"
        }
      },
      {
        "@xsi:type": "MandatParlementaire_type",
        "uid": "PM415560",
        "acteurRef": "PA415469",
        "legislature": null,
        "typeOrgane": "SENAT",
        "dateDebut": "2008-10-01T02:00:00.000+02:00",
        "datePublication": null,
        "dateFin": "2013-02-06T01:00:00.000+01:00",
        "preseance": "20",
        "nominPrincipale": "1",
        "infosQualite": {
          "codeQualite": "Sénateur",
          "libQualite": "SENATEUR",
          "libQualiteSex": "SENATEUR"
        },
        "organes": {
          "organeRef": "PO78718"
        },
        "suppleants": null,
        "election": {
          "lieu": {
            "region": null,
            "regionType": null,
            "departement": null,
            "numDepartement": "06",
            "numCirco": null
          },
          "causeMandat": null
        },
        "InfosHorsSIAN": {
          "HATVP_URI": null
        },
        "mandature": {
          "datePriseFonction": null,
          "causeFin": null,
          "premiereElection": null,
          "placeHemicycle": null,
          "mandatRemplaceRef": null
        }
      },
      {
        "@xsi:type": "MandatSimple_Type",
        "uid": "PM415802",
        "acteurRef": "PA415469",
        "legislature": null,
        "typeOrgane": "GROUPESENAT",
        "dateDebut": "2008-10-01T02:00:00.000+02:00",
        "datePublication": null,
        "dateFin": "2013-02-06T01:00:00.000+01:00",
        "preseance": "4",
        "nominPrincipale": "1",
        "infosQualite": {
          "codeQualite": "Membre",
          "libQualite": "Membre",
          "libQualiteSex": "Membre"
        },
        "organes": {
          "organeRef": "PO286005"
        }
      }
    ]
  }
}