{
  "@xsi:type": "OrganeParlementaire_Type",
  "uid": "PO703211",
  "codeType": "MISINFO",
  "libelle": "Professions juridiques réglementées",
  "libelleEdition": "de la mission d'information sur les professions juridiques réglementées",
  "libelleAbrege": "Professions juridiques réglementées",
  "libelleAbrev": "JURID",
  "viMoDe": {
    "dateDebut": "2014-09-17T02:00:00.000+02:00",
    "dateAgrement": null,
    "dateFin": "2014-12-17T01:00:00.000+01:00"
  },
  "regime": "5ème République",
  "legislature": "14",
  "secretariat": {
    "secretaire01": null,
    "secretaire02": null
  }
}