{
  "@xsi:type": "OrganeExterne_Type",
  "uid": "PO653265",
  "codeType": "MINISTERE",
  "libelle": "Ministère de l'artisanat, du commerce et du tourisme",
  "libelleEdition": "de l'artisanat, du commerce et du tourisme",
  "libelleAbrege": "Artisanat, commerce et tourisme",
  "libelleAbrev": "ACT",
  "viMoDe": {
    "dateDebut": "2012-06-22T02:00:00.000+02:00",
    "dateAgrement": null,
    "dateFin": "2014-03-31T02:00:00.000+02:00"
  }
}