{
  "@xsi:type": "OrganeParlementaire_Type",
  "uid": "PO686844",
  "codeType": "GE",
  "libelle": "Industries mécaniques",
  "libelleEdition": "Industries mécaniques",
  "libelleAbrege": "Industries mécaniques",
  "libelleAbrev": "INDUSMECA",
  "viMoDe": {
    "dateDebut": null,
    "dateAgrement": "2012-11-14T01:00:00.000+01:00",
    "dateFin": "2017-06-20T02:00:00.000+02:00"
  },
  "regime": "5ème République",
  "legislature": "14",
  "secretariat": {
    "secretaire01": null,
    "secretaire02": null
  }
}