{
  "@xsi:type": "OrganeExterne_Type",
  "uid": "PO711563",
  "codeType": "MINISTERE",
  "libelle": "Ministère des affaires sociales et de la santé",
  "libelleEdition": "des affaires sociales et de la santé",
  "libelleAbrege": "Affaires sociales et santé",
  "libelleAbrev": "ASO",
  "viMoDe": {
    "dateDebut": "2016-02-12T01:00:00.000+01:00",
    "dateAgrement": null,
    "dateFin": "2016-12-06T01:00:00.000+01:00"
  }
}