{
  "@xsi:type": "OrganeExterne_Type",
  "uid": "PO715948",
  "codeType": "MINISTERE",
  "libelle": "Secrétariat d'État, auprès du ministère des affaires sociales et de la santé, chargé des personnes âgées et de l'autonomie",
  "libelleEdition": ", auprès de la ministre des affaires sociales et de la santé, chargée des personnes âgées et de l'autonomie",
  "libelleAbrege": "Personnes âgées et autonomie",
  "libelleAbrev": "AGE",
  "viMoDe": {
    "dateDebut": "2016-12-07T01:00:00.000+01:00",
    "dateAgrement": null,
    "dateFin": "2017-05-17T02:00:00.000+02:00"
  }
}