{
  "@xsi:type": "OrganeExterne_Type",
  "uid": "PO701709",
  "codeType": "MINISTERE",
  "libelle": "Secrétariat d'État, auprès du Premier ministre, chargé de la réforme de l'État et de la simplification",
  "libelleEdition": ", auprès du Premier ministre, chargé de la réforme de l'État et de la simplification",
  "libelleAbrege": "Réforme de l'État et simplification",
  "libelleAbrev": "REF",
  "viMoDe": {
    "dateDebut": "2014-06-04T02:00:00.000+02:00",
    "dateAgrement": null,
    "dateFin": "2014-08-26T02:00:00.000+02:00"
  }
}