{
  "uid": {
    "@xsi:type": "IdActeur_type",
    "#text": "PA227094"
  },
  "etatCivil": {
    "ident": {
      "civ": "M.",
      "prenom": "Bruno",
      "nom": "Sido",
      "alpha": "SIDO",
      "trigramme": null
    },
    "infoNaissance": {
      "dateNais": "1951-02-19T01:00:00.000+01:00",
      "villeNais": null,
      "depNais": null,
      "paysNais": null
    },
    "dateDeces": null
  },
  "uri_hatvp": null,
  "mandats": {
    "mandat": [
      {
        "@xsi:type": "MandatSimple_Type",
        "uid": "PM286571",
        "acteurRef": "PA227094",
        "legislature": null,
        "typeOrgane": "GROUPESENAT",
        "dateDebut": "2002-12-11T01:00:00.000+01:00",
        "datePublication": "2002-12-11T01:00:00.000+01:00",
        "dateFin": null,
        "preseance": "4",
        "nominPrincipale": "1",
        "infosQualite": {
          "codeQualite": "Membre",
          "libQualite": "Membre",
          "libQualiteSex": "Membre"
        },
        "organes": {
          "organeRef": "PO286005"
        }
      },
      {
        "@xsi:type": "MandatSimple_Type",
        "uid": "PM421680",
        "acteurRef": "PA227094",
        "legislature": null,
        "typeOrgane": "DELEGSENAT",
        "dateDebut": "2009-09-23T02:00:00.000+02:00",
        "datePublication": null,
        "dateFin": null,
        "preseance": "4",
        "nominPrincipale": "1",
        "infosQualite": {
          "codeQualite": "Membre",
          "libQualite": "Membre",
          "libQualiteSex": "Membre"
        },
        "organes": {
          "organeRef": "PO420387"
        }
      },
      {
        "@xsi:type": "MandatSimple_Type",
        "uid": "PM421940",
        "acteurRef": "PA227094",
        "legislature": null,
        "typeOrgane": "DELEGSENAT",
        "dateDebut": "2009-10-07T02:00:00.000+02:00",
        "datePublication": null,
        "dateFin": null,
        "preseance": null,
        "nominPrincipale": "1",
        "infosQualite": {
          "codeQualite": null,
          "libQualite": "Vice-Président",
          "libQualiteSex": "Vice-Président"
        },
        "organes": {
          "organeRef": "PO420387"
        }
      },
      {
        "@xsi:type": "MandatParlementaire_type",
        "uid": "PM429960",
        "acteurRef": "PA227094",
        "legislature": null,
        "typeOrgane": "SENAT",
        "dateDebut": "2011-10-01T02:00:00.000+02:00",
        "datePublication": null,
        "dateFin": "2017-10-01T02:00:00.000+02:00",
        "preseance": "20",
        "nominPrincipale": "1",
        "infosQualite": {
          "codeQualite": "Sénateur",
          "libQualite": "SENATEUR",
          "libQualiteSex": "SENATEUR"
        },
        "organes": {
          "organeRef": "PO78718"
        },
        "suppleants": null,
        "election": {
          "lieu": {
            "region": null,
            "regionType": null,
            "departement": null,
            "numDepartement": "52",
            "numCirco": null
          },
          "causeMandat": null
        },
        "InfosHorsSIAN": {
          "HATVP_URI": null
        },
        "mandature": {
          "datePriseFonction": null,
          "causeFin": null,
          "premiereElection": null,
          "placeHemicycle": null,
          "mandatRemplaceRef": null
        }
      },
      {
        "@xsi:type": "MandatAvecSuppleant_Type",
        "uid": "PM434690",
        "acteurRef": "PA227094",
        "legislature": null,
        "typeOrgane": "OFFPAR",
        "dateDebut": "2011-11-30T01:00:00.000+01:00",
        "datePublication": "2011-12-01T01:00:00.000+01:00",
        "dateFin": "2017-10-01T02:00:00.000+02:00",
        "preseance": "24",
        "nominPrincipale": "1",
        "infosQualite": {
          "codeQualite": "Membre",
          "libQualite": "Membre",
          "libQualiteSex": "Membre"
        },
        "organes": {
          "organeRef": "PO273589"
        },
        "suppleants": null
      },
      {
        "@xsi:type": "MandatAvecSuppleant_Type",
        "uid": "PM472312",
        "acteurRef": "PA227094",
        "legislature": null,
        "typeOrgane": "OFFPAR",
        "dateDebut": "2012-01-10T01:00:00.000+01:00",
        "datePublication": "2012-01-11T01:00:00.000+01:00",
        "dateFin": "2014-11-05T01:00:00.000+01:00",
        "preseance": "4",
        "nominPrincipale": "1",
        "infosQualite": {
          "codeQualite": "Président",
          "libQualite": "Président",
          "libQualiteSex": "Président"
        },
        "organes": {
          "organeRef": "PO273589"
        },
        "suppleants": null
      },
      {
        "@xsi:type": "MandatSimple_Type",
        "uid": "PM516829",
        "acteurRef": "PA227094",
        "legislature": null,
        "typeOrgane": "COMSENAT",
        "dateDebut": "2012-02-21T01:00:00.000+01:00",
        "datePublication": null,
        "dateFin": "2014-10-07T02:00:00.000+02:00",
        "preseance": null,
        "nominPrincipale": "1",
        "infosQualite": {
          "codeQualite": null,
          "libQualite": "Secrétaire",
          "libQualiteSex": "Secrétaire"
        },
        "organes": {
          "organeRef": "PO516753"
        }
      },
      {
        "@xsi:type": "MandatParlementaire_type",
        "uid": "PM736386",
        "acteurRef": "PA227094",
        "legislature": null,
        "typeOrgane": "SENAT",
        "dateDebut": "2017-10-02T02:00:00.000+02:00",
        "datePublication": null,
        "dateFin": null,
        "preseance": "20",
        "nominPrincipale": "1",
        "infosQualite": {
          "codeQualite": "Sénateur",
          "libQualite": "SENATEUR",
          "libQualiteSex": "SENATEUR"
        },
        "organes": {
          "organeRef": "PO78718"
        },
        "suppleants": null,
        "election": {
          "lieu": {
            "region": null,
            "regionType": null,
            "departement": null,
            "numDepartement": "52",
            "numCirco": null
          },
          "causeMandat": null
        },
        "InfosHorsSIAN": {
          "HATVP_URI": null
        },
        "mandature": {
          "datePriseFonction": null,
          "causeFin": null,
          "premiereElection": null,
          "placeHemicycle": null,
          "mandatRemplaceRef": null
        }
      },
      {
        "@xsi:type": "MandatSimple_Type",
        "uid": "PM713829",
        "acteurRef": "PA227094",
        "legislature": null,
        "typeOrgane": "CMP",
        "dateDebut": "2016-06-01T02:00:00.000+02:00",
        "datePublication": "2016-06-17T02:00:00.000+02:00",
        "dateFin": "2016-06-30T02:00:00.000+02:00",
        "preseance": "28",
        "nominPrincipale": "1",
        "infosQualite": {
          "codeQualite": "Suppléant",
          "libQualite": "Membre suppléant",
          "libQualiteSex": "Membre suppléant"
        },
        "organes": {
          "organeRef": "PO712731"
        }
      },
      {
        "@xsi:type": "MandatSimple_Type",
        "uid": "PM701348",
        "acteurRef": "PA227094",
        "legislature": null,
        "typeOrgane": "CMP",
        "dateDebut": "2014-05-14T02:00:00.000+02:00",
        "datePublication": "2014-05-15T02:00:00.000+02:00",
        "dateFin": "2014-06-10T02:00:00.000+02:00",
        "preseance": "28",
        "nominPrincipale": "1",
        "infosQualite": {
          "codeQualite": "Suppléant",
          "libQualite": "Membre suppléant",
          "libQualiteSex": "Membre suppléant"
        },
        "organes": {
          "organeRef": "PO700965"
        }
      },
      {
        "@xsi:type": "MandatSimple_Type",
        "uid": "PM701997",
        "acteurRef": "PA227094",
        "legislature": null,
        "typeOrgane": "COMSPSENAT",
        "dateDebut": "2014-06-18T02:00:00.000+02:00",
        "datePublication": null,
        "dateFin": "2014-06-22T02:00:00.000+02:00",
        "preseance": null,
        "nominPrincipale": "1",
        "infosQualite": {
          "codeQualite": null,
          "libQualite": "Membre",
          "libQualiteSex": "Membre"
        },
        "organes": {
          "organeRef": "PO701979"
        }
      },
      {
        "@xsi:type": "MandatSimple_Type",
        "uid": "PM702029",
        "acteurRef": "PA227094",
        "legislature": null,
        "typeOrgane": "COMSPSENAT",
        "dateDebut": "2014-06-23T02:00:00.000+02:00",
        "datePublication": null,
        "dateFin": "2015-01-17T01:00:00.000+01:00",
        "preseance": null,
        "nominPrincipale": "1",
        "infosQualite": {
          "codeQualite": null,
          "libQualite": "Vice-Président",
          "libQualiteSex": "Vice-Président"
        },
        "organes": {
          "organeRef": "PO701979"
        }
      },
      {
        "@xsi:type": "MandatSimple_Type",
        "uid": "PM704099",
        "acteurRef": "PA227094",
        "legislature": null,
        "typeOrgane": "COMSENAT",
        "dateDebut": "2014-10-08T02:00:00.000+02:00",
        "datePublication": null,
        "dateFin": "2014-10-08T02:00:00.000+02:00",
        "preseance": "10",
        "nominPrincipale": "1",
        "infosQualite": {
          "codeQualite": "Membre",
          "libQualite": "Membre",
          "libQualiteSex": "Membre"
        },
        "organes": {
          "organeRef": "PO516753"
        }
      },
      {
        "@xsi:type": "MandatSimple_Type",
        "uid": "PM704200",
        "acteurRef": "PA227094",
        "legislature": null,
        "typeOrgane": "COMSENAT",
        "dateDebut": "2014-10-09T02:00:00.000+02:00",
        "datePublication": null,
        "dateFin": "2017-10-03T02:00:00.000+02:00",
        "preseance": null,
        "nominPrincipale": "1",
        "infosQualite": {
          "codeQualite": null,
          "libQualite": "Secrétaire",
          "libQualiteSex": "Secrétaire"
        },
        "organes": {
          "organeRef": "PO516753"
        }
      },
      {
        "@xsi:type": "MandatAvecSuppleant_Type",
        "uid": "PM704501",
        "acteurRef": "PA227094",
        "legislature": null,
        "typeOrgane": "OFFPAR",
        "dateDebut": "2014-11-04T01:00:00.000+01:00",
        "datePublication": "2014-11-05T01:00:00.000+01:00",
        "dateFin": "2017-10-01T02:00:00.000+02:00",
        "preseance": "5",
        "nominPrincipale": "1",
        "infosQualite": {
          "codeQualite": "Premier Vice-Président",
          "libQualite": "Premier Vice-Président",
          "libQualiteSex": "Premier Vice-Président"
        },
        "organes": {
          "organeRef": "PO273589"
        },
        "suppleants": null
      },
      {
        "@xsi:type": "MandatSimple_Type",
        "uid": "PM716479",
        "acteurRef": "PA227094",
        "legislature": null,
        "typeOrgane": "CMP",
        "dateDebut": "2017-01-11T01:00:00.000+01:00",
        "datePublication": "2017-01-13T01:00:00.000+01:00",
        "dateFin": "2017-01-20T01:00:00.000+01:00",
        "preseance": "28",
        "nominPrincipale": "1",
        "infosQualite": {
          "codeQualite": "Suppléant",
          "libQualite": "Membre suppléant",
          "libQualiteSex": "Membre suppléant"
        },
        "organes": {
          "organeRef": "PO716327"
        }
      },
      {
        "@xsi:type": "MandatSimple_Type",
        "uid": "PM741183",
        "acteurRef": "PA227094",
        "legislature": null,
        "typeOrgane": "COMSENAT",
        "dateDebut": "2017-10-04T02:00:00.000+02:00",
        "datePublication": null,
        "dateFin": null,
        "preseance": "10",
        "nominPrincipale": "1",
        "infosQualite": {
          "codeQualite": "Membre",
          "libQualite": "Membre",
          "libQualiteSex": "Membre"
        },
        "organes": {
          "organeRef": "PO211491"
        }
      },
      {
        "@xsi:type": "MandatAvecSuppleant_Type",
        "uid": "PM742807",
        "acteurRef": "PA227094",
        "legislature": null,
        "typeOrgane": "OFFPAR",
        "dateDebut": "2017-11-09T01:00:00.000+01:00",
        "datePublication": "2017-11-10T01:00:00.000+01:00",
        "dateFin": null,
        "preseance": "24",
        "nominPrincipale": "1",
        "infosQualite": {
          "codeQualite": "Membre",
          "libQualite": "Membre",
          "libQualiteSex": "Membre"
        },
        "organes": {
          "organeRef": "PO273589"
        },
        "suppleants": null
      }
    ]
  }
}