{
  "uid": {
    "@xsi:type": "IdActeur_type",
    "#text": "PA230329"
  },
  "etatCivil": {
    "ident": {
      "civ": "M.",
      "prenom": "Jean-François",
      "nom": "Lamour",
      "alpha": "Lamour J",
      "trigramme": null
    },
    "infoNaissance": {
      "dateNais": "1956-02-02T01:00:00.000+01:00",
      "villeNais": "Paris",
      "depNais": "Paris",
      "paysNais": "France"
    },
    "dateDeces": null
  },
  "uri_hatvp": null,
  "mandats": {
    "mandat": [
      {
        "@xsi:type": "MandatParlementaire_type",
        "uid": "PM645079",
        "acteurRef": "PA230329",
        "legislature": "14",
        "typeOrgane": "ASSEMBLEE",
        "dateDebut": "2012-06-20T02:00:00.000+02:00",
        "datePublication": null,
        "dateFin": "2017-06-20T02:00:00.000+02:00",
        "preseance": "50",
        "nominPrincipale": "1",
        "infosQualite": {
          "codeQualite": "membre",
          "libQualite": "membre",
          "libQualiteSex": "membre"
        },
        "organes": {
          "organeRef": "PO644420"
        },
        "suppleants": {
          "suppleant": {
            "dateDebut": "2012-06-20T02:00:00.000+02:00",
            "dateFin": "2017-06-20T02:00:00.000+02:00",
            "suppleantRef": "PA642939"
          }
        },
        "election": {
          "lieu": {
            "region": "Ile-de-France",
            "regionType": "Métropolitain",
            "departement": "Paris",
            "numDepartement": "75",
            "numCirco": "13"
          },
          "causeMandat": "élections générales",
          "refCirconscription": "PO644828"
        },
        "mandature": {
          "datePriseFonction": "2012-06-20T02:00:00.000+02:00",
          "causeFin": "Fin de législature",
          "premiereElection": "1",
          "placeHemicycle": null,
          "mandatRemplaceRef": null
        }
      },
      {
        "@xsi:type": "MandatSimple_Type",
        "uid": "PM656424",
        "acteurRef": "PA230329",
        "legislature": "14",
        "typeOrgane": "GP",
        "dateDebut": "2012-06-26T02:00:00.000+02:00",
        "datePublication": "2012-06-27T02:00:00.000+02:00",
        "dateFin": "2012-11-27T01:00:00.000+01:00",
        "preseance": "20",
        "nominPrincipale": "1",
        "infosQualite": {
          "codeQualite": "Membre",
          "libQualite": "Membre du",
          "libQualiteSex": "Membre du"
        },
        "organes": {
          "organeRef": "PO656006"
        }
      },
      {
        "@xsi:type": "MandatSimple_Type",
        "uid": "PM657001",
        "acteurRef": "PA230329",
        "legislature": "14",
        "typeOrgane": "COMPER",
        "dateDebut": "2012-06-28T02:00:00.000+02:00",
        "datePublication": "2012-06-28T02:00:00.000+02:00",
        "dateFin": "2016-03-23T01:00:00.000+01:00",
        "preseance": "32",
        "nominPrincipale": "1",
        "infosQualite": {
          "codeQualite": "Membre",
          "libQualite": "Membre",
          "libQualiteSex": "Membre"
        },
        "organes": {
          "organeRef": "PO59048"
        }
      },
      {
        "@xsi:type": "MandatSimple_Type",
        "uid": "PM678825",
        "acteurRef": "PA230329",
        "legislature": "14",
        "typeOrgane": "ORGEXTPARL",
        "dateDebut": "2012-09-28T02:00:00.000+02:00",
        "datePublication": "2012-09-29T02:00:00.000+02:00",
        "dateFin": "2016-11-03T01:00:00.000+01:00",
        "preseance": "30",
        "nominPrincipale": "1",
        "infosQualite": {
          "codeQualite": "Suppléant",
          "libQualite": "Membre suppléant",
          "libQualiteSex": "Membre suppléant"
        },
        "organes": {
          "organeRef": "PO427716"
        }
      },
      {
        "@xsi:type": "MandatSimple_Type",
        "uid": "PM680398",
        "acteurRef": "PA230329",
        "legislature": "14",
        "typeOrgane": "GA",
        "dateDebut": "2012-10-12T02:00:00.000+02:00",
        "datePublication": null,
        "dateFin": "2017-06-20T02:00:00.000+02:00",
        "preseance": "20",
        "nominPrincipale": "1",
        "infosQualite": {
          "codeQualite": "Membre",
          "libQualite": "Membre",
          "libQualiteSex": "Membre"
        },
        "organes": {
          "organeRef": "PO675722"
        }
      },
      {
        "@xsi:type": "MandatSimple_Type",
        "uid": "PM680399",
        "acteurRef": "PA230329",
        "legislature": "14",
        "typeOrgane": "GA",
        "dateDebut": "2012-10-12T02:00:00.000+02:00",
        "datePublication": null,
        "dateFin": "2017-06-20T02:00:00.000+02:00",
        "preseance": "20",
        "nominPrincipale": "1",
        "infosQualite": {
          "codeQualite": "Membre",
          "libQualite": "Membre",
          "libQualiteSex": "Membre"
        },
        "organes": {
          "organeRef": "PO675762"
        }
      },
      {
        "@xsi:type": "MandatSimple_Type",
        "uid": "PM685003",
        "acteurRef": "PA230329",
        "legislature": "14",
        "typeOrgane": "GP",
        "dateDebut": "2012-11-27T01:00:00.000+01:00",
        "datePublication": "2012-11-28T01:00:00.000+01:00",
        "dateFin": "2013-01-15T01:00:00.000+01:00",
        "preseance": "20",
        "nominPrincipale": "1",
        "infosQualite": {
          "codeQualite": "Membre",
          "libQualite": "Membre du",
          "libQualiteSex": "Membre du"
        },
        "organes": {
          "organeRef": "PO684957"
        }
      },
      {
        "@xsi:type": "MandatSimple_Type",
        "uid": "PM685522",
        "acteurRef": "PA230329",
        "legislature": null,
        "typeOrgane": "PARPOL",
        "dateDebut": "2012-12-01T01:00:00.000+01:00",
        "datePublication": null,
        "dateFin": "2015-11-30T01:00:00.000+01:00",
        "preseance": "5",
        "nominPrincipale": "1",
        "infosQualite": {
          "codeQualite": "Membre",
          "libQualite": "Membre",
          "libQualiteSex": "Membre"
        },
        "organes": {
          "organeRef": "PO684942"
        }
      },
      {
        "@xsi:type": "MandatSimple_Type",
        "uid": "PM686640",
        "acteurRef": "PA230329",
        "legislature": "14",
        "typeOrgane": "CMP",
        "dateDebut": "2012-12-12T01:00:00.000+01:00",
        "datePublication": "2012-12-13T01:00:00.000+01:00",
        "dateFin": "2012-12-20T01:00:00.000+01:00",
        "preseance": "20",
        "nominPrincipale": "1",
        "infosQualite": {
          "codeQualite": "Titulaire",
          "libQualite": "Membre titulaire",
          "libQualiteSex": "Membre titulaire"
        },
        "organes": {
          "organeRef": "PO686310"
        }
      },
      {
        "@xsi:type": "MandatSimple_Type",
        "uid": "PM687969",
        "acteurRef": "PA230329",
        "legislature": "14",
        "typeOrgane": "GP",
        "dateDebut": "2013-01-16T01:00:00.000+01:00",
        "datePublication": "2013-01-16T01:00:00.000+01:00",
        "dateFin": "2015-06-01T02:00:00.000+02:00",
        "preseance": "20",
        "nominPrincipale": "1",
        "infosQualite": {
          "codeQualite": "Membre",
          "libQualite": "Membre du",
          "libQualiteSex": "Membre du"
        },
        "organes": {
          "organeRef": "PO656006"
        }
      },
      {
        "@xsi:type": "MandatSimple_Type",
        "uid": "PM689368",
        "acteurRef": "PA230329",
        "legislature": "14",
        "typeOrgane": "GE",
        "dateDebut": "2013-01-23T01:00:00.000+01:00",
        "datePublication": null,
        "dateFin": "2017-06-20T02:00:00.000+02:00",
        "preseance": "20",
        "nominPrincipale": "0",
        "infosQualite": {
          "codeQualite": "Membre",
          "libQualite": "Membre",
          "libQualiteSex": "Membre"
        },
        "organes": {
          "organeRef": "PO687076"
        }
      },
      {
        "@xsi:type": "MandatSimple_Type",
        "uid": "PM689406",
        "acteurRef": "PA230329",
        "legislature": "14",
        "typeOrgane": "GE",
        "dateDebut": "2013-01-23T01:00:00.000+01:00",
        "datePublication": null,
        "dateFin": "2017-06-20T02:00:00.000+02:00",
        "preseance": "12",
        "nominPrincipale": "1",
        "infosQualite": {
          "codeQualite": "Secrétaire",
          "libQualite": "Secrétaire",
          "libQualiteSex": "Secrétaire"
        },
        "organes": {
          "organeRef": "PO687076"
        }
      },
      {
        "@xsi:type": "MandatSimple_Type",
        "uid": "PM692688",
        "acteurRef": "PA230329",
        "legislature": "14",
        "typeOrgane": "GE",
        "dateDebut": "2013-03-14T01:00:00.000+01:00",
        "datePublication": null,
        "dateFin": "2017-06-20T02:00:00.000+02:00",
        "preseance": "20",
        "nominPrincipale": "1",
        "infosQualite": {
          "codeQualite": "Membre",
          "libQualite": "Membre",
          "libQualiteSex": "Membre"
        },
        "organes": {
          "organeRef": "PO686835"
        }
      },
      {
        "@xsi:type": "MandatSimple_Type",
        "uid": "PM695757",
        "acteurRef": "PA230329",
        "legislature": "14",
        "typeOrgane": "CMP",
        "dateDebut": "2013-07-03T02:00:00.000+02:00",
        "datePublication": "2013-07-04T02:00:00.000+02:00",
        "dateFin": "2013-07-18T02:00:00.000+02:00",
        "preseance": "20",
        "nominPrincipale": "1",
        "infosQualite": {
          "codeQualite": "Titulaire",
          "libQualite": "Membre titulaire",
          "libQualiteSex": "Membre titulaire"
        },
        "organes": {
          "organeRef": "PO695634"
        }
      },
      {
        "@xsi:type": "MandatSimple_Type",
        "uid": "PM698534",
        "acteurRef": "PA230329",
        "legislature": "14",
        "typeOrgane": "GE",
        "dateDebut": "2013-11-14T01:00:00.000+01:00",
        "datePublication": null,
        "dateFin": "2017-06-20T02:00:00.000+02:00",
        "preseance": "20",
        "nominPrincipale": "1",
        "infosQualite": {
          "codeQualite": "Membre",
          "libQualite": "Membre",
          "libQualiteSex": "Membre"
        },
        "organes": {
          "organeRef": "PO695593"
        }
      },
      {
        "@xsi:type": "MandatSimple_Type",
        "uid": "PM698872",
        "acteurRef": "PA230329",
        "legislature": "14",
        "typeOrgane": "CMP",
        "dateDebut": "2013-12-04T01:00:00.000+01:00",
        "datePublication": "2013-12-05T01:00:00.000+01:00",
        "dateFin": "2014-01-02T01:00:00.000+01:00",
        "preseance": "28",
        "nominPrincipale": "1",
        "infosQualite": {
          "codeQualite": "Suppléant",
          "libQualite": "Membre suppléant",
          "libQualiteSex": "Membre suppléant"
        },
        "organes": {
          "organeRef": "PO698794"
        }
      },
      {
        "@xsi:type": "MandatMission_Type",
        "uid": "PM699434",
        "acteurRef": "PA230329",
        "legislature": "14",
        "typeOrgane": "MISINFOPRE",
        "dateDebut": "2014-01-14T01:00:00.000+01:00",
        "datePublication": "2014-01-15T01:00:00.000+01:00",
        "dateFin": "2014-10-28T01:00:00.000+01:00",
        "preseance": "20",
        "nominPrincipale": "1",
        "infosQualite": {
          "codeQualite": "Membre",
          "libQualite": "Membre",
          "libQualiteSex": "Membre"
        },
        "organes": {
          "organeRef": "PO699419"
        },
        "libelle": null
      },
      {
        "@xsi:type": "MandatMission_Type",
        "uid": "PM699743",
        "acteurRef": "PA230329",
        "legislature": "14",
        "typeOrgane": "MISINFOPRE",
        "dateDebut": "2014-01-22T01:00:00.000+01:00",
        "datePublication": "2014-01-23T01:00:00.000+01:00",
        "dateFin": "2014-10-28T01:00:00.000+01:00",
        "preseance": "4",
        "nominPrincipale": "1",
        "infosQualite": {
          "codeQualite": "Vice-Président",
          "libQualite": "Vice-Président",
          "libQualiteSex": "Vice-Président"
        },
        "organes": {
          "organeRef": "PO699419"
        },
        "libelle": null
      },
      {
        "@xsi:type": "MandatSimple_Type",
        "uid": "PM702361",
        "acteurRef": "PA230329",
        "legislature": "14",
        "typeOrgane": "CMP",
        "dateDebut": "2014-07-09T02:00:00.000+02:00",
        "datePublication": "2014-07-10T02:00:00.000+02:00",
        "dateFin": "2014-07-23T02:00:00.000+02:00",
        "preseance": "20",
        "nominPrincipale": "1",
        "infosQualite": {
          "codeQualite": "Titulaire",
          "libQualite": "Membre titulaire",
          "libQualiteSex": "Membre titulaire"
        },
        "organes": {
          "organeRef": "PO702354"
        }
      },
      {
        "@xsi:type": "MandatSimple_Type",
        "uid": "PM702559",
        "acteurRef": "PA230329",
        "legislature": "14",
        "typeOrgane": "CMP",
        "dateDebut": "2014-07-16T02:00:00.000+02:00",
        "datePublication": "2014-07-17T02:00:00.000+02:00",
        "dateFin": "2014-07-23T02:00:00.000+02:00",
        "preseance": "28",
        "nominPrincipale": "1",
        "infosQualite": {
          "codeQualite": "Suppléant",
          "libQualite": "Membre suppléant",
          "libQualiteSex": "Membre suppléant"
        },
        "organes": {
          "organeRef": "PO702527"
        }
      },
      {
        "@xsi:type": "MandatSimple_Type",
        "uid": "PM702752",
        "acteurRef": "PA230329",
        "legislature": "14",
        "typeOrgane": "GE",
        "dateDebut": "2014-07-23T02:00:00.000+02:00",
        "datePublication": null,
        "dateFin": "2017-06-20T02:00:00.000+02:00",
        "preseance": "20",
        "nominPrincipale": "1",
        "infosQualite": {
          "codeQualite": "Membre",
          "libQualite": "Membre",
          "libQualiteSex": "Membre"
        },
        "organes": {
          "organeRef": "PO702209"
        }
      },
      {
        "@xsi:type": "MandatSimple_Type",
        "uid": "PM705517",
        "acteurRef": "PA230329",
        "legislature": "14",
        "typeOrgane": "GE",
        "dateDebut": "2014-12-16T01:00:00.000+01:00",
        "datePublication": null,
        "dateFin": "2017-06-20T02:00:00.000+02:00",
        "preseance": "20",
        "nominPrincipale": "1",
        "infosQualite": {
          "codeQualite": "Membre",
          "libQualite": "Membre",
          "libQualiteSex": "Membre"
        },
        "organes": {
          "organeRef": "PO704831"
        }
      },
      {
        "@xsi:type": "MandatSimple_Type",
        "uid": "PM707960",
        "acteurRef": "PA230329",
        "legislature": "14",
        "typeOrgane": "GP",
        "dateDebut": "2015-06-02T02:00:00.000+02:00",
        "datePublication": "2015-06-02T02:00:00.000+02:00",
        "dateFin": "2017-06-20T02:00:00.000+02:00",
        "preseance": "20",
        "nominPrincipale": "1",
        "infosQualite": {
          "codeQualite": "Membre",
          "libQualite": "Membre du",
          "libQualiteSex": "Membre du"
        },
        "organes": {
          "organeRef": "PO707869"
        }
      },
      {
        "@xsi:type": "MandatSimple_Type",
        "uid": "PM710509",
        "acteurRef": "PA230329",
        "legislature": null,
        "typeOrgane": "PARPOL",
        "dateDebut": "2015-12-01T01:00:00.000+01:00",
        "datePublication": null,
        "dateFin": "2017-06-20T02:00:00.000+02:00",
        "preseance": "5",
        "nominPrincipale": "1",
        "infosQualite": {
          "codeQualite": "Membre",
          "libQualite": "Membre",
          "libQualiteSex": "Membre"
        },
        "organes": {
          "organeRef": "PO710396"
        }
      },
      {
        "@xsi:type": "MandatSimple_Type",
        "uid": "PM710684",
        "acteurRef": "PA230329",
        "legislature": "14",
        "typeOrgane": "CMP",
        "dateDebut": "2015-12-09T01:00:00.000+01:00",
        "datePublication": "2015-12-10T01:00:00.000+01:00",
        "dateFin": "2015-12-11T01:00:00.000+01:00",
        "preseance": "28",
        "nominPrincipale": "1",
        "infosQualite": {
          "codeQualite": "Suppléant",
          "libQualite": "Membre suppléant",
          "libQualiteSex": "Membre suppléant"
        },
        "organes": {
          "organeRef": "PO710669"
        }
      },
      {
        "@xsi:type": "MandatMission_Type",
        "uid": "PM710730",
        "acteurRef": "PA230329",
        "legislature": "14",
        "typeOrgane": "MISINFOPRE",
        "dateDebut": "2015-12-10T01:00:00.000+01:00",
        "datePublication": "2015-12-11T01:00:00.000+01:00",
        "dateFin": "2016-07-20T02:00:00.000+02:00",
        "preseance": "20",
        "nominPrincipale": "1",
        "infosQualite": {
          "codeQualite": "Membre",
          "libQualite": "Membre",
          "libQualiteSex": "Membre"
        },
        "organes": {
          "organeRef": "PO710376"
        },
        "libelle": null
      },
      {
        "@xsi:type": "MandatSimple_Type",
        "uid": "PM712110",
        "acteurRef": "PA230329",
        "legislature": "14",
        "typeOrgane": "COMPER",
        "dateDebut": "2016-03-24T01:00:00.000+01:00",
        "datePublication": "2016-03-24T01:00:00.000+01:00",
        "dateFin": "2017-06-20T02:00:00.000+02:00",
        "preseance": "32",
        "nominPrincipale": "1",
        "infosQualite": {
          "codeQualite": "Membre",
          "libQualite": "Membre",
          "libQualiteSex": "Membre"
        },
        "organes": {
          "organeRef": "PO59046"
        }
      },
      {
        "@xsi:type": "MandatSimple_Type",
        "uid": "PM712294",
        "acteurRef": "PA230329",
        "legislature": "14",
        "typeOrgane": "GE",
        "dateDebut": "2016-04-06T02:00:00.000+02:00",
        "datePublication": null,
        "dateFin": "2017-06-20T02:00:00.000+02:00",
        "preseance": "20",
        "nominPrincipale": "1",
        "infosQualite": {
          "codeQualite": "Membre",
          "libQualite": "Membre",
          "libQualiteSex": "Membre"
        },
        "organes": {
          "organeRef": "PO712100"
        }
      }
    ]
  }
}