{
  "@xsi:type": "OrganeParlementaire_Type",
  "uid": "PO714853",
  "codeType": "MISINFO",
  "libelle": "Évaluation de la loi n° 2014-640 du 20 juin 2014 relative à la réforme des procédures de révision et de réexamen d’une condamnation pénale définitive",
  "libelleEdition": null,
  "libelleAbrege": "Réforme des procédures de révision et réexamen condamnation pénale définitive",
  "libelleAbrev": "CONPEN",
  "viMoDe": {
    "dateDebut": "2016-09-21T02:00:00.000+02:00",
    "dateAgrement": null,
    "dateFin": "2016-12-14T01:00:00.000+01:00"
  },
  "regime": "5ème République",
  "legislature": "14",
  "secretariat": {
    "secretaire01": null,
    "secretaire02": null
  }
}