{
  "uid": {
    "@xsi:type": "IdActeur_type",
    "#text": "PA667"
  },
  "etatCivil": {
    "ident": {
      "civ": "M.",
      "prenom": "Philippe",
      "nom": "Briand",
      "alpha": "Briand P",
      "trigramme": null
    },
    "infoNaissance": {
      "dateNais": "1960-10-26T01:00:00.000+01:00",
      "villeNais": "Tours",
      "depNais": "Indre-et-Loire",
      "paysNais": "France"
    },
    "dateDeces": null
  },
  "uri_hatvp": null,
  "mandats": {
    "mandat": [
      {
        "@xsi:type": "MandatParlementaire_type",
        "uid": "PM645574",
        "acteurRef": "PA667",
        "legislature": "14",
        "typeOrgane": "ASSEMBLEE",
        "dateDebut": "2012-06-20T02:00:00.000+02:00",
        "datePublication": null,
        "dateFin": "2017-06-20T02:00:00.000+02:00",
        "preseance": "50",
        "nominPrincipale": "1",
        "infosQualite": {
          "codeQualite": "membre",
          "libQualite": "membre",
          "libQualiteSex": "membre"
        },
        "organes": {
          "organeRef": "PO644420"
        },
        "suppleants": {
          "suppleant": {
            "dateDebut": "2012-06-20T02:00:00.000+02:00",
            "dateFin": "2017-06-20T02:00:00.000+02:00",
            "suppleantRef": "PA642787"
          }
        },
        "election": {
          "lieu": {
            "region": "Centre-Val de Loire",
            "regionType": "Métropolitain",
            "departement": "Indre-et-Loire",
            "numDepartement": "37",
            "numCirco": "5"
          },
          "causeMandat": "élections générales",
          "refCirconscription": "PO644596"
        },
        "mandature": {
          "datePriseFonction": "2012-06-20T02:00:00.000+02:00",
          "causeFin": "Fin de législature",
          "premiereElection": "1",
          "placeHemicycle": null,
          "mandatRemplaceRef": null
        }
      },
      {
        "@xsi:type": "MandatSimple_Type",
        "uid": "PM656341",
        "acteurRef": "PA667",
        "legislature": "14",
        "typeOrgane": "GP",
        "dateDebut": "2012-06-26T02:00:00.000+02:00",
        "datePublication": "2012-06-27T02:00:00.000+02:00",
        "dateFin": "2015-06-01T02:00:00.000+02:00",
        "preseance": "20",
        "nominPrincipale": "1",
        "infosQualite": {
          "codeQualite": "Membre",
          "libQualite": "Membre du",
          "libQualiteSex": "Membre du"
        },
        "organes": {
          "organeRef": "PO656006"
        }
      },
      {
        "@xsi:type": "MandatParlementaire_type",
        "uid": "PM656837",
        "acteurRef": "PA667",
        "legislature": "14",
        "typeOrgane": "ASSEMBLEE",
        "dateDebut": "2012-06-27T02:00:00.000+02:00",
        "datePublication": null,
        "dateFin": "2017-06-20T02:00:00.000+02:00",
        "preseance": "14",
        "nominPrincipale": "1",
        "infosQualite": {
          "codeQualite": "Questeur",
          "libQualite": "Questeur de l'Assemblée nationale",
          "libQualiteSex": "Questeur de l'Assemblée nationale"
        },
        "organes": {
          "organeRef": "PO644420"
        },
        "suppleants": null,
        "election": {
          "lieu": {
            "region": null,
            "regionType": null,
            "departement": null,
            "numDepartement": null,
            "numCirco": null
          },
          "causeMandat": null,
          "refCirconscription": null
        },
        "mandature": {
          "datePriseFonction": null,
          "causeFin": null,
          "premiereElection": null,
          "placeHemicycle": null,
          "mandatRemplaceRef": null
        }
      },
      {
        "@xsi:type": "MandatSimple_Type",
        "uid": "PM657247",
        "acteurRef": "PA667",
        "legislature": "14",
        "typeOrgane": "COMPER",
        "dateDebut": "2012-06-28T02:00:00.000+02:00",
        "datePublication": "2012-06-28T02:00:00.000+02:00",
        "dateFin": "2014-02-03T01:00:00.000+01:00",
        "preseance": "32",
        "nominPrincipale": "1",
        "infosQualite": {
          "codeQualite": "Membre",
          "libQualite": "Membre",
          "libQualiteSex": "Membre"
        },
        "organes": {
          "organeRef": "PO59046"
        }
      },
      {
        "@xsi:type": "MandatSimple_Type",
        "uid": "PM676601",
        "acteurRef": "PA667",
        "legislature": "14",
        "typeOrgane": "DELEGBUREAU",
        "dateDebut": "2012-07-18T02:00:00.000+02:00",
        "datePublication": null,
        "dateFin": "2017-06-20T02:00:00.000+02:00",
        "preseance": "5",
        "nominPrincipale": "1",
        "infosQualite": {
          "codeQualite": "Membre",
          "libQualite": "Questeur, membre",
          "libQualiteSex": "Questeur, membre"
        },
        "organes": {
          "organeRef": "PO665170"
        }
      },
      {
        "@xsi:type": "MandatSimple_Type",
        "uid": "PM682588",
        "acteurRef": "PA667",
        "legislature": "14",
        "typeOrgane": "GA",
        "dateDebut": "2012-10-18T02:00:00.000+02:00",
        "datePublication": null,
        "dateFin": "2017-06-20T02:00:00.000+02:00",
        "preseance": "20",
        "nominPrincipale": "1",
        "infosQualite": {
          "codeQualite": "Membre",
          "libQualite": "Membre",
          "libQualiteSex": "Membre"
        },
        "organes": {
          "organeRef": "PO675791"
        }
      },
      {
        "@xsi:type": "MandatSimple_Type",
        "uid": "PM682587",
        "acteurRef": "PA667",
        "legislature": "14",
        "typeOrgane": "GA",
        "dateDebut": "2012-10-18T02:00:00.000+02:00",
        "datePublication": null,
        "dateFin": "2017-06-20T02:00:00.000+02:00",
        "preseance": "20",
        "nominPrincipale": "1",
        "infosQualite": {
          "codeQualite": "Membre",
          "libQualite": "Membre",
          "libQualiteSex": "Membre"
        },
        "organes": {
          "organeRef": "PO675818"
        }
      },
      {
        "@xsi:type": "MandatSimple_Type",
        "uid": "PM682585",
        "acteurRef": "PA667",
        "legislature": "14",
        "typeOrgane": "GA",
        "dateDebut": "2012-10-18T02:00:00.000+02:00",
        "datePublication": null,
        "dateFin": "2017-06-20T02:00:00.000+02:00",
        "preseance": "20",
        "nominPrincipale": "1",
        "infosQualite": {
          "codeQualite": "Membre",
          "libQualite": "Membre",
          "libQualiteSex": "Membre"
        },
        "organes": {
          "organeRef": "PO675811"
        }
      },
      {
        "@xsi:type": "MandatSimple_Type",
        "uid": "PM682589",
        "acteurRef": "PA667",
        "legislature": "14",
        "typeOrgane": "GA",
        "dateDebut": "2012-10-18T02:00:00.000+02:00",
        "datePublication": null,
        "dateFin": "2017-06-20T02:00:00.000+02:00",
        "preseance": "20",
        "nominPrincipale": "1",
        "infosQualite": {
          "codeQualite": "Membre",
          "libQualite": "Membre",
          "libQualiteSex": "Membre"
        },
        "organes": {
          "organeRef": "PO675781"
        }
      },
      {
        "@xsi:type": "MandatSimple_Type",
        "uid": "PM682586",
        "acteurRef": "PA667",
        "legislature": "14",
        "typeOrgane": "GA",
        "dateDebut": "2012-10-18T02:00:00.000+02:00",
        "datePublication": null,
        "dateFin": "2017-06-20T02:00:00.000+02:00",
        "preseance": "20",
        "nominPrincipale": "1",
        "infosQualite": {
          "codeQualite": "Membre",
          "libQualite": "Membre",
          "libQualiteSex": "Membre"
        },
        "organes": {
          "organeRef": "PO675772"
        }
      },
      {
        "@xsi:type": "MandatSimple_Type",
        "uid": "PM684124",
        "acteurRef": "PA667",
        "legislature": "14",
        "typeOrgane": "GA",
        "dateDebut": "2012-11-07T01:00:00.000+01:00",
        "datePublication": null,
        "dateFin": "2017-06-20T02:00:00.000+02:00",
        "preseance": "20",
        "nominPrincipale": "1",
        "infosQualite": {
          "codeQualite": "Membre",
          "libQualite": "Membre",
          "libQualiteSex": "Membre"
        },
        "organes": {
          "organeRef": "PO675794"
        }
      },
      {
        "@xsi:type": "MandatSimple_Type",
        "uid": "PM684158",
        "acteurRef": "PA667",
        "legislature": "14",
        "typeOrgane": "GA",
        "dateDebut": "2012-11-08T01:00:00.000+01:00",
        "datePublication": null,
        "dateFin": "2017-06-20T02:00:00.000+02:00",
        "preseance": "8",
        "nominPrincipale": "1",
        "infosQualite": {
          "codeQualite": "Vice-Président",
          "libQualite": "Vice-Président",
          "libQualiteSex": "Vice-Président"
        },
        "organes": {
          "organeRef": "PO675791"
        }
      },
      {
        "@xsi:type": "MandatSimple_Type",
        "uid": "PM685438",
        "acteurRef": "PA667",
        "legislature": null,
        "typeOrgane": "PARPOL",
        "dateDebut": "2012-12-01T01:00:00.000+01:00",
        "datePublication": null,
        "dateFin": "2015-11-30T01:00:00.000+01:00",
        "preseance": "5",
        "nominPrincipale": "1",
        "infosQualite": {
          "codeQualite": "Membre",
          "libQualite": "Membre",
          "libQualiteSex": "Membre"
        },
        "organes": {
          "organeRef": "PO684942"
        }
      },
      {
        "@xsi:type": "MandatSimple_Type",
        "uid": "PM687424",
        "acteurRef": "PA667",
        "legislature": "14",
        "typeOrgane": "GA",
        "dateDebut": "2012-12-18T01:00:00.000+01:00",
        "datePublication": null,
        "dateFin": "2017-06-20T02:00:00.000+02:00",
        "preseance": "8",
        "nominPrincipale": "1",
        "infosQualite": {
          "codeQualite": "Vice-Président",
          "libQualite": "Vice-Président",
          "libQualiteSex": "Vice-Président"
        },
        "organes": {
          "organeRef": "PO675781"
        }
      },
      {
        "@xsi:type": "MandatSimple_Type",
        "uid": "PM688084",
        "acteurRef": "PA667",
        "legislature": "14",
        "typeOrgane": "GE",
        "dateDebut": "2013-01-17T01:00:00.000+01:00",
        "datePublication": null,
        "dateFin": "2017-06-20T02:00:00.000+02:00",
        "preseance": "20",
        "nominPrincipale": "1",
        "infosQualite": {
          "codeQualite": "Membre",
          "libQualite": "Membre",
          "libQualiteSex": "Membre"
        },
        "organes": {
          "organeRef": "PO686785"
        }
      },
      {
        "@xsi:type": "MandatSimple_Type",
        "uid": "PM689564",
        "acteurRef": "PA667",
        "legislature": "14",
        "typeOrgane": "GE",
        "dateDebut": "2013-01-20T01:00:00.000+01:00",
        "datePublication": null,
        "dateFin": "2017-06-20T02:00:00.000+02:00",
        "preseance": "20",
        "nominPrincipale": "1",
        "infosQualite": {
          "codeQualite": "Membre",
          "libQualite": "Membre",
          "libQualiteSex": "Membre"
        },
        "organes": {
          "organeRef": "PO686802"
        }
      },
      {
        "@xsi:type": "MandatSimple_Type",
        "uid": "PM691712",
        "acteurRef": "PA667",
        "legislature": "14",
        "typeOrgane": "GA",
        "dateDebut": "2013-02-13T01:00:00.000+01:00",
        "datePublication": null,
        "dateFin": "2017-06-20T02:00:00.000+02:00",
        "preseance": "8",
        "nominPrincipale": "1",
        "infosQualite": {
          "codeQualite": "Vice-Président",
          "libQualite": "Vice-Président",
          "libQualiteSex": "Vice-Président"
        },
        "organes": {
          "organeRef": "PO675818"
        }
      },
      {
        "@xsi:type": "MandatSimple_Type",
        "uid": "PM692916",
        "acteurRef": "PA667",
        "legislature": "14",
        "typeOrgane": "GE",
        "dateDebut": "2013-03-25T01:00:00.000+01:00",
        "datePublication": null,
        "dateFin": "2017-06-20T02:00:00.000+02:00",
        "preseance": "20",
        "nominPrincipale": "1",
        "infosQualite": {
          "codeQualite": "Membre",
          "libQualite": "Membre",
          "libQualiteSex": "Membre"
        },
        "organes": {
          "organeRef": "PO689030"
        }
      },
      {
        "@xsi:type": "MandatSimple_Type",
        "uid": "PM693384",
        "acteurRef": "PA667",
        "legislature": "14",
        "typeOrgane": "GE",
        "dateDebut": "2013-04-09T02:00:00.000+02:00",
        "datePublication": null,
        "dateFin": "2017-06-20T02:00:00.000+02:00",
        "preseance": "20",
        "nominPrincipale": "1",
        "infosQualite": {
          "codeQualite": "Membre",
          "libQualite": "Membre",
          "libQualiteSex": "Membre"
        },
        "organes": {
          "organeRef": "PO689000"
        }
      },
      {
        "@xsi:type": "MandatSimple_Type",
        "uid": "PM696121",
        "acteurRef": "PA667",
        "legislature": "14",
        "typeOrgane": "GE",
        "dateDebut": "2013-07-15T02:00:00.000+02:00",
        "datePublication": null,
        "dateFin": "2017-06-20T02:00:00.000+02:00",
        "preseance": "20",
        "nominPrincipale": "1",
        "infosQualite": {
          "codeQualite": "Membre",
          "libQualite": "Membre",
          "libQualiteSex": "Membre"
        },
        "organes": {
          "organeRef": "PO694566"
        }
      },
      {
        "@xsi:type": "MandatSimple_Type",
        "uid": "PM696998",
        "acteurRef": "PA667",
        "legislature": "14",
        "typeOrgane": "GE",
        "dateDebut": "2013-09-18T02:00:00.000+02:00",
        "datePublication": null,
        "dateFin": "2017-06-20T02:00:00.000+02:00",
        "preseance": "20",
        "nominPrincipale": "1",
        "infosQualite": {
          "codeQualite": "Membre",
          "libQualite": "Membre",
          "libQualiteSex": "Membre"
        },
        "organes": {
          "organeRef": "PO695581"
        }
      },
      {
        "@xsi:type": "MandatSimple_Type",
        "uid": "PM698422",
        "acteurRef": "PA667",
        "legislature": "14",
        "typeOrgane": "GE",
        "dateDebut": "2013-11-13T01:00:00.000+01:00",
        "datePublication": null,
        "dateFin": "2017-06-20T02:00:00.000+02:00",
        "preseance": "20",
        "nominPrincipale": "1",
        "infosQualite": {
          "codeQualite": "Membre",
          "libQualite": "Membre",
          "libQualiteSex": "Membre"
        },
        "organes": {
          "organeRef": "PO686878"
        }
      },
      {
        "@xsi:type": "MandatSimple_Type",
        "uid": "PM699796",
        "acteurRef": "PA667",
        "legislature": "14",
        "typeOrgane": "COMPER",
        "dateDebut": "2014-02-04T01:00:00.000+01:00",
        "datePublication": "2014-02-04T01:00:00.000+01:00",
        "dateFin": "2014-02-20T01:00:00.000+01:00",
        "preseance": "32",
        "nominPrincipale": "1",
        "infosQualite": {
          "codeQualite": "Membre",
          "libQualite": "Membre",
          "libQualiteSex": "Membre"
        },
        "organes": {
          "organeRef": "PO420120"
        }
      },
      {
        "@xsi:type": "MandatSimple_Type",
        "uid": "PM700346",
        "acteurRef": "PA667",
        "legislature": "14",
        "typeOrgane": "COMPER",
        "dateDebut": "2014-02-21T01:00:00.000+01:00",
        "datePublication": "2014-02-21T01:00:00.000+01:00",
        "dateFin": "2015-01-16T01:00:00.000+01:00",
        "preseance": "32",
        "nominPrincipale": "1",
        "infosQualite": {
          "codeQualite": "Membre",
          "libQualite": "Membre",
          "libQualiteSex": "Membre"
        },
        "organes": {
          "organeRef": "PO59046"
        }
      },
      {
        "@xsi:type": "MandatSimple_Type",
        "uid": "PM702721",
        "acteurRef": "PA667",
        "legislature": "14",
        "typeOrgane": "GE",
        "dateDebut": "2014-07-23T02:00:00.000+02:00",
        "datePublication": null,
        "dateFin": "2017-06-20T02:00:00.000+02:00",
        "preseance": "20",
        "nominPrincipale": "1",
        "infosQualite": {
          "codeQualite": "Membre",
          "libQualite": "Membre",
          "libQualiteSex": "Membre"
        },
        "organes": {
          "organeRef": "PO702209"
        }
      },
      {
        "@xsi:type": "MandatSimple_Type",
        "uid": "PM708256",
        "acteurRef": "PA667",
        "legislature": "14",
        "typeOrgane": "GP",
        "dateDebut": "2015-06-02T02:00:00.000+02:00",
        "datePublication": "2015-06-02T02:00:00.000+02:00",
        "dateFin": "2017-06-20T02:00:00.000+02:00",
        "preseance": "20",
        "nominPrincipale": "1",
        "infosQualite": {
          "codeQualite": "Membre",
          "libQualite": "Membre du",
          "libQualiteSex": "Membre du"
        },
        "organes": {
          "organeRef": "PO707869"
        }
      },
      {
        "@xsi:type": "MandatSimple_Type",
        "uid": "PM705857",
        "acteurRef": "PA667",
        "legislature": "14",
        "typeOrgane": "COMPER",
        "dateDebut": "2015-01-17T01:00:00.000+01:00",
        "datePublication": "2015-01-17T01:00:00.000+01:00",
        "dateFin": "2015-02-05T01:00:00.000+01:00",
        "preseance": "32",
        "nominPrincipale": "1",
        "infosQualite": {
          "codeQualite": "Membre",
          "libQualite": "Membre",
          "libQualiteSex": "Membre"
        },
        "organes": {
          "organeRef": "PO419865"
        }
      },
      {
        "@xsi:type": "MandatSimple_Type",
        "uid": "PM706210",
        "acteurRef": "PA667",
        "legislature": "14",
        "typeOrgane": "COMPER",
        "dateDebut": "2015-02-06T01:00:00.000+01:00",
        "datePublication": "2015-02-06T01:00:00.000+01:00",
        "dateFin": "2016-12-01T01:00:00.000+01:00",
        "preseance": "32",
        "nominPrincipale": "1",
        "infosQualite": {
          "codeQualite": "Membre",
          "libQualite": "Membre",
          "libQualiteSex": "Membre"
        },
        "organes": {
          "organeRef": "PO59046"
        }
      },
      {
        "@xsi:type": "MandatSimple_Type",
        "uid": "PM715670",
        "acteurRef": "PA667",
        "legislature": "14",
        "typeOrgane": "COMPER",
        "dateDebut": "2016-12-02T01:00:00.000+01:00",
        "datePublication": "2016-12-02T01:00:00.000+01:00",
        "dateFin": "2016-12-08T01:00:00.000+01:00",
        "preseance": "32",
        "nominPrincipale": "1",
        "infosQualite": {
          "codeQualite": "Membre",
          "libQualite": "Membre",
          "libQualiteSex": "Membre"
        },
        "organes": {
          "organeRef": "PO59051"
        }
      },
      {
        "@xsi:type": "MandatSimple_Type",
        "uid": "PM715994",
        "acteurRef": "PA667",
        "legislature": "14",
        "typeOrgane": "COMPER",
        "dateDebut": "2016-12-09T01:00:00.000+01:00",
        "datePublication": "2016-12-09T01:00:00.000+01:00",
        "dateFin": "2017-06-20T02:00:00.000+02:00",
        "preseance": "32",
        "nominPrincipale": "1",
        "infosQualite": {
          "codeQualite": "Membre",
          "libQualite": "Membre",
          "libQualiteSex": "Membre"
        },
        "organes": {
          "organeRef": "PO59046"
        }
      },
      {
        "@xsi:type": "MandatSimple_Type",
        "uid": "PM710420",
        "acteurRef": "PA667",
        "legislature": null,
        "typeOrgane": "PARPOL",
        "dateDebut": "2015-12-01T01:00:00.000+01:00",
        "datePublication": null,
        "dateFin": "2017-06-20T02:00:00.000+02:00",
        "preseance": "5",
        "nominPrincipale": "1",
        "infosQualite": {
          "codeQualite": "Membre",
          "libQualite": "Membre",
          "libQualiteSex": "Membre"
        },
        "organes": {
          "organeRef": "PO710396"
        }
      }
    ]
  }
}