{
  "uid": {
    "@xsi:type": "IdActeur_type",
    "#text": "PA270"
  },
  "etatCivil": {
    "ident": {
      "civ": "Mme",
      "prenom": "Michèle",
      "nom": "André",
      "alpha": "ANDRE M",
      "trigramme": null
    },
    "infoNaissance": {
      "dateNais": "1947-02-06T01:00:00.000+01:00",
      "villeNais": null,
      "depNais": null,
      "paysNais": null
    },
    "dateDeces": null
  },
  "uri_hatvp": null,
  "mandats": {
    "mandat": [
      {
        "@xsi:type": "MandatSimple_Type",
        "uid": "PM227309",
        "acteurRef": "PA270",
        "legislature": null,
        "typeOrgane": "GROUPESENAT",
        "dateDebut": "2001-10-02T02:00:00.000+02:00",
        "datePublication": "2001-10-03T02:00:00.000+02:00",
        "dateFin": "2017-10-01T02:00:00.000+02:00",
        "preseance": "4",
        "nominPrincipale": "1",
        "infosQualite": {
          "codeQualite": "Membre",
          "libQualite": "Membre",
          "libQualiteSex": "Membre du"
        },
        "organes": {
          "organeRef": "PO77710"
        }
      },
      {
        "@xsi:type": "MandatParlementaire_type",
        "uid": "PM429986",
        "acteurRef": "PA270",
        "legislature": null,
        "typeOrgane": "SENAT",
        "dateDebut": "2011-10-01T02:00:00.000+02:00",
        "datePublication": null,
        "dateFin": "2017-10-01T02:00:00.000+02:00",
        "preseance": "20",
        "nominPrincipale": "1",
        "infosQualite": {
          "codeQualite": "Sénateur",
          "libQualite": "SENATEUR",
          "libQualiteSex": "Sénateur 5ème République"
        },
        "organes": {
          "organeRef": "PO78718"
        },
        "suppleants": null,
        "election": {
          "lieu": {
            "region": null,
            "regionType": null,
            "departement": null,
            "numDepartement": "63",
            "numCirco": null
          },
          "causeMandat": null
        },
        "InfosHorsSIAN": {
          "HATVP_URI": null
        },
        "mandature": {
          "datePriseFonction": null,
          "causeFin": null,
          "premiereElection": null,
          "placeHemicycle": null,
          "mandatRemplaceRef": null
        }
      },
      {
        "@xsi:type": "MandatSimple_Type",
        "uid": "PM430445",
        "acteurRef": "PA270",
        "legislature": null,
        "typeOrgane": "COMSENAT",
        "dateDebut": "2011-10-01T02:00:00.000+02:00",
        "datePublication": null,
        "dateFin": "2012-06-19T02:00:00.000+02:00",
        "preseance": null,
        "nominPrincipale": "1",
        "infosQualite": {
          "codeQualite": null,
          "libQualite": "Vice-Président",
          "libQualiteSex": null
        },
        "organes": {
          "organeRef": "PO211494"
        }
      },
      {
        "@xsi:type": "MandatSimple_Type",
        "uid": "PM517969",
        "acteurRef": "PA270",
        "legislature": null,
        "typeOrgane": "ORGAINT",
        "dateDebut": "2012-01-31T01:00:00.000+01:00",
        "datePublication": null,
        "dateFin": "2017-10-01T02:00:00.000+02:00",
        "preseance": "42",
        "nominPrincipale": "1",
        "infosQualite": {
          "codeQualite": "Membre",
          "libQualite": "Membre",
          "libQualiteSex": "Membre"
        },
        "organes": {
          "organeRef": "PO206064"
        }
      },
      {
        "@xsi:type": "MandatSimple_Type",
        "uid": "PM651966",
        "acteurRef": "PA270",
        "legislature": null,
        "typeOrgane": "COMSENAT",
        "dateDebut": "2012-06-20T02:00:00.000+02:00",
        "datePublication": null,
        "dateFin": "2014-10-07T02:00:00.000+02:00",
        "preseance": null,
        "nominPrincipale": "1",
        "infosQualite": {
          "codeQualite": null,
          "libQualite": "Premier Vice-Président",
          "libQualiteSex": null
        },
        "organes": {
          "organeRef": "PO211494"
        }
      },
      {
        "@xsi:type": "MandatSimple_Type",
        "uid": "PM677519",
        "acteurRef": "PA270",
        "legislature": null,
        "typeOrgane": "CMP",
        "dateDebut": "2012-07-30T02:00:00.000+02:00",
        "datePublication": "2012-07-31T02:00:00.000+02:00",
        "dateFin": "2012-07-30T02:00:00.000+02:00",
        "preseance": "20",
        "nominPrincipale": "1",
        "infosQualite": {
          "codeQualite": "Titulaire",
          "libQualite": "Membre titulaire",
          "libQualiteSex": "Membre titulaire"
        },
        "organes": {
          "organeRef": "PO677474"
        }
      },
      {
        "@xsi:type": "MandatSimple_Type",
        "uid": "PM678875",
        "acteurRef": "PA270",
        "legislature": null,
        "typeOrgane": "ORGAINT",
        "dateDebut": "2012-07-31T02:00:00.000+02:00",
        "datePublication": null,
        "dateFin": "2017-09-26T02:00:00.000+02:00",
        "preseance": "8",
        "nominPrincipale": "1",
        "infosQualite": {
          "codeQualite": "Président exécutif",
          "libQualite": "Président exécutif",
          "libQualiteSex": "Présidente exécutive"
        },
        "organes": {
          "organeRef": "PO206064"
        }
      },
      {
        "@xsi:type": "MandatSimple_Type",
        "uid": "PM679749",
        "acteurRef": "PA270",
        "legislature": null,
        "typeOrgane": "ORGAINT",
        "dateDebut": "2012-10-11T02:00:00.000+02:00",
        "datePublication": null,
        "dateFin": "2017-10-01T02:00:00.000+02:00",
        "preseance": "42",
        "nominPrincipale": "0",
        "infosQualite": {
          "codeQualite": "Membre",
          "libQualite": "Membre",
          "libQualiteSex": "Membre"
        },
        "organes": {
          "organeRef": "PO201115"
        }
      },
      {
        "@xsi:type": "MandatSimple_Type",
        "uid": "PM685291",
        "acteurRef": "PA270",
        "legislature": null,
        "typeOrgane": "CMP",
        "dateDebut": "2012-12-04T01:00:00.000+01:00",
        "datePublication": "2012-12-05T01:00:00.000+01:00",
        "dateFin": "2012-12-19T01:00:00.000+01:00",
        "preseance": "20",
        "nominPrincipale": "1",
        "infosQualite": {
          "codeQualite": "Titulaire",
          "libQualite": "Membre titulaire",
          "libQualiteSex": "Membre titulaire"
        },
        "organes": {
          "organeRef": "PO684249"
        }
      },
      {
        "@xsi:type": "MandatSimple_Type",
        "uid": "PM685327",
        "acteurRef": "PA270",
        "legislature": null,
        "typeOrgane": "CMP",
        "dateDebut": "2012-12-04T01:00:00.000+01:00",
        "datePublication": "2012-12-05T01:00:00.000+01:00",
        "dateFin": "2012-12-19T01:00:00.000+01:00",
        "preseance": "20",
        "nominPrincipale": "1",
        "infosQualite": {
          "codeQualite": "Titulaire",
          "libQualite": "Membre titulaire",
          "libQualiteSex": "Membre titulaire"
        },
        "organes": {
          "organeRef": "PO685148"
        }
      },
      {
        "@xsi:type": "MandatSimple_Type",
        "uid": "PM686659",
        "acteurRef": "PA270",
        "legislature": null,
        "typeOrgane": "CMP",
        "dateDebut": "2012-12-12T01:00:00.000+01:00",
        "datePublication": "2012-12-13T01:00:00.000+01:00",
        "dateFin": "2012-12-20T01:00:00.000+01:00",
        "preseance": "28",
        "nominPrincipale": "1",
        "infosQualite": {
          "codeQualite": "Suppléant",
          "libQualite": "Membre suppléant",
          "libQualiteSex": "Membre suppléante"
        },
        "organes": {
          "organeRef": "PO686310"
        }
      },
      {
        "@xsi:type": "MandatSimple_Type",
        "uid": "PM687177",
        "acteurRef": "PA270",
        "legislature": null,
        "typeOrgane": "CMP",
        "dateDebut": "2012-12-17T01:00:00.000+01:00",
        "datePublication": "2012-12-18T01:00:00.000+01:00",
        "dateFin": "2012-12-19T01:00:00.000+01:00",
        "preseance": "20",
        "nominPrincipale": "1",
        "infosQualite": {
          "codeQualite": "Titulaire",
          "libQualite": "Membre titulaire",
          "libQualiteSex": "Membre titulaire"
        },
        "organes": {
          "organeRef": "PO687137"
        }
      },
      {
        "@xsi:type": "MandatSimple_Type",
        "uid": "PM695784",
        "acteurRef": "PA270",
        "legislature": null,
        "typeOrgane": "CMP",
        "dateDebut": "2013-07-02T02:00:00.000+02:00",
        "datePublication": "2013-07-04T02:00:00.000+02:00",
        "dateFin": "2013-07-18T02:00:00.000+02:00",
        "preseance": "28",
        "nominPrincipale": "1",
        "infosQualite": {
          "codeQualite": "Suppléant",
          "libQualite": "Membre suppléant",
          "libQualiteSex": "Membre suppléante"
        },
        "organes": {
          "organeRef": "PO695634"
        }
      },
      {
        "@xsi:type": "MandatSimple_Type",
        "uid": "PM695974",
        "acteurRef": "PA270",
        "legislature": null,
        "typeOrgane": "CMP",
        "dateDebut": "2013-07-12T02:00:00.000+02:00",
        "datePublication": "2013-07-13T02:00:00.000+02:00",
        "dateFin": "2013-07-16T02:00:00.000+02:00",
        "preseance": "20",
        "nominPrincipale": "1",
        "infosQualite": {
          "codeQualite": "Titulaire",
          "libQualite": "Membre titulaire",
          "libQualiteSex": "Membre titulaire"
        },
        "organes": {
          "organeRef": "PO695808"
        }
      },
      {
        "@xsi:type": "MandatSimple_Type",
        "uid": "PM712807",
        "acteurRef": "PA270",
        "legislature": null,
        "typeOrgane": "CMP",
        "dateDebut": "2016-05-12T02:00:00.000+02:00",
        "datePublication": "2016-05-13T02:00:00.000+02:00",
        "dateFin": "2016-06-01T02:00:00.000+02:00",
        "preseance": "20",
        "nominPrincipale": "1",
        "infosQualite": {
          "codeQualite": "Titulaire",
          "libQualite": "Membre titulaire",
          "libQualiteSex": "Membre titulaire"
        },
        "organes": {
          "organeRef": "PO712775"
        }
      },
      {
        "@xsi:type": "MandatSimple_Type",
        "uid": "PM712858",
        "acteurRef": "PA270",
        "legislature": null,
        "typeOrgane": "CMP",
        "dateDebut": "2016-05-17T02:00:00.000+02:00",
        "datePublication": "2016-05-18T02:00:00.000+02:00",
        "dateFin": "2016-06-01T02:00:00.000+02:00",
        "preseance": "4",
        "nominPrincipale": "1",
        "infosQualite": {
          "codeQualite": "Vice-Président",
          "libQualite": "Vice-Président",
          "libQualiteSex": "Vice-Présidente"
        },
        "organes": {
          "organeRef": "PO712775"
        }
      },
      {
        "@xsi:type": "MandatSimple_Type",
        "uid": "PM708423",
        "acteurRef": "PA270",
        "legislature": null,
        "typeOrgane": "CMP",
        "dateDebut": "2015-06-09T02:00:00.000+02:00",
        "datePublication": "2015-06-10T02:00:00.000+02:00",
        "dateFin": "2015-06-12T02:00:00.000+02:00",
        "preseance": "20",
        "nominPrincipale": "1",
        "infosQualite": {
          "codeQualite": "Titulaire",
          "libQualite": "Membre titulaire",
          "libQualiteSex": "Membre titulaire"
        },
        "organes": {
          "organeRef": "PO708315"
        }
      },
      {
        "@xsi:type": "MandatSimple_Type",
        "uid": "PM708458",
        "acteurRef": "PA270",
        "legislature": null,
        "typeOrgane": "CMP",
        "dateDebut": "2015-06-11T02:00:00.000+02:00",
        "datePublication": "2015-06-12T02:00:00.000+02:00",
        "dateFin": "2015-06-12T02:00:00.000+02:00",
        "preseance": "4",
        "nominPrincipale": "1",
        "infosQualite": {
          "codeQualite": "Vice-Président",
          "libQualite": "Vice-Président",
          "libQualiteSex": "Vice-Présidente"
        },
        "organes": {
          "organeRef": "PO708315"
        }
      },
      {
        "@xsi:type": "MandatSimple_Type",
        "uid": "PM698874",
        "acteurRef": "PA270",
        "legislature": null,
        "typeOrgane": "CMP",
        "dateDebut": "2013-11-28T01:00:00.000+01:00",
        "datePublication": "2013-12-05T01:00:00.000+01:00",
        "dateFin": "2014-01-02T01:00:00.000+01:00",
        "preseance": "20",
        "nominPrincipale": "1",
        "infosQualite": {
          "codeQualite": "Titulaire",
          "libQualite": "Membre titulaire",
          "libQualiteSex": "Membre titulaire"
        },
        "organes": {
          "organeRef": "PO698794"
        }
      },
      {
        "@xsi:type": "MandatSimple_Type",
        "uid": "PM699132",
        "acteurRef": "PA270",
        "legislature": null,
        "typeOrgane": "CMP",
        "dateDebut": "2013-12-13T01:00:00.000+01:00",
        "datePublication": "2013-12-17T01:00:00.000+01:00",
        "dateFin": "2014-01-02T01:00:00.000+01:00",
        "preseance": "20",
        "nominPrincipale": "1",
        "infosQualite": {
          "codeQualite": "Titulaire",
          "libQualite": "Membre titulaire",
          "libQualiteSex": "Membre titulaire"
        },
        "organes": {
          "organeRef": "PO699107"
        }
      },
      {
        "@xsi:type": "MandatSimple_Type",
        "uid": "PM699849",
        "acteurRef": "PA270",
        "legislature": null,
        "typeOrgane": "CMP",
        "dateDebut": "2014-01-30T01:00:00.000+01:00",
        "datePublication": "2014-02-06T01:00:00.000+01:00",
        "dateFin": "2014-02-17T01:00:00.000+01:00",
        "preseance": "28",
        "nominPrincipale": "1",
        "infosQualite": {
          "codeQualite": "Suppléant",
          "libQualite": "Membre suppléant",
          "libQualiteSex": "Membre suppléante"
        },
        "organes": {
          "organeRef": "PO699729"
        }
      },
      {
        "@xsi:type": "MandatSimple_Type",
        "uid": "PM701370",
        "acteurRef": "PA270",
        "legislature": null,
        "typeOrgane": "CMP",
        "dateDebut": "2014-05-13T02:00:00.000+02:00",
        "datePublication": "2014-05-16T02:00:00.000+02:00",
        "dateFin": "2014-06-10T02:00:00.000+02:00",
        "preseance": "28",
        "nominPrincipale": "1",
        "infosQualite": {
          "codeQualite": "Suppléant",
          "libQualite": "Membre suppléant",
          "libQualiteSex": "Membre suppléante"
        },
        "organes": {
          "organeRef": "PO701178"
        }
      },
      {
        "@xsi:type": "MandatSimple_Type",
        "uid": "PM716150",
        "acteurRef": "PA270",
        "legislature": null,
        "typeOrgane": "CMP",
        "dateDebut": "2016-12-13T01:00:00.000+01:00",
        "datePublication": "2016-12-14T01:00:00.000+01:00",
        "dateFin": "2016-12-16T01:00:00.000+01:00",
        "preseance": "4",
        "nominPrincipale": "1",
        "infosQualite": {
          "codeQualite": "Vice-Président",
          "libQualite": "Vice-Président",
          "libQualiteSex": "Vice-Présidente"
        },
        "organes": {
          "organeRef": "PO715651"
        }
      },
      {
        "@xsi:type": "MandatSimple_Type",
        "uid": "PM716255",
        "acteurRef": "PA270",
        "legislature": null,
        "typeOrgane": "CMP",
        "dateDebut": "2016-12-16T01:00:00.000+01:00",
        "datePublication": "2016-12-17T01:00:00.000+01:00",
        "dateFin": "2016-12-20T01:00:00.000+01:00",
        "preseance": "20",
        "nominPrincipale": "1",
        "infosQualite": {
          "codeQualite": "Titulaire",
          "libQualite": "Membre titulaire",
          "libQualiteSex": "Membre titulaire"
        },
        "organes": {
          "organeRef": "PO716192"
        }
      },
      {
        "@xsi:type": "MandatSimple_Type",
        "uid": "PM716273",
        "acteurRef": "PA270",
        "legislature": null,
        "typeOrgane": "CMP",
        "dateDebut": "2016-12-19T01:00:00.000+01:00",
        "datePublication": "2016-12-20T01:00:00.000+01:00",
        "dateFin": "2016-12-20T01:00:00.000+01:00",
        "preseance": "1",
        "nominPrincipale": "1",
        "infosQualite": {
          "codeQualite": "Président",
          "libQualite": "Président",
          "libQualiteSex": "Présidente"
        },
        "organes": {
          "organeRef": "PO716192"
        }
      },
      {
        "@xsi:type": "MandatSimple_Type",
        "uid": "PM702381",
        "acteurRef": "PA270",
        "legislature": null,
        "typeOrgane": "CMP",
        "dateDebut": "2014-07-09T02:00:00.000+02:00",
        "datePublication": "2014-07-10T02:00:00.000+02:00",
        "dateFin": "2014-07-23T02:00:00.000+02:00",
        "preseance": "28",
        "nominPrincipale": "1",
        "infosQualite": {
          "codeQualite": "Suppléant",
          "libQualite": "Membre suppléant",
          "libQualiteSex": "Membre suppléante"
        },
        "organes": {
          "organeRef": "PO702354"
        }
      },
      {
        "@xsi:type": "MandatSimple_Type",
        "uid": "PM702561",
        "acteurRef": "PA270",
        "legislature": null,
        "typeOrgane": "CMP",
        "dateDebut": "2014-07-16T02:00:00.000+02:00",
        "datePublication": "2014-07-17T02:00:00.000+02:00",
        "dateFin": "2014-07-23T02:00:00.000+02:00",
        "preseance": "20",
        "nominPrincipale": "1",
        "infosQualite": {
          "codeQualite": "Titulaire",
          "libQualite": "Membre titulaire",
          "libQualiteSex": "Membre titulaire"
        },
        "organes": {
          "organeRef": "PO702527"
        }
      },
      {
        "@xsi:type": "MandatSimple_Type",
        "uid": "PM714207",
        "acteurRef": "PA270",
        "legislature": null,
        "typeOrgane": "CMP",
        "dateDebut": "2016-07-08T02:00:00.000+02:00",
        "datePublication": "2016-07-09T02:00:00.000+02:00",
        "dateFin": "2016-07-13T02:00:00.000+02:00",
        "preseance": "20",
        "nominPrincipale": "1",
        "infosQualite": {
          "codeQualite": "Titulaire",
          "libQualite": "Membre titulaire",
          "libQualiteSex": "Membre titulaire"
        },
        "organes": {
          "organeRef": "PO714186"
        }
      },
      {
        "@xsi:type": "MandatSimple_Type",
        "uid": "PM714278",
        "acteurRef": "PA270",
        "legislature": null,
        "typeOrgane": "CMP",
        "dateDebut": "2016-07-12T02:00:00.000+02:00",
        "datePublication": "2016-07-13T02:00:00.000+02:00",
        "dateFin": "2016-07-13T02:00:00.000+02:00",
        "preseance": "1",
        "nominPrincipale": "1",
        "infosQualite": {
          "codeQualite": "Président",
          "libQualite": "Président",
          "libQualiteSex": "Présidente"
        },
        "organes": {
          "organeRef": "PO714186"
        }
      },
      {
        "@xsi:type": "MandatSimple_Type",
        "uid": "PM704133",
        "acteurRef": "PA270",
        "legislature": null,
        "typeOrgane": "COMSENAT",
        "dateDebut": "2014-10-08T02:00:00.000+02:00",
        "datePublication": null,
        "dateFin": "2014-10-08T02:00:00.000+02:00",
        "preseance": "10",
        "nominPrincipale": "1",
        "infosQualite": {
          "codeQualite": "Membre",
          "libQualite": "Membre",
          "libQualiteSex": "Membre"
        },
        "organes": {
          "organeRef": "PO211494"
        }
      },
      {
        "@xsi:type": "MandatSimple_Type",
        "uid": "PM704156",
        "acteurRef": "PA270",
        "legislature": null,
        "typeOrgane": "COMSENAT",
        "dateDebut": "2014-10-09T02:00:00.000+02:00",
        "datePublication": null,
        "dateFin": "2017-10-01T02:00:00.000+02:00",
        "preseance": null,
        "nominPrincipale": "1",
        "infosQualite": {
          "codeQualite": null,
          "libQualite": "Président",
          "libQualiteSex": null
        },
        "organes": {
          "organeRef": "PO211494"
        }
      },
      {
        "@xsi:type": "MandatSimple_Type",
        "uid": "PM705124",
        "acteurRef": "PA270",
        "legislature": null,
        "typeOrgane": "CMP",
        "dateDebut": "2014-11-20T01:00:00.000+01:00",
        "datePublication": "2014-12-05T01:00:00.000+01:00",
        "dateFin": "2014-12-18T01:00:00.000+01:00",
        "preseance": "20",
        "nominPrincipale": "1",
        "infosQualite": {
          "codeQualite": "Titulaire",
          "libQualite": "Membre titulaire",
          "libQualiteSex": "Membre titulaire"
        },
        "organes": {
          "organeRef": "PO704399"
        }
      },
      {
        "@xsi:type": "MandatSimple_Type",
        "uid": "PM705152",
        "acteurRef": "PA270",
        "legislature": null,
        "typeOrgane": "CMP",
        "dateDebut": "2014-11-20T01:00:00.000+01:00",
        "datePublication": "2014-12-05T01:00:00.000+01:00",
        "dateFin": "2014-12-18T01:00:00.000+01:00",
        "preseance": "20",
        "nominPrincipale": "1",
        "infosQualite": {
          "codeQualite": "Titulaire",
          "libQualite": "Membre titulaire",
          "libQualiteSex": "Membre titulaire"
        },
        "organes": {
          "organeRef": "PO704574"
        }
      },
      {
        "@xsi:type": "MandatSimple_Type",
        "uid": "PM705244",
        "acteurRef": "PA270",
        "legislature": null,
        "typeOrgane": "CMP",
        "dateDebut": "2014-12-09T01:00:00.000+01:00",
        "datePublication": "2014-12-11T01:00:00.000+01:00",
        "dateFin": "2014-12-18T01:00:00.000+01:00",
        "preseance": "20",
        "nominPrincipale": "1",
        "infosQualite": {
          "codeQualite": "Titulaire",
          "libQualite": "Membre titulaire",
          "libQualiteSex": "Membre titulaire"
        },
        "organes": {
          "organeRef": "PO705223"
        }
      },
      {
        "@xsi:type": "MandatSimple_Type",
        "uid": "PM705342",
        "acteurRef": "PA270",
        "legislature": null,
        "typeOrgane": "CMP",
        "dateDebut": "2014-12-11T01:00:00.000+01:00",
        "datePublication": "2014-12-12T01:00:00.000+01:00",
        "dateFin": "2014-12-18T01:00:00.000+01:00",
        "preseance": "4",
        "nominPrincipale": "1",
        "infosQualite": {
          "codeQualite": "Vice-Président",
          "libQualite": "Vice-Président",
          "libQualiteSex": "Vice-Présidente"
        },
        "organes": {
          "organeRef": "PO704574"
        }
      },
      {
        "@xsi:type": "MandatSimple_Type",
        "uid": "PM705346",
        "acteurRef": "PA270",
        "legislature": null,
        "typeOrgane": "CMP",
        "dateDebut": "2014-12-11T01:00:00.000+01:00",
        "datePublication": "2014-12-12T01:00:00.000+01:00",
        "dateFin": "2014-12-18T01:00:00.000+01:00",
        "preseance": "4",
        "nominPrincipale": "1",
        "infosQualite": {
          "codeQualite": "Vice-Président",
          "libQualite": "Vice-Président",
          "libQualiteSex": "Vice-Présidente"
        },
        "organes": {
          "organeRef": "PO705223"
        }
      },
      {
        "@xsi:type": "MandatSimple_Type",
        "uid": "PM705350",
        "acteurRef": "PA270",
        "legislature": null,
        "typeOrgane": "CMP",
        "dateDebut": "2014-12-11T01:00:00.000+01:00",
        "datePublication": "2014-12-12T01:00:00.000+01:00",
        "dateFin": "2014-12-18T01:00:00.000+01:00",
        "preseance": "4",
        "nominPrincipale": "1",
        "infosQualite": {
          "codeQualite": "Vice-Président",
          "libQualite": "Vice-Président",
          "libQualiteSex": "Vice-Présidente"
        },
        "organes": {
          "organeRef": "PO704399"
        }
      },
      {
        "@xsi:type": "MandatSimple_Type",
        "uid": "PM705412",
        "acteurRef": "PA270",
        "legislature": null,
        "typeOrgane": "CMP",
        "dateDebut": "2014-12-15T01:00:00.000+01:00",
        "datePublication": "2014-12-13T01:00:00.000+01:00",
        "dateFin": "2014-12-18T01:00:00.000+01:00",
        "preseance": "20",
        "nominPrincipale": "0",
        "infosQualite": {
          "codeQualite": "Titulaire",
          "libQualite": "Membre titulaire",
          "libQualiteSex": "Membre titulaire"
        },
        "organes": {
          "organeRef": "PO705391"
        }
      },
      {
        "@xsi:type": "MandatSimple_Type",
        "uid": "PM705471",
        "acteurRef": "PA270",
        "legislature": null,
        "typeOrgane": "CMP",
        "dateDebut": "2014-12-15T01:00:00.000+01:00",
        "datePublication": "2014-12-16T01:00:00.000+01:00",
        "dateFin": "2014-12-18T01:00:00.000+01:00",
        "preseance": "1",
        "nominPrincipale": "1",
        "infosQualite": {
          "codeQualite": "Président",
          "libQualite": "Président",
          "libQualiteSex": "Présidente"
        },
        "organes": {
          "organeRef": "PO705391"
        }
      },
      {
        "@xsi:type": "MandatSimple_Type",
        "uid": "PM705693",
        "acteurRef": "PA270",
        "legislature": null,
        "typeOrgane": "CMP",
        "dateDebut": "2015-01-14T01:00:00.000+01:00",
        "datePublication": "2015-01-15T01:00:00.000+01:00",
        "dateFin": "2015-03-05T01:00:00.000+01:00",
        "preseance": "20",
        "nominPrincipale": "1",
        "infosQualite": {
          "codeQualite": "Titulaire",
          "libQualite": "Membre titulaire",
          "libQualiteSex": "Membre titulaire"
        },
        "organes": {
          "organeRef": "PO705585"
        }
      },
      {
        "@xsi:type": "MandatSimple_Type",
        "uid": "PM705744",
        "acteurRef": "PA270",
        "legislature": null,
        "typeOrgane": "CMP",
        "dateDebut": "2015-01-15T01:00:00.000+01:00",
        "datePublication": "2015-01-16T01:00:00.000+01:00",
        "dateFin": "2015-03-05T01:00:00.000+01:00",
        "preseance": "1",
        "nominPrincipale": "1",
        "infosQualite": {
          "codeQualite": "Président",
          "libQualite": "Président",
          "libQualiteSex": "Présidente"
        },
        "organes": {
          "organeRef": "PO705585"
        }
      },
      {
        "@xsi:type": "MandatSimple_Type",
        "uid": "PM708989",
        "acteurRef": "PA270",
        "legislature": null,
        "typeOrgane": "CMP",
        "dateDebut": "2015-07-10T02:00:00.000+02:00",
        "datePublication": "2015-07-11T02:00:00.000+02:00",
        "dateFin": "2015-07-16T02:00:00.000+02:00",
        "preseance": "20",
        "nominPrincipale": "1",
        "infosQualite": {
          "codeQualite": "Titulaire",
          "libQualite": "Membre titulaire",
          "libQualiteSex": "Membre titulaire"
        },
        "organes": {
          "organeRef": "PO708938"
        }
      },
      {
        "@xsi:type": "MandatSimple_Type",
        "uid": "PM709040",
        "acteurRef": "PA270",
        "legislature": null,
        "typeOrgane": "CMP",
        "dateDebut": "2015-07-15T02:00:00.000+02:00",
        "datePublication": "2015-07-16T02:00:00.000+02:00",
        "dateFin": "2015-07-16T02:00:00.000+02:00",
        "preseance": "1",
        "nominPrincipale": "1",
        "infosQualite": {
          "codeQualite": "Président",
          "libQualite": "Président",
          "libQualiteSex": "Présidente"
        },
        "organes": {
          "organeRef": "PO708938"
        }
      },
      {
        "@xsi:type": "MandatSimple_Type",
        "uid": "PM707253",
        "acteurRef": "PA270",
        "legislature": null,
        "typeOrgane": "ORGAINT",
        "dateDebut": "2012-10-11T02:00:00.000+02:00",
        "datePublication": null,
        "dateFin": "2017-10-01T02:00:00.000+02:00",
        "preseance": "41",
        "nominPrincipale": "1",
        "infosQualite": {
          "codeQualite": "Autre membre du Bureau",
          "libQualite": "Membre du Bureau",
          "libQualiteSex": "Membre du Bureau"
        },
        "organes": {
          "organeRef": "PO201115"
        }
      },
      {
        "@xsi:type": "MandatSimple_Type",
        "uid": "PM715981",
        "acteurRef": "PA270",
        "legislature": null,
        "typeOrgane": "CMP",
        "dateDebut": "2016-11-30T01:00:00.000+01:00",
        "datePublication": "2016-12-09T01:00:00.000+01:00",
        "dateFin": "2016-12-16T01:00:00.000+01:00",
        "preseance": "20",
        "nominPrincipale": "1",
        "infosQualite": {
          "codeQualite": "Titulaire",
          "libQualite": "Membre titulaire",
          "libQualiteSex": "Membre titulaire"
        },
        "organes": {
          "organeRef": "PO715651"
        }
      },
      {
        "@xsi:type": "MandatSimple_Type",
        "uid": "PM710706",
        "acteurRef": "PA270",
        "legislature": null,
        "typeOrgane": "CMP",
        "dateDebut": "2015-12-07T01:00:00.000+01:00",
        "datePublication": "2015-12-10T01:00:00.000+01:00",
        "dateFin": "2015-12-11T01:00:00.000+01:00",
        "preseance": "20",
        "nominPrincipale": "1",
        "infosQualite": {
          "codeQualite": "Titulaire",
          "libQualite": "Membre titulaire",
          "libQualiteSex": "Membre titulaire"
        },
        "organes": {
          "organeRef": "PO710669"
        }
      },
      {
        "@xsi:type": "MandatSimple_Type",
        "uid": "PM710717",
        "acteurRef": "PA270",
        "legislature": null,
        "typeOrgane": "CMP",
        "dateDebut": "2015-12-10T01:00:00.000+01:00",
        "datePublication": "2015-12-10T01:00:00.000+01:00",
        "dateFin": "2015-12-11T01:00:00.000+01:00",
        "preseance": "1",
        "nominPrincipale": "1",
        "infosQualite": {
          "codeQualite": "Président",
          "libQualite": "Président",
          "libQualiteSex": "Présidente"
        },
        "organes": {
          "organeRef": "PO710669"
        }
      },
      {
        "@xsi:type": "MandatSimple_Type",
        "uid": "PM710784",
        "acteurRef": "PA270",
        "legislature": null,
        "typeOrgane": "CMP",
        "dateDebut": "2015-12-11T01:00:00.000+01:00",
        "datePublication": "2015-12-12T01:00:00.000+01:00",
        "dateFin": "2015-12-15T01:00:00.000+01:00",
        "preseance": "20",
        "nominPrincipale": "1",
        "infosQualite": {
          "codeQualite": "Titulaire",
          "libQualite": "Membre titulaire",
          "libQualiteSex": "Membre titulaire"
        },
        "organes": {
          "organeRef": "PO710744"
        }
      },
      {
        "@xsi:type": "MandatSimple_Type",
        "uid": "PM710798",
        "acteurRef": "PA270",
        "legislature": null,
        "typeOrgane": "CMP",
        "dateDebut": "2015-12-14T01:00:00.000+01:00",
        "datePublication": "2015-12-15T01:00:00.000+01:00",
        "dateFin": "2015-12-15T01:00:00.000+01:00",
        "preseance": "1",
        "nominPrincipale": "1",
        "infosQualite": {
          "codeQualite": "Président",
          "libQualite": "Président",
          "libQualiteSex": "Présidente"
        },
        "organes": {
          "organeRef": "PO710744"
        }
      },
      {
        "@xsi:type": "MandatSimple_Type",
        "uid": "PM711164",
        "acteurRef": "PA270",
        "legislature": null,
        "typeOrgane": "ORGAINT",
        "dateDebut": "2012-10-11T02:00:00.000+02:00",
        "datePublication": null,
        "dateFin": "2014-09-30T02:00:00.000+02:00",
        "preseance": "10",
        "nominPrincipale": "1",
        "infosQualite": {
          "codeQualite": "Vice-Président délégué",
          "libQualite": "Vice-Président délégué",
          "libQualiteSex": "Vice-Présidente déléguée"
        },
        "organes": {
          "organeRef": "PO201115"
        }
      }
    ]
  }
}