{
  "uid": {
    "@xsi:type": "IdActeur_type",
    "#text": "PA703522"
  },
  "etatCivil": {
    "ident": {
      "civ": "M.",
      "prenom": "François",
      "nom": "Bonhomme",
      "alpha": "BONHOMME_Francois",
      "trigramme": null
    },
    "infoNaissance": {
      "dateNais": "1969-05-05T01:00:00.000+01:00",
      "villeNais": null,
      "depNais": null,
      "paysNais": null
    },
    "dateDeces": null
  },
  "uri_hatvp": null,
  "mandats": {
    "mandat": [
      {
        "@xsi:type": "MandatSimple_Type",
        "uid": "PM708367",
        "acteurRef": "PA703522",
        "legislature": null,
        "typeOrgane": "CMP",
        "dateDebut": "2015-06-05T02:00:00.000+02:00",
        "datePublication": "2015-06-05T02:00:00.000+02:00",
        "dateFin": "2015-06-11T02:00:00.000+02:00",
        "preseance": "28",
        "nominPrincipale": "1",
        "infosQualite": {
          "codeQualite": "Suppléant",
          "libQualite": "Membre suppléant",
          "libQualiteSex": "Membre suppléant"
        },
        "organes": {
          "organeRef": "PO707805"
        }
      },
      {
        "@xsi:type": "MandatSimple_Type",
        "uid": "PM708394",
        "acteurRef": "PA703522",
        "legislature": null,
        "typeOrgane": "CMP",
        "dateDebut": "2015-06-05T02:00:00.000+02:00",
        "datePublication": "2015-06-05T02:00:00.000+02:00",
        "dateFin": "2015-06-11T02:00:00.000+02:00",
        "preseance": "28",
        "nominPrincipale": "1",
        "infosQualite": {
          "codeQualite": "Suppléant",
          "libQualite": "Membre suppléant",
          "libQualiteSex": "Membre suppléant"
        },
        "organes": {
          "organeRef": "PO707789"
        }
      },
      {
        "@xsi:type": "MandatSimple_Type",
        "uid": "PM716312",
        "acteurRef": "PA703522",
        "legislature": null,
        "typeOrgane": "CMP",
        "dateDebut": "2016-12-20T01:00:00.000+01:00",
        "datePublication": "2016-12-21T01:00:00.000+01:00",
        "dateFin": "2016-12-22T01:00:00.000+01:00",
        "preseance": "20",
        "nominPrincipale": "1",
        "infosQualite": {
          "codeQualite": "Titulaire",
          "libQualite": "Membre titulaire",
          "libQualiteSex": "Membre titulaire"
        },
        "organes": {
          "organeRef": "PO716278"
        }
      },
      {
        "@xsi:type": "MandatParlementaire_type",
        "uid": "PM703702",
        "acteurRef": "PA703522",
        "legislature": null,
        "typeOrgane": "SENAT",
        "dateDebut": "2014-10-01T02:00:00.000+02:00",
        "datePublication": null,
        "dateFin": null,
        "preseance": "20",
        "nominPrincipale": "1",
        "infosQualite": {
          "codeQualite": "Sénateur",
          "libQualite": "SENATEUR",
          "libQualiteSex": "SENATEUR"
        },
        "organes": {
          "organeRef": "PO78718"
        },
        "suppleants": null,
        "election": {
          "lieu": {
            "region": null,
            "regionType": null,
            "departement": null,
            "numDepartement": "82",
            "numCirco": null
          },
          "causeMandat": null
        },
        "InfosHorsSIAN": {
          "HATVP_URI": null
        },
        "mandature": {
          "datePriseFonction": null,
          "causeFin": null,
          "premiereElection": null,
          "placeHemicycle": null,
          "mandatRemplaceRef": null
        }
      },
      {
        "@xsi:type": "MandatSimple_Type",
        "uid": "PM704029",
        "acteurRef": "PA703522",
        "legislature": null,
        "typeOrgane": "COMSENAT",
        "dateDebut": "2014-10-08T02:00:00.000+02:00",
        "datePublication": null,
        "dateFin": null,
        "preseance": "10",
        "nominPrincipale": "1",
        "infosQualite": {
          "codeQualite": "Membre",
          "libQualite": "Membre",
          "libQualiteSex": "Membre"
        },
        "organes": {
          "organeRef": "PO211495"
        }
      },
      {
        "@xsi:type": "MandatSimple_Type",
        "uid": "PM704354",
        "acteurRef": "PA703522",
        "legislature": null,
        "typeOrgane": "GROUPESENAT",
        "dateDebut": "2014-10-07T02:00:00.000+02:00",
        "datePublication": null,
        "dateFin": null,
        "preseance": "8",
        "nominPrincipale": "1",
        "infosQualite": {
          "codeQualite": "Membre apparenté",
          "libQualite": "Membre apparenté",
          "libQualiteSex": "Membre apparenté"
        },
        "organes": {
          "organeRef": "PO286005"
        }
      },
      {
        "@xsi:type": "MandatSimple_Type",
        "uid": "PM734165",
        "acteurRef": "PA703522",
        "legislature": null,
        "typeOrgane": "CMP",
        "dateDebut": "2017-07-28T02:00:00.000+02:00",
        "datePublication": "2017-07-28T02:00:00.000+02:00",
        "dateFin": "2017-08-01T02:00:00.000+02:00",
        "preseance": "28",
        "nominPrincipale": "1",
        "infosQualite": {
          "codeQualite": "Suppléant",
          "libQualite": "Membre suppléant",
          "libQualiteSex": "Membre suppléant"
        },
        "organes": {
          "organeRef": "PO733946"
        }
      },
      {
        "@xsi:type": "MandatSimple_Type",
        "uid": "PM734204",
        "acteurRef": "PA703522",
        "legislature": null,
        "typeOrgane": "CMP",
        "dateDebut": "2017-07-28T02:00:00.000+02:00",
        "datePublication": "2017-07-28T02:00:00.000+02:00",
        "dateFin": "2017-08-01T02:00:00.000+02:00",
        "preseance": "28",
        "nominPrincipale": "1",
        "infosQualite": {
          "codeQualite": "Suppléant",
          "libQualite": "Membre suppléant",
          "libQualiteSex": "Membre suppléant"
        },
        "organes": {
          "organeRef": "PO733952"
        }
      },
      {
        "@xsi:type": "MandatSimple_Type",
        "uid": "PM708797",
        "acteurRef": "PA703522",
        "legislature": null,
        "typeOrgane": "CMP",
        "dateDebut": "2015-07-01T02:00:00.000+02:00",
        "datePublication": "2015-07-02T02:00:00.000+02:00",
        "dateFin": "2015-07-03T02:00:00.000+02:00",
        "preseance": "28",
        "nominPrincipale": "1",
        "infosQualite": {
          "codeQualite": "Suppléant",
          "libQualite": "Membre suppléant",
          "libQualiteSex": "Membre suppléant"
        },
        "organes": {
          "organeRef": "PO708719"
        }
      },
      {
        "@xsi:type": "MandatSimple_Type",
        "uid": "PM708902",
        "acteurRef": "PA703522",
        "legislature": null,
        "typeOrgane": "CMP",
        "dateDebut": "2015-07-08T02:00:00.000+02:00",
        "datePublication": "2015-07-09T02:00:00.000+02:00",
        "dateFin": "2015-07-10T02:00:00.000+02:00",
        "preseance": "28",
        "nominPrincipale": "1",
        "infosQualite": {
          "codeQualite": "Suppléant",
          "libQualite": "Membre suppléant",
          "libQualiteSex": "Membre suppléant"
        },
        "organes": {
          "organeRef": "PO708847"
        }
      },
      {
        "@xsi:type": "MandatSimple_Type",
        "uid": "PM715620",
        "acteurRef": "PA703522",
        "legislature": null,
        "typeOrgane": "DELEGSENAT",
        "dateDebut": "2016-11-22T01:00:00.000+01:00",
        "datePublication": null,
        "dateFin": null,
        "preseance": "4",
        "nominPrincipale": "1",
        "infosQualite": {
          "codeQualite": "Membre",
          "libQualite": "Membre",
          "libQualiteSex": "Membre"
        },
        "organes": {
          "organeRef": "PO420387"
        }
      },
      {
        "@xsi:type": "MandatSimple_Type",
        "uid": "PM709872",
        "acteurRef": "PA703522",
        "legislature": null,
        "typeOrgane": "CMP",
        "dateDebut": "2015-10-31T01:00:00.000+01:00",
        "datePublication": "2015-10-31T01:00:00.000+01:00",
        "dateFin": "2015-11-04T01:00:00.000+01:00",
        "preseance": "28",
        "nominPrincipale": "1",
        "infosQualite": {
          "codeQualite": "Suppléant",
          "libQualite": "Membre suppléant",
          "libQualiteSex": "Membre suppléant"
        },
        "organes": {
          "organeRef": "PO709833"
        }
      },
      {
        "@xsi:type": "MandatSimple_Type",
        "uid": "PM710098",
        "acteurRef": "PA703522",
        "legislature": null,
        "typeOrgane": "CMP",
        "dateDebut": "2015-11-05T01:00:00.000+01:00",
        "datePublication": "2015-11-13T01:00:00.000+01:00",
        "dateFin": "2015-11-25T01:00:00.000+01:00",
        "preseance": "20",
        "nominPrincipale": "1",
        "infosQualite": {
          "codeQualite": "Titulaire",
          "libQualite": "Membre titulaire",
          "libQualiteSex": "Membre titulaire"
        },
        "organes": {
          "organeRef": "PO709816"
        }
      },
      {
        "@xsi:type": "MandatSimple_Type",
        "uid": "PM710263",
        "acteurRef": "PA703522",
        "legislature": null,
        "typeOrgane": "CMP",
        "dateDebut": "2015-11-05T01:00:00.000+01:00",
        "datePublication": "2015-11-19T01:00:00.000+01:00",
        "dateFin": "2015-11-25T01:00:00.000+01:00",
        "preseance": "28",
        "nominPrincipale": "1",
        "infosQualite": {
          "codeQualite": "Suppléant",
          "libQualite": "Membre suppléant",
          "libQualiteSex": "Membre suppléant"
        },
        "organes": {
          "organeRef": "PO710225"
        }
      },
      {
        "@xsi:type": "MandatSimple_Type",
        "uid": "PM710308",
        "acteurRef": "PA703522",
        "legislature": null,
        "typeOrgane": "CMP",
        "dateDebut": "2015-11-05T01:00:00.000+01:00",
        "datePublication": "2015-11-20T01:00:00.000+01:00",
        "dateFin": "2015-11-25T01:00:00.000+01:00",
        "preseance": "28",
        "nominPrincipale": "1",
        "infosQualite": {
          "codeQualite": "Suppléant",
          "libQualite": "Membre suppléant",
          "libQualiteSex": "Membre suppléant"
        },
        "organes": {
          "organeRef": "PO710231"
        }
      },
      {
        "@xsi:type": "MandatSimple_Type",
        "uid": "PM711405",
        "acteurRef": "PA703522",
        "legislature": null,
        "typeOrgane": "CMP",
        "dateDebut": "2016-02-04T01:00:00.000+01:00",
        "datePublication": "2016-02-05T01:00:00.000+01:00",
        "dateFin": "2016-03-09T01:00:00.000+01:00",
        "preseance": "20",
        "nominPrincipale": "1",
        "infosQualite": {
          "codeQualite": "Titulaire",
          "libQualite": "Membre titulaire",
          "libQualiteSex": "Membre titulaire"
        },
        "organes": {
          "organeRef": "PO711331"
        }
      },
      {
        "@xsi:type": "MandatSimple_Type",
        "uid": "PM711523",
        "acteurRef": "PA703522",
        "legislature": null,
        "typeOrgane": "CMP",
        "dateDebut": "2016-02-10T01:00:00.000+01:00",
        "datePublication": "2016-02-11T01:00:00.000+01:00",
        "dateFin": "2016-03-09T01:00:00.000+01:00",
        "preseance": "16",
        "nominPrincipale": "1",
        "infosQualite": {
          "codeQualite": "Rapporteur",
          "libQualite": "Rapporteur",
          "libQualiteSex": "Rapporteur"
        },
        "organes": {
          "organeRef": "PO711331"
        }
      },
      {
        "@xsi:type": "MandatSimple_Type",
        "uid": "PM711980",
        "acteurRef": "PA703522",
        "legislature": null,
        "typeOrgane": "CMP",
        "dateDebut": "2016-03-02T01:00:00.000+01:00",
        "datePublication": "2016-03-18T01:00:00.000+01:00",
        "dateFin": "2016-03-30T02:00:00.000+02:00",
        "preseance": "28",
        "nominPrincipale": "1",
        "infosQualite": {
          "codeQualite": "Suppléant",
          "libQualite": "Membre suppléant",
          "libQualiteSex": "Membre suppléant"
        },
        "organes": {
          "organeRef": "PO711322"
        }
      },
      {
        "@xsi:type": "MandatSimple_Type",
        "uid": "PM748830",
        "acteurRef": "PA703522",
        "legislature": null,
        "typeOrgane": "COMSPSENAT",
        "dateDebut": "2018-01-31T01:00:00.000+01:00",
        "datePublication": null,
        "dateFin": null,
        "preseance": null,
        "nominPrincipale": "1",
        "infosQualite": {
          "codeQualite": null,
          "libQualite": "Membre",
          "libQualiteSex": "Membre"
        },
        "organes": {
          "organeRef": "PO748821"
        }
      },
      {
        "@xsi:type": "MandatSimple_Type",
        "uid": "PM741469",
        "acteurRef": "PA703522",
        "legislature": null,
        "typeOrgane": "DELEGSENAT",
        "dateDebut": "2017-10-18T02:00:00.000+02:00",
        "datePublication": null,
        "dateFin": null,
        "preseance": "4",
        "nominPrincipale": "1",
        "infosQualite": {
          "codeQualite": "Membre",
          "libQualite": "Membre",
          "libQualiteSex": "Membre"
        },
        "organes": {
          "organeRef": "PO420387"
        }
      },
      {
        "@xsi:type": "MandatSimple_Type",
        "uid": "PM742200",
        "acteurRef": "PA703522",
        "legislature": null,
        "typeOrgane": "DELEGSENAT",
        "dateDebut": "2017-10-26T02:00:00.000+02:00",
        "datePublication": null,
        "dateFin": null,
        "preseance": null,
        "nominPrincipale": "1",
        "infosQualite": {
          "codeQualite": null,
          "libQualite": "Secrétaire",
          "libQualiteSex": "Secrétaire"
        },
        "organes": {
          "organeRef": "PO420387"
        }
      },
      {
        "@xsi:type": "MandatSimple_Type",
        "uid": "PM743230",
        "acteurRef": "PA703522",
        "legislature": null,
        "typeOrgane": "ORGAINT",
        "dateDebut": "2017-11-08T01:00:00.000+01:00",
        "datePublication": null,
        "dateFin": null,
        "preseance": "42",
        "nominPrincipale": "1",
        "infosQualite": {
          "codeQualite": "Membre",
          "libQualite": "Membre",
          "libQualiteSex": "Membre"
        },
        "organes": {
          "organeRef": "PO206064"
        }
      },
      {
        "@xsi:type": "MandatSimple_Type",
        "uid": "PM744631",
        "acteurRef": "PA703522",
        "legislature": null,
        "typeOrgane": "CMP",
        "dateDebut": "2017-11-30T01:00:00.000+01:00",
        "datePublication": "2017-12-02T01:00:00.000+01:00",
        "dateFin": "2017-12-18T01:00:00.000+01:00",
        "preseance": "28",
        "nominPrincipale": "1",
        "infosQualite": {
          "codeQualite": "Suppléant",
          "libQualite": "Membre suppléant",
          "libQualiteSex": "Membre suppléant"
        },
        "organes": {
          "organeRef": "PO744418"
        }
      },
      {
        "@xsi:type": "MandatSimple_Type",
        "uid": "PM746543",
        "acteurRef": "PA703522",
        "legislature": null,
        "typeOrgane": "CMP",
        "dateDebut": "2017-12-15T01:00:00.000+01:00",
        "datePublication": "2017-12-16T01:00:00.000+01:00",
        "dateFin": "2017-12-21T01:00:00.000+01:00",
        "preseance": "28",
        "nominPrincipale": "1",
        "infosQualite": {
          "codeQualite": "Suppléant",
          "libQualite": "Membre suppléant",
          "libQualiteSex": "Membre suppléant"
        },
        "organes": {
          "organeRef": "PO746520"
        }
      },
      {
        "@xsi:type": "MandatSimple_Type",
        "uid": "PM747784",
        "acteurRef": "PA703522",
        "legislature": null,
        "typeOrgane": "COMSPSENAT",
        "dateDebut": "2018-01-17T01:00:00.000+01:00",
        "datePublication": null,
        "dateFin": "2018-01-30T01:00:00.000+01:00",
        "preseance": null,
        "nominPrincipale": "1",
        "infosQualite": {
          "codeQualite": null,
          "libQualite": "Membre",
          "libQualiteSex": "Membre"
        },
        "organes": {
          "organeRef": "PO747777"
        }
      }
    ]
  }
}