{
  "@xsi:type": "OrganeExterne_Type",
  "uid": "PO729999",
  "codeType": "MINISTERE",
  "libelle": "Ministère de l'éducation nationale",
  "libelleEdition": "de l'éducation nationale",
  "libelleAbrege": "Éducation nationale",
  "libelleAbrev": "MEN",
  "viMoDe": {
    "dateDebut": "2017-06-22T02:00:00.000+02:00",
    "dateAgrement": null,
    "dateFin": null
  }
}