{
  "uid": {
    "@xsi:type": "IdActeur_type",
    "#text": "PA1789"
  },
  "etatCivil": {
    "ident": {
      "civ": "Mme",
      "prenom": "Conchita",
      "nom": "Lacuey",
      "alpha": "Lacuey",
      "trigramme": null
    },
    "infoNaissance": {
      "dateNais": "1943-09-30T02:00:00.000+02:00",
      "villeNais": "Bordeaux",
      "depNais": "Gironde",
      "paysNais": null
    },
    "dateDeces": null
  },
  "uri_hatvp": null,
  "mandats": {
    "mandat": [
      {
        "@xsi:type": "MandatParlementaire_type",
        "uid": "PM645426",
        "acteurRef": "PA1789",
        "legislature": "14",
        "typeOrgane": "ASSEMBLEE",
        "dateDebut": "2012-06-20T02:00:00.000+02:00",
        "datePublication": null,
        "dateFin": "2017-06-20T02:00:00.000+02:00",
        "preseance": "50",
        "nominPrincipale": "1",
        "infosQualite": {
          "codeQualite": "membre",
          "libQualite": "membre",
          "libQualiteSex": "membre"
        },
        "organes": {
          "organeRef": "PO644420"
        },
        "suppleants": {
          "suppleant": {
            "dateDebut": "2012-06-20T02:00:00.000+02:00",
            "dateFin": "2017-06-20T02:00:00.000+02:00",
            "suppleantRef": "PA1008"
          }
        },
        "election": {
          "lieu": {
            "region": "Nouvelle-Aquitaine",
            "regionType": "Métropolitain",
            "departement": "Gironde",
            "numDepartement": "33",
            "numCirco": "4"
          },
          "causeMandat": "élections générales",
          "refCirconscription": "PO644567"
        },
        "mandature": {
          "datePriseFonction": "2012-06-20T02:00:00.000+02:00",
          "causeFin": "Fin de législature",
          "premiereElection": "1",
          "placeHemicycle": null,
          "mandatRemplaceRef": null
        }
      },
      {
        "@xsi:type": "MandatSimple_Type",
        "uid": "PM656187",
        "acteurRef": "PA1789",
        "legislature": "14",
        "typeOrgane": "GP",
        "dateDebut": "2012-06-26T02:00:00.000+02:00",
        "datePublication": "2012-06-27T02:00:00.000+02:00",
        "dateFin": "2016-05-24T02:00:00.000+02:00",
        "preseance": "20",
        "nominPrincipale": "1",
        "infosQualite": {
          "codeQualite": "Membre",
          "libQualite": "Membre du",
          "libQualiteSex": "Membre du"
        },
        "organes": {
          "organeRef": "PO656002"
        }
      },
      {
        "@xsi:type": "MandatSimple_Type",
        "uid": "PM657487",
        "acteurRef": "PA1789",
        "legislature": "14",
        "typeOrgane": "COMPER",
        "dateDebut": "2012-06-28T02:00:00.000+02:00",
        "datePublication": "2012-06-28T02:00:00.000+02:00",
        "dateFin": "2017-06-20T02:00:00.000+02:00",
        "preseance": "32",
        "nominPrincipale": "1",
        "infosQualite": {
          "codeQualite": "Membre",
          "libQualite": "Membre",
          "libQualiteSex": "Membre"
        },
        "organes": {
          "organeRef": "PO420120"
        }
      },
      {
        "@xsi:type": "MandatSimple_Type",
        "uid": "PM663990",
        "acteurRef": "PA1789",
        "legislature": "14",
        "typeOrgane": "DELEG",
        "dateDebut": "2012-07-04T02:00:00.000+02:00",
        "datePublication": "2012-07-04T02:00:00.000+02:00",
        "dateFin": "2017-06-20T02:00:00.000+02:00",
        "preseance": "20",
        "nominPrincipale": "1",
        "infosQualite": {
          "codeQualite": "Membre",
          "libQualite": "Membre",
          "libQualiteSex": "Membre"
        },
        "organes": {
          "organeRef": "PO201269"
        }
      },
      {
        "@xsi:type": "MandatSimple_Type",
        "uid": "PM665179",
        "acteurRef": "PA1789",
        "legislature": "14",
        "typeOrgane": "DELEG",
        "dateDebut": "2012-07-05T02:00:00.000+02:00",
        "datePublication": "2012-07-05T02:00:00.000+02:00",
        "dateFin": "2017-06-20T02:00:00.000+02:00",
        "preseance": "8",
        "nominPrincipale": "1",
        "infosQualite": {
          "codeQualite": "Vice-Président",
          "libQualite": "Vice-Président",
          "libQualiteSex": "Vice-Présidente"
        },
        "organes": {
          "organeRef": "PO201269"
        }
      },
      {
        "@xsi:type": "MandatSimple_Type",
        "uid": "PM681448",
        "acteurRef": "PA1789",
        "legislature": "14",
        "typeOrgane": "GA",
        "dateDebut": "2012-10-16T02:00:00.000+02:00",
        "datePublication": null,
        "dateFin": "2017-06-20T02:00:00.000+02:00",
        "preseance": "20",
        "nominPrincipale": "1",
        "infosQualite": {
          "codeQualite": "Membre",
          "libQualite": "Membre",
          "libQualiteSex": "Membre"
        },
        "organes": {
          "organeRef": "PO675730"
        }
      },
      {
        "@xsi:type": "MandatSimple_Type",
        "uid": "PM685802",
        "acteurRef": "PA1789",
        "legislature": null,
        "typeOrgane": "PARPOL",
        "dateDebut": "2012-12-01T01:00:00.000+01:00",
        "datePublication": null,
        "dateFin": "2017-06-20T02:00:00.000+02:00",
        "preseance": "5",
        "nominPrincipale": "1",
        "infosQualite": {
          "codeQualite": "Membre",
          "libQualite": "Membre",
          "libQualiteSex": "Membre"
        },
        "organes": {
          "organeRef": "PO684932"
        }
      },
      {
        "@xsi:type": "MandatSimple_Type",
        "uid": "PM687358",
        "acteurRef": "PA1789",
        "legislature": "14",
        "typeOrgane": "GA",
        "dateDebut": "2012-11-27T01:00:00.000+01:00",
        "datePublication": null,
        "dateFin": "2017-06-20T02:00:00.000+02:00",
        "preseance": "8",
        "nominPrincipale": "1",
        "infosQualite": {
          "codeQualite": "Vice-Président",
          "libQualite": "Vice-Président",
          "libQualiteSex": "Vice-Présidente"
        },
        "organes": {
          "organeRef": "PO675730"
        }
      },
      {
        "@xsi:type": "MandatSimple_Type",
        "uid": "PM693976",
        "acteurRef": "PA1789",
        "legislature": "14",
        "typeOrgane": "GE",
        "dateDebut": "2013-04-18T02:00:00.000+02:00",
        "datePublication": null,
        "dateFin": "2017-06-20T02:00:00.000+02:00",
        "preseance": "20",
        "nominPrincipale": "1",
        "infosQualite": {
          "codeQualite": "Membre",
          "libQualite": "Membre",
          "libQualiteSex": "Membre"
        },
        "organes": {
          "organeRef": "PO686896"
        }
      },
      {
        "@xsi:type": "MandatSimple_Type",
        "uid": "PM713248",
        "acteurRef": "PA1789",
        "legislature": "14",
        "typeOrgane": "GP",
        "dateDebut": "2016-05-25T02:00:00.000+02:00",
        "datePublication": null,
        "dateFin": "2017-06-20T02:00:00.000+02:00",
        "preseance": "20",
        "nominPrincipale": "1",
        "infosQualite": {
          "codeQualite": "Membre",
          "libQualite": "Membre du",
          "libQualiteSex": "Membre du"
        },
        "organes": {
          "organeRef": "PO713077"
        }
      }
    ]
  }
}