{
  "uid": {
    "@xsi:type": "IdActeur_type",
    "#text": "PA429845"
  },
  "etatCivil": {
    "ident": {
      "civ": "M.",
      "prenom": "Ronan",
      "nom": "Dantec",
      "alpha": "DANTEC_RONAN_11065P",
      "trigramme": null
    },
    "infoNaissance": {
      "dateNais": "1963-08-05T01:00:00.000+01:00",
      "villeNais": null,
      "depNais": null,
      "paysNais": null
    },
    "dateDeces": null
  },
  "uri_hatvp": null,
  "mandats": {
    "mandat": [
      {
        "@xsi:type": "MandatParlementaire_type",
        "uid": "PM430023",
        "acteurRef": "PA429845",
        "legislature": null,
        "typeOrgane": "SENAT",
        "dateDebut": "2011-10-01T02:00:00.000+02:00",
        "datePublication": null,
        "dateFin": "2017-10-01T02:00:00.000+02:00",
        "preseance": "20",
        "nominPrincipale": "1",
        "infosQualite": {
          "codeQualite": "Sénateur",
          "libQualite": "SENATEUR",
          "libQualiteSex": "SENATEUR"
        },
        "organes": {
          "organeRef": "PO78718"
        },
        "suppleants": null,
        "election": {
          "lieu": {
            "region": null,
            "regionType": null,
            "departement": null,
            "numDepartement": "44",
            "numCirco": null
          },
          "causeMandat": null
        },
        "InfosHorsSIAN": {
          "HATVP_URI": null
        },
        "mandature": {
          "datePriseFonction": null,
          "causeFin": null,
          "premiereElection": null,
          "placeHemicycle": null,
          "mandatRemplaceRef": null
        }
      },
      {
        "@xsi:type": "MandatSimple_Type",
        "uid": "PM476919",
        "acteurRef": "PA429845",
        "legislature": null,
        "typeOrgane": "GROUPESENAT",
        "dateDebut": "2012-01-11T01:00:00.000+01:00",
        "datePublication": null,
        "dateFin": "2017-06-29T02:00:00.000+02:00",
        "preseance": "4",
        "nominPrincipale": "1",
        "infosQualite": {
          "codeQualite": "Membre",
          "libQualite": "Membre",
          "libQualiteSex": "Membre"
        },
        "organes": {
          "organeRef": "PO476897"
        }
      },
      {
        "@xsi:type": "MandatSimple_Type",
        "uid": "PM516784",
        "acteurRef": "PA429845",
        "legislature": null,
        "typeOrgane": "COMSENAT",
        "dateDebut": "2012-02-21T01:00:00.000+01:00",
        "datePublication": null,
        "dateFin": "2014-10-07T02:00:00.000+02:00",
        "preseance": null,
        "nominPrincipale": "1",
        "infosQualite": {
          "codeQualite": null,
          "libQualite": "Vice-Président",
          "libQualiteSex": "Vice-Président"
        },
        "organes": {
          "organeRef": "PO516754"
        }
      },
      {
        "@xsi:type": "MandatSimple_Type",
        "uid": "PM517980",
        "acteurRef": "PA429845",
        "legislature": null,
        "typeOrgane": "ORGAINT",
        "dateDebut": "2012-01-31T01:00:00.000+01:00",
        "datePublication": null,
        "dateFin": "2014-09-30T02:00:00.000+02:00",
        "preseance": "42",
        "nominPrincipale": "1",
        "infosQualite": {
          "codeQualite": "Membre",
          "libQualite": "Membre",
          "libQualiteSex": "Membre"
        },
        "organes": {
          "organeRef": "PO206064"
        }
      },
      {
        "@xsi:type": "MandatSimple_Type",
        "uid": "PM685189",
        "acteurRef": "PA429845",
        "legislature": null,
        "typeOrgane": "CMP",
        "dateDebut": "2012-11-29T01:00:00.000+01:00",
        "datePublication": "2012-11-30T01:00:00.000+01:00",
        "dateFin": "2012-12-13T01:00:00.000+01:00",
        "preseance": "28",
        "nominPrincipale": "1",
        "infosQualite": {
          "codeQualite": "Suppléant",
          "libQualite": "Membre suppléant",
          "libQualiteSex": "Membre suppléant"
        },
        "organes": {
          "organeRef": "PO684833"
        }
      },
      {
        "@xsi:type": "MandatSimple_Type",
        "uid": "PM687270",
        "acteurRef": "PA429845",
        "legislature": null,
        "typeOrgane": "CMP",
        "dateDebut": "2012-12-18T01:00:00.000+01:00",
        "datePublication": "2012-12-19T01:00:00.000+01:00",
        "dateFin": "2012-12-19T01:00:00.000+01:00",
        "preseance": "28",
        "nominPrincipale": "1",
        "infosQualite": {
          "codeQualite": "Suppléant",
          "libQualite": "Membre suppléant",
          "libQualiteSex": "Membre suppléant"
        },
        "organes": {
          "organeRef": "PO687144"
        }
      },
      {
        "@xsi:type": "MandatSimple_Type",
        "uid": "PM693749",
        "acteurRef": "PA429845",
        "legislature": null,
        "typeOrgane": "CMP",
        "dateDebut": "2013-04-16T02:00:00.000+02:00",
        "datePublication": "2013-04-17T02:00:00.000+02:00",
        "dateFin": "2013-04-24T02:00:00.000+02:00",
        "preseance": "28",
        "nominPrincipale": "1",
        "infosQualite": {
          "codeQualite": "Suppléant",
          "libQualite": "Membre suppléant",
          "libQualiteSex": "Membre suppléant"
        },
        "organes": {
          "organeRef": "PO693720"
        }
      },
      {
        "@xsi:type": "MandatSimple_Type",
        "uid": "PM695014",
        "acteurRef": "PA429845",
        "legislature": null,
        "typeOrgane": "CMP",
        "dateDebut": "2013-06-05T02:00:00.000+02:00",
        "datePublication": "2013-06-06T02:00:00.000+02:00",
        "dateFin": "2013-07-02T02:00:00.000+02:00",
        "preseance": "20",
        "nominPrincipale": "1",
        "infosQualite": {
          "codeQualite": "Titulaire",
          "libQualite": "Membre titulaire",
          "libQualiteSex": "Membre titulaire"
        },
        "organes": {
          "organeRef": "PO694654"
        }
      },
      {
        "@xsi:type": "MandatParlementaire_type",
        "uid": "PM736278",
        "acteurRef": "PA429845",
        "legislature": null,
        "typeOrgane": "SENAT",
        "dateDebut": "2017-10-02T02:00:00.000+02:00",
        "datePublication": null,
        "dateFin": null,
        "preseance": "20",
        "nominPrincipale": "1",
        "infosQualite": {
          "codeQualite": "Sénateur",
          "libQualite": "SENATEUR",
          "libQualiteSex": "SENATEUR"
        },
        "organes": {
          "organeRef": "PO78718"
        },
        "suppleants": null,
        "election": {
          "lieu": {
            "region": null,
            "regionType": null,
            "departement": null,
            "numDepartement": "44",
            "numCirco": null
          },
          "causeMandat": null
        },
        "InfosHorsSIAN": {
          "HATVP_URI": null
        },
        "mandature": {
          "datePriseFonction": null,
          "causeFin": null,
          "premiereElection": null,
          "placeHemicycle": null,
          "mandatRemplaceRef": null
        }
      },
      {
        "@xsi:type": "MandatSimple_Type",
        "uid": "PM712975",
        "acteurRef": "PA429845",
        "legislature": null,
        "typeOrgane": "CMP",
        "dateDebut": "2016-05-17T02:00:00.000+02:00",
        "datePublication": "2016-05-20T02:00:00.000+02:00",
        "dateFin": "2016-06-01T02:00:00.000+02:00",
        "preseance": "28",
        "nominPrincipale": "1",
        "infosQualite": {
          "codeQualite": "Suppléant",
          "libQualite": "Membre suppléant",
          "libQualiteSex": "Membre suppléant"
        },
        "organes": {
          "organeRef": "PO712837"
        }
      },
      {
        "@xsi:type": "MandatSimple_Type",
        "uid": "PM702023",
        "acteurRef": "PA429845",
        "legislature": null,
        "typeOrgane": "COMSPSENAT",
        "dateDebut": "2014-06-23T02:00:00.000+02:00",
        "datePublication": null,
        "dateFin": "2015-01-17T01:00:00.000+01:00",
        "preseance": null,
        "nominPrincipale": "1",
        "infosQualite": {
          "codeQualite": null,
          "libQualite": "Vice-Président",
          "libQualiteSex": "Vice-Président"
        },
        "organes": {
          "organeRef": "PO701979"
        }
      },
      {
        "@xsi:type": "MandatSimple_Type",
        "uid": "PM701985",
        "acteurRef": "PA429845",
        "legislature": null,
        "typeOrgane": "COMSPSENAT",
        "dateDebut": "2014-06-18T02:00:00.000+02:00",
        "datePublication": null,
        "dateFin": "2014-06-22T02:00:00.000+02:00",
        "preseance": null,
        "nominPrincipale": "1",
        "infosQualite": {
          "codeQualite": null,
          "libQualite": "Membre",
          "libQualiteSex": "Membre"
        },
        "organes": {
          "organeRef": "PO701979"
        }
      },
      {
        "@xsi:type": "MandatSimple_Type",
        "uid": "PM732480",
        "acteurRef": "PA429845",
        "legislature": null,
        "typeOrgane": "GROUPESENAT",
        "dateDebut": "2017-06-30T02:00:00.000+02:00",
        "datePublication": null,
        "dateFin": "2017-10-02T02:00:00.000+02:00",
        "preseance": "4",
        "nominPrincipale": "1",
        "infosQualite": {
          "codeQualite": "Membre",
          "libQualite": "Membre",
          "libQualiteSex": "Membre"
        },
        "organes": {
          "organeRef": "PO77708"
        }
      },
      {
        "@xsi:type": "MandatSimple_Type",
        "uid": "PM704149",
        "acteurRef": "PA429845",
        "legislature": null,
        "typeOrgane": "COMSENAT",
        "dateDebut": "2014-10-08T02:00:00.000+02:00",
        "datePublication": null,
        "dateFin": "2014-10-08T02:00:00.000+02:00",
        "preseance": "10",
        "nominPrincipale": "1",
        "infosQualite": {
          "codeQualite": "Membre",
          "libQualite": "Membre",
          "libQualiteSex": "Membre"
        },
        "organes": {
          "organeRef": "PO516754"
        }
      },
      {
        "@xsi:type": "MandatSimple_Type",
        "uid": "PM704208",
        "acteurRef": "PA429845",
        "legislature": null,
        "typeOrgane": "COMSENAT",
        "dateDebut": "2014-10-09T02:00:00.000+02:00",
        "datePublication": null,
        "dateFin": "2017-10-04T02:00:00.000+02:00",
        "preseance": null,
        "nominPrincipale": "1",
        "infosQualite": {
          "codeQualite": null,
          "libQualite": "Vice-Président",
          "libQualiteSex": "Vice-Président"
        },
        "organes": {
          "organeRef": "PO516754"
        }
      },
      {
        "@xsi:type": "MandatSimple_Type",
        "uid": "PM706478",
        "acteurRef": "PA429845",
        "legislature": null,
        "typeOrgane": "CMP",
        "dateDebut": "2015-03-04T01:00:00.000+01:00",
        "datePublication": "2015-03-07T01:00:00.000+01:00",
        "dateFin": "2015-05-25T02:00:00.000+02:00",
        "preseance": "28",
        "nominPrincipale": "1",
        "infosQualite": {
          "codeQualite": "Suppléant",
          "libQualite": "Membre suppléant",
          "libQualiteSex": "Membre suppléant"
        },
        "organes": {
          "organeRef": "PO706437"
        }
      },
      {
        "@xsi:type": "MandatSimple_Type",
        "uid": "PM741273",
        "acteurRef": "PA429845",
        "legislature": null,
        "typeOrgane": "COMSENAT",
        "dateDebut": "2017-10-05T02:00:00.000+02:00",
        "datePublication": null,
        "dateFin": null,
        "preseance": null,
        "nominPrincipale": "1",
        "infosQualite": {
          "codeQualite": null,
          "libQualite": "Vice-Président",
          "libQualiteSex": "Vice-Président"
        },
        "organes": {
          "organeRef": "PO516754"
        }
      },
      {
        "@xsi:type": "MandatSimple_Type",
        "uid": "PM741379",
        "acteurRef": "PA429845",
        "legislature": null,
        "typeOrgane": "DELEGSENAT",
        "dateDebut": "2017-10-18T02:00:00.000+02:00",
        "datePublication": null,
        "dateFin": null,
        "preseance": "4",
        "nominPrincipale": "1",
        "infosQualite": {
          "codeQualite": "Membre",
          "libQualite": "Membre",
          "libQualiteSex": "Membre"
        },
        "organes": {
          "organeRef": "PO420388"
        }
      },
      {
        "@xsi:type": "MandatSimple_Type",
        "uid": "PM741565",
        "acteurRef": "PA429845",
        "legislature": null,
        "typeOrgane": "GROUPESENAT",
        "dateDebut": "2017-10-03T02:00:00.000+02:00",
        "datePublication": null,
        "dateFin": null,
        "preseance": "8",
        "nominPrincipale": "1",
        "infosQualite": {
          "codeQualite": "Membre rattaché",
          "libQualite": "Membre rattaché",
          "libQualiteSex": "Membre rattaché"
        },
        "organes": {
          "organeRef": "PO77714"
        }
      },
      {
        "@xsi:type": "MandatSimple_Type",
        "uid": "PM742178",
        "acteurRef": "PA429845",
        "legislature": null,
        "typeOrgane": "DELEGSENAT",
        "dateDebut": "2017-10-26T02:00:00.000+02:00",
        "datePublication": null,
        "dateFin": null,
        "preseance": null,
        "nominPrincipale": "1",
        "infosQualite": {
          "codeQualite": null,
          "libQualite": "Vice-Président",
          "libQualiteSex": "Vice-Président"
        },
        "organes": {
          "organeRef": "PO420388"
        }
      },
      {
        "@xsi:type": "MandatSimple_Type",
        "uid": "PM743240",
        "acteurRef": "PA429845",
        "legislature": null,
        "typeOrgane": "ORGAINT",
        "dateDebut": "2017-11-08T01:00:00.000+01:00",
        "datePublication": null,
        "dateFin": null,
        "preseance": "42",
        "nominPrincipale": "1",
        "infosQualite": {
          "codeQualite": "Membre",
          "libQualite": "Membre",
          "libQualiteSex": "Membre"
        },
        "organes": {
          "organeRef": "PO206064"
        }
      },
      {
        "@xsi:type": "MandatSimple_Type",
        "uid": "PM746496",
        "acteurRef": "PA429845",
        "legislature": null,
        "typeOrgane": "CMP",
        "dateDebut": "2017-12-14T01:00:00.000+01:00",
        "datePublication": "2017-12-15T01:00:00.000+01:00",
        "dateFin": "2018-02-15T01:00:00.000+01:00",
        "preseance": "20",
        "nominPrincipale": "1",
        "infosQualite": {
          "codeQualite": "Titulaire",
          "libQualite": "Membre titulaire",
          "libQualiteSex": "Membre titulaire"
        },
        "organes": {
          "organeRef": "PO739530"
        }
      }
    ]
  }
}