{
  "uid": {
    "@xsi:type": "IdActeur_type",
    "#text": "PA606745"
  },
  "etatCivil": {
    "ident": {
      "civ": "Mme",
      "prenom": "Isabelle",
      "nom": "Bruneau",
      "alpha": "Bruneau",
      "trigramme": null
    },
    "infoNaissance": {
      "dateNais": "1966-03-26T01:00:00.000+01:00",
      "villeNais": "Chateauroux",
      "depNais": "Indre",
      "paysNais": "France"
    },
    "dateDeces": null
  },
  "uri_hatvp": null,
  "mandats": {
    "mandat": [
      {
        "@xsi:type": "MandatParlementaire_type",
        "uid": "PM645560",
        "acteurRef": "PA606745",
        "legislature": "14",
        "typeOrgane": "ASSEMBLEE",
        "dateDebut": "2012-06-20T02:00:00.000+02:00",
        "datePublication": null,
        "dateFin": "2017-06-20T02:00:00.000+02:00",
        "preseance": "50",
        "nominPrincipale": "1",
        "infosQualite": {
          "codeQualite": "membre",
          "libQualite": "membre",
          "libQualiteSex": "membre"
        },
        "organes": {
          "organeRef": "PO644420"
        },
        "suppleants": {
          "suppleant": {
            "dateDebut": "2012-06-20T02:00:00.000+02:00",
            "dateFin": "2017-06-20T02:00:00.000+02:00",
            "suppleantRef": "PA541"
          }
        },
        "election": {
          "lieu": {
            "region": "Centre-Val de Loire",
            "regionType": "Métropolitain",
            "departement": "Indre",
            "numDepartement": "36",
            "numCirco": "2"
          },
          "causeMandat": "élections générales",
          "refCirconscription": "PO644590"
        },
        "mandature": {
          "datePriseFonction": "2012-06-20T02:00:00.000+02:00",
          "causeFin": "Fin de législature",
          "premiereElection": "0",
          "placeHemicycle": null,
          "mandatRemplaceRef": null
        }
      },
      {
        "@xsi:type": "MandatSimple_Type",
        "uid": "PM656070",
        "acteurRef": "PA606745",
        "legislature": "14",
        "typeOrgane": "GP",
        "dateDebut": "2012-06-26T02:00:00.000+02:00",
        "datePublication": "2012-06-27T02:00:00.000+02:00",
        "dateFin": "2016-05-24T02:00:00.000+02:00",
        "preseance": "20",
        "nominPrincipale": "1",
        "infosQualite": {
          "codeQualite": "Membre",
          "libQualite": "Membre du",
          "libQualiteSex": "Membre du"
        },
        "organes": {
          "organeRef": "PO656002"
        }
      },
      {
        "@xsi:type": "MandatSimple_Type",
        "uid": "PM657586",
        "acteurRef": "PA606745",
        "legislature": "14",
        "typeOrgane": "COMPER",
        "dateDebut": "2012-06-28T02:00:00.000+02:00",
        "datePublication": "2012-06-28T02:00:00.000+02:00",
        "dateFin": "2013-09-30T02:00:00.000+02:00",
        "preseance": "32",
        "nominPrincipale": "1",
        "infosQualite": {
          "codeQualite": "Membre",
          "libQualite": "Membre",
          "libQualiteSex": "Membre"
        },
        "organes": {
          "organeRef": "PO419604"
        }
      },
      {
        "@xsi:type": "MandatSimple_Type",
        "uid": "PM680090",
        "acteurRef": "PA606745",
        "legislature": "14",
        "typeOrgane": "GA",
        "dateDebut": "2012-10-12T02:00:00.000+02:00",
        "datePublication": null,
        "dateFin": "2017-06-20T02:00:00.000+02:00",
        "preseance": "20",
        "nominPrincipale": "1",
        "infosQualite": {
          "codeQualite": "Membre",
          "libQualite": "Membre",
          "libQualiteSex": "Membre"
        },
        "organes": {
          "organeRef": "PO675809"
        }
      },
      {
        "@xsi:type": "MandatSimple_Type",
        "uid": "PM680091",
        "acteurRef": "PA606745",
        "legislature": "14",
        "typeOrgane": "GA",
        "dateDebut": "2012-10-12T02:00:00.000+02:00",
        "datePublication": null,
        "dateFin": "2017-06-20T02:00:00.000+02:00",
        "preseance": "20",
        "nominPrincipale": "1",
        "infosQualite": {
          "codeQualite": "Membre",
          "libQualite": "Membre",
          "libQualiteSex": "Membre"
        },
        "organes": {
          "organeRef": "PO675759"
        }
      },
      {
        "@xsi:type": "MandatSimple_Type",
        "uid": "PM680092",
        "acteurRef": "PA606745",
        "legislature": "14",
        "typeOrgane": "GA",
        "dateDebut": "2012-10-12T02:00:00.000+02:00",
        "datePublication": null,
        "dateFin": "2017-06-20T02:00:00.000+02:00",
        "preseance": "20",
        "nominPrincipale": "1",
        "infosQualite": {
          "codeQualite": "Membre",
          "libQualite": "Membre",
          "libQualiteSex": "Membre"
        },
        "organes": {
          "organeRef": "PO675823"
        }
      },
      {
        "@xsi:type": "MandatSimple_Type",
        "uid": "PM680093",
        "acteurRef": "PA606745",
        "legislature": "14",
        "typeOrgane": "GA",
        "dateDebut": "2012-10-12T02:00:00.000+02:00",
        "datePublication": null,
        "dateFin": "2017-06-20T02:00:00.000+02:00",
        "preseance": "20",
        "nominPrincipale": "1",
        "infosQualite": {
          "codeQualite": "Membre",
          "libQualite": "Membre",
          "libQualiteSex": "Membre"
        },
        "organes": {
          "organeRef": "PO675758"
        }
      },
      {
        "@xsi:type": "MandatSimple_Type",
        "uid": "PM685670",
        "acteurRef": "PA606745",
        "legislature": null,
        "typeOrgane": "PARPOL",
        "dateDebut": "2012-12-01T01:00:00.000+01:00",
        "datePublication": null,
        "dateFin": "2017-06-20T02:00:00.000+02:00",
        "preseance": "5",
        "nominPrincipale": "1",
        "infosQualite": {
          "codeQualite": "Membre",
          "libQualite": "Membre",
          "libQualiteSex": "Membre"
        },
        "organes": {
          "organeRef": "PO684932"
        }
      },
      {
        "@xsi:type": "MandatSimple_Type",
        "uid": "PM689718",
        "acteurRef": "PA606745",
        "legislature": "14",
        "typeOrgane": "GE",
        "dateDebut": "2013-01-29T01:00:00.000+01:00",
        "datePublication": null,
        "dateFin": "2017-06-20T02:00:00.000+02:00",
        "preseance": "20",
        "nominPrincipale": "1",
        "infosQualite": {
          "codeQualite": "Membre",
          "libQualite": "Membre",
          "libQualiteSex": "Membre"
        },
        "organes": {
          "organeRef": "PO686617"
        }
      },
      {
        "@xsi:type": "MandatSimple_Type",
        "uid": "PM690320",
        "acteurRef": "PA606745",
        "legislature": "14",
        "typeOrgane": "GA",
        "dateDebut": "2012-11-27T01:00:00.000+01:00",
        "datePublication": null,
        "dateFin": "2017-06-20T02:00:00.000+02:00",
        "preseance": "8",
        "nominPrincipale": "1",
        "infosQualite": {
          "codeQualite": "Vice-Président",
          "libQualite": "Vice-Président",
          "libQualiteSex": "Vice-Présidente"
        },
        "organes": {
          "organeRef": "PO675759"
        }
      },
      {
        "@xsi:type": "MandatSimple_Type",
        "uid": "PM695284",
        "acteurRef": "PA606745",
        "legislature": "14",
        "typeOrgane": "GE",
        "dateDebut": "2013-06-13T02:00:00.000+02:00",
        "datePublication": null,
        "dateFin": "2017-06-20T02:00:00.000+02:00",
        "preseance": "20",
        "nominPrincipale": "1",
        "infosQualite": {
          "codeQualite": "Membre",
          "libQualite": "Membre",
          "libQualiteSex": "Membre"
        },
        "organes": {
          "organeRef": "PO692259"
        }
      },
      {
        "@xsi:type": "MandatSimple_Type",
        "uid": "PM696428",
        "acteurRef": "PA606745",
        "legislature": "14",
        "typeOrgane": "GE",
        "dateDebut": "2013-07-23T02:00:00.000+02:00",
        "datePublication": null,
        "dateFin": "2017-06-20T02:00:00.000+02:00",
        "preseance": "12",
        "nominPrincipale": "1",
        "infosQualite": {
          "codeQualite": "Secrétaire",
          "libQualite": "Secrétaire",
          "libQualiteSex": "Secrétaire"
        },
        "organes": {
          "organeRef": "PO692259"
        }
      },
      {
        "@xsi:type": "MandatSimple_Type",
        "uid": "PM697109",
        "acteurRef": "PA606745",
        "legislature": "14",
        "typeOrgane": "GE",
        "dateDebut": "2013-09-18T02:00:00.000+02:00",
        "datePublication": null,
        "dateFin": "2017-06-20T02:00:00.000+02:00",
        "preseance": "8",
        "nominPrincipale": "1",
        "infosQualite": {
          "codeQualite": "Vice-Président",
          "libQualite": "Vice-Président",
          "libQualiteSex": "Vice-Présidente"
        },
        "organes": {
          "organeRef": "PO686326"
        }
      },
      {
        "@xsi:type": "MandatSimple_Type",
        "uid": "PM697107",
        "acteurRef": "PA606745",
        "legislature": "14",
        "typeOrgane": "GE",
        "dateDebut": "2013-09-18T02:00:00.000+02:00",
        "datePublication": null,
        "dateFin": "2017-06-20T02:00:00.000+02:00",
        "preseance": "20",
        "nominPrincipale": "0",
        "infosQualite": {
          "codeQualite": "Membre",
          "libQualite": "Membre",
          "libQualiteSex": "Membre"
        },
        "organes": {
          "organeRef": "PO686326"
        }
      },
      {
        "@xsi:type": "MandatSimple_Type",
        "uid": "PM697232",
        "acteurRef": "PA606745",
        "legislature": "14",
        "typeOrgane": "COMPER",
        "dateDebut": "2013-10-01T02:00:00.000+02:00",
        "datePublication": "2013-10-01T02:00:00.000+02:00",
        "dateFin": "2017-06-20T02:00:00.000+02:00",
        "preseance": "32",
        "nominPrincipale": "1",
        "infosQualite": {
          "codeQualite": "Membre",
          "libQualite": "Membre",
          "libQualiteSex": "Membre"
        },
        "organes": {
          "organeRef": "PO59046"
        }
      },
      {
        "@xsi:type": "MandatAvecSuppleant_Type",
        "uid": "PM697698",
        "acteurRef": "PA606745",
        "legislature": "14",
        "typeOrgane": "COMNL",
        "dateDebut": "2013-10-11T02:00:00.000+02:00",
        "datePublication": "2013-10-11T02:00:00.000+02:00",
        "dateFin": "2017-06-20T02:00:00.000+02:00",
        "preseance": "20",
        "nominPrincipale": "1",
        "infosQualite": {
          "codeQualite": "Membre",
          "libQualite": "Membre",
          "libQualiteSex": "Membre"
        },
        "organes": {
          "organeRef": "PO415287"
        },
        "suppleants": null
      },
      {
        "@xsi:type": "MandatSimple_Type",
        "uid": "PM713129",
        "acteurRef": "PA606745",
        "legislature": "14",
        "typeOrgane": "GP",
        "dateDebut": "2016-05-25T02:00:00.000+02:00",
        "datePublication": null,
        "dateFin": "2017-06-20T02:00:00.000+02:00",
        "preseance": "20",
        "nominPrincipale": "1",
        "infosQualite": {
          "codeQualite": "Membre",
          "libQualite": "Membre du",
          "libQualiteSex": "Membre du"
        },
        "organes": {
          "organeRef": "PO713077"
        }
      },
      {
        "@xsi:type": "MandatSimple_Type",
        "uid": "PM705960",
        "acteurRef": "PA606745",
        "legislature": "14",
        "typeOrgane": "GE",
        "dateDebut": "2015-01-27T01:00:00.000+01:00",
        "datePublication": null,
        "dateFin": "2017-06-20T02:00:00.000+02:00",
        "preseance": "20",
        "nominPrincipale": "1",
        "infosQualite": {
          "codeQualite": "Membre",
          "libQualite": "Membre",
          "libQualiteSex": "Membre"
        },
        "organes": {
          "organeRef": "PO705526"
        }
      },
      {
        "@xsi:type": "MandatSimple_Type",
        "uid": "PM709184",
        "acteurRef": "PA606745",
        "legislature": "14",
        "typeOrgane": "ORGEXTPARL",
        "dateDebut": "2015-06-24T02:00:00.000+02:00",
        "datePublication": "2015-06-24T02:00:00.000+02:00",
        "dateFin": "2017-06-20T02:00:00.000+02:00",
        "preseance": "20",
        "nominPrincipale": "1",
        "infosQualite": {
          "codeQualite": "Titulaire",
          "libQualite": "Membre titulaire",
          "libQualiteSex": "Membre titulaire"
        },
        "organes": {
          "organeRef": "PO709182"
        }
      },
      {
        "@xsi:type": "MandatSimple_Type",
        "uid": "PM712216",
        "acteurRef": "PA606745",
        "legislature": "14",
        "typeOrgane": "CNPE",
        "dateDebut": "2016-03-30T02:00:00.000+02:00",
        "datePublication": "2016-03-31T02:00:00.000+02:00",
        "dateFin": "2016-09-20T02:00:00.000+02:00",
        "preseance": "20",
        "nominPrincipale": "1",
        "infosQualite": {
          "codeQualite": "Membre",
          "libQualite": "Membre",
          "libQualiteSex": "Membre"
        },
        "organes": {
          "organeRef": "PO712082"
        }
      }
    ]
  }
}