{
  "uid": {
    "@xsi:type": "IdActeur_type",
    "#text": "PA429836"
  },
  "etatCivil": {
    "ident": {
      "civ": "Mme",
      "prenom": "Laurence",
      "nom": "Cohen",
      "alpha": "COHEN_LAURENCE_11031D",
      "trigramme": null
    },
    "infoNaissance": {
      "dateNais": "1953-01-15T01:00:00.000+01:00",
      "villeNais": null,
      "depNais": null,
      "paysNais": null
    },
    "dateDeces": null
  },
  "uri_hatvp": null,
  "mandats": {
    "mandat": [
      {
        "@xsi:type": "MandatParlementaire_type",
        "uid": "PM430049",
        "acteurRef": "PA429836",
        "legislature": null,
        "typeOrgane": "SENAT",
        "dateDebut": "2011-10-01T02:00:00.000+02:00",
        "datePublication": null,
        "dateFin": "2017-10-01T02:00:00.000+02:00",
        "preseance": "20",
        "nominPrincipale": "1",
        "infosQualite": {
          "codeQualite": "Sénateur",
          "libQualite": "SENATEUR",
          "libQualiteSex": "Sénateur 5ème République"
        },
        "organes": {
          "organeRef": "PO78718"
        },
        "suppleants": null,
        "election": {
          "lieu": {
            "region": null,
            "regionType": null,
            "departement": null,
            "numDepartement": "94",
            "numCirco": null
          },
          "causeMandat": null
        },
        "InfosHorsSIAN": {
          "HATVP_URI": null
        },
        "mandature": {
          "datePriseFonction": null,
          "causeFin": null,
          "premiereElection": null,
          "placeHemicycle": null,
          "mandatRemplaceRef": null
        }
      },
      {
        "@xsi:type": "MandatSimple_Type",
        "uid": "PM430318",
        "acteurRef": "PA429836",
        "legislature": null,
        "typeOrgane": "COMSENAT",
        "dateDebut": "2011-10-01T02:00:00.000+02:00",
        "datePublication": null,
        "dateFin": "2014-10-08T02:00:00.000+02:00",
        "preseance": "10",
        "nominPrincipale": "1",
        "infosQualite": {
          "codeQualite": "Membre",
          "libQualite": "Membre",
          "libQualiteSex": "Membre"
        },
        "organes": {
          "organeRef": "PO211493"
        }
      },
      {
        "@xsi:type": "MandatSimple_Type",
        "uid": "PM430546",
        "acteurRef": "PA429836",
        "legislature": null,
        "typeOrgane": "GROUPESENAT",
        "dateDebut": "2011-10-01T02:00:00.000+02:00",
        "datePublication": null,
        "dateFin": null,
        "preseance": "4",
        "nominPrincipale": "1",
        "infosQualite": {
          "codeQualite": "Membre",
          "libQualite": "Membre",
          "libQualiteSex": "Membre du"
        },
        "organes": {
          "organeRef": "PO77707"
        }
      },
      {
        "@xsi:type": "MandatSimple_Type",
        "uid": "PM436956",
        "acteurRef": "PA429836",
        "legislature": null,
        "typeOrgane": "DELEGSENAT",
        "dateDebut": "2011-11-30T01:00:00.000+01:00",
        "datePublication": null,
        "dateFin": null,
        "preseance": "4",
        "nominPrincipale": "1",
        "infosQualite": {
          "codeQualite": "Membre",
          "libQualite": "Membre",
          "libQualiteSex": "Membre"
        },
        "organes": {
          "organeRef": "PO310693"
        }
      },
      {
        "@xsi:type": "MandatSimple_Type",
        "uid": "PM698551",
        "acteurRef": "PA429836",
        "legislature": null,
        "typeOrgane": "CMP",
        "dateDebut": "2013-11-15T01:00:00.000+01:00",
        "datePublication": "2013-11-16T01:00:00.000+01:00",
        "dateFin": "2013-11-19T01:00:00.000+01:00",
        "preseance": "20",
        "nominPrincipale": "1",
        "infosQualite": {
          "codeQualite": "Titulaire",
          "libQualite": "Membre titulaire",
          "libQualiteSex": "Membre titulaire"
        },
        "organes": {
          "organeRef": "PO698519"
        }
      },
      {
        "@xsi:type": "MandatParlementaire_type",
        "uid": "PM736345",
        "acteurRef": "PA429836",
        "legislature": null,
        "typeOrgane": "SENAT",
        "dateDebut": "2017-10-02T02:00:00.000+02:00",
        "datePublication": null,
        "dateFin": null,
        "preseance": "20",
        "nominPrincipale": "1",
        "infosQualite": {
          "codeQualite": "Sénateur",
          "libQualite": "SENATEUR",
          "libQualiteSex": "Sénateur 5ème République"
        },
        "organes": {
          "organeRef": "PO78718"
        },
        "suppleants": null,
        "election": {
          "lieu": {
            "region": null,
            "regionType": null,
            "departement": null,
            "numDepartement": "94",
            "numCirco": null
          },
          "causeMandat": null
        },
        "InfosHorsSIAN": {
          "HATVP_URI": null
        },
        "mandature": {
          "datePriseFonction": null,
          "causeFin": null,
          "premiereElection": null,
          "placeHemicycle": null,
          "mandatRemplaceRef": null
        }
      },
      {
        "@xsi:type": "MandatSimple_Type",
        "uid": "PM699906",
        "acteurRef": "PA429836",
        "legislature": null,
        "typeOrgane": "COMSPSENAT",
        "dateDebut": "2014-01-22T01:00:00.000+01:00",
        "datePublication": null,
        "dateFin": "2014-02-04T01:00:00.000+01:00",
        "preseance": null,
        "nominPrincipale": "1",
        "infosQualite": {
          "codeQualite": null,
          "libQualite": "Membre",
          "libQualiteSex": null
        },
        "organes": {
          "organeRef": "PO699895"
        }
      },
      {
        "@xsi:type": "MandatSimple_Type",
        "uid": "PM699990",
        "acteurRef": "PA429836",
        "legislature": null,
        "typeOrgane": "COMSPSENAT",
        "dateDebut": "2014-02-05T01:00:00.000+01:00",
        "datePublication": null,
        "dateFin": "2016-04-13T02:00:00.000+02:00",
        "preseance": null,
        "nominPrincipale": "1",
        "infosQualite": {
          "codeQualite": null,
          "libQualite": "Vice-Président",
          "libQualiteSex": null
        },
        "organes": {
          "organeRef": "PO699895"
        }
      },
      {
        "@xsi:type": "MandatSimple_Type",
        "uid": "PM700333",
        "acteurRef": "PA429836",
        "legislature": null,
        "typeOrgane": "CMP",
        "dateDebut": "2014-02-20T01:00:00.000+01:00",
        "datePublication": "2014-02-21T01:00:00.000+01:00",
        "dateFin": "2014-02-27T01:00:00.000+01:00",
        "preseance": "20",
        "nominPrincipale": "1",
        "infosQualite": {
          "codeQualite": "Titulaire",
          "libQualite": "Membre titulaire",
          "libQualiteSex": "Membre titulaire"
        },
        "organes": {
          "organeRef": "PO700314"
        }
      },
      {
        "@xsi:type": "MandatSimple_Type",
        "uid": "PM716561",
        "acteurRef": "PA429836",
        "legislature": null,
        "typeOrgane": "CMP",
        "dateDebut": "2017-01-18T01:00:00.000+01:00",
        "datePublication": "2017-01-20T01:00:00.000+01:00",
        "dateFin": "2017-01-25T01:00:00.000+01:00",
        "preseance": "20",
        "nominPrincipale": "1",
        "infosQualite": {
          "codeQualite": "Titulaire",
          "libQualite": "Membre titulaire",
          "libQualiteSex": "Membre titulaire"
        },
        "organes": {
          "organeRef": "PO716002"
        }
      },
      {
        "@xsi:type": "MandatSimple_Type",
        "uid": "PM704224",
        "acteurRef": "PA429836",
        "legislature": null,
        "typeOrgane": "COMSENAT",
        "dateDebut": "2014-10-09T02:00:00.000+02:00",
        "datePublication": null,
        "dateFin": "2017-10-04T02:00:00.000+02:00",
        "preseance": null,
        "nominPrincipale": "1",
        "infosQualite": {
          "codeQualite": null,
          "libQualite": "Vice-Président",
          "libQualiteSex": null
        },
        "organes": {
          "organeRef": "PO211493"
        }
      },
      {
        "@xsi:type": "MandatSimple_Type",
        "uid": "PM704879",
        "acteurRef": "PA429836",
        "legislature": null,
        "typeOrgane": "DELEGSENAT",
        "dateDebut": "2014-10-29T01:00:00.000+01:00",
        "datePublication": null,
        "dateFin": null,
        "preseance": "4",
        "nominPrincipale": "1",
        "infosQualite": {
          "codeQualite": "Membre",
          "libQualite": "Membre",
          "libQualiteSex": "Membre"
        },
        "organes": {
          "organeRef": "PO310693"
        }
      },
      {
        "@xsi:type": "MandatSimple_Type",
        "uid": "PM733987",
        "acteurRef": "PA429836",
        "legislature": null,
        "typeOrgane": "CMP",
        "dateDebut": "2017-07-26T02:00:00.000+02:00",
        "datePublication": "2017-07-28T02:00:00.000+02:00",
        "dateFin": "2017-07-31T02:00:00.000+02:00",
        "preseance": "28",
        "nominPrincipale": "1",
        "infosQualite": {
          "codeQualite": "Suppléant",
          "libQualite": "Membre suppléant",
          "libQualiteSex": "Membre suppléante"
        },
        "organes": {
          "organeRef": "PO733907"
        }
      },
      {
        "@xsi:type": "MandatSimple_Type",
        "uid": "PM709784",
        "acteurRef": "PA429836",
        "legislature": null,
        "typeOrgane": "CMP",
        "dateDebut": "2015-10-08T02:00:00.000+02:00",
        "datePublication": "2015-10-22T02:00:00.000+02:00",
        "dateFin": "2015-10-28T01:00:00.000+01:00",
        "preseance": "20",
        "nominPrincipale": "1",
        "infosQualite": {
          "codeQualite": "Titulaire",
          "libQualite": "Membre titulaire",
          "libQualiteSex": "Membre titulaire"
        },
        "organes": {
          "organeRef": "PO709622"
        }
      },
      {
        "@xsi:type": "MandatSimple_Type",
        "uid": "PM710053",
        "acteurRef": "PA429836",
        "legislature": null,
        "typeOrgane": "CMP",
        "dateDebut": "2015-10-15T02:00:00.000+02:00",
        "datePublication": "2015-11-13T01:00:00.000+01:00",
        "dateFin": "2015-11-19T01:00:00.000+01:00",
        "preseance": "20",
        "nominPrincipale": "1",
        "infosQualite": {
          "codeQualite": "Titulaire",
          "libQualite": "Membre titulaire",
          "libQualiteSex": "Membre titulaire"
        },
        "organes": {
          "organeRef": "PO709717"
        }
      },
      {
        "@xsi:type": "MandatSimple_Type",
        "uid": "PM710193",
        "acteurRef": "PA429836",
        "legislature": null,
        "typeOrgane": "CMP",
        "dateDebut": "2015-11-12T01:00:00.000+01:00",
        "datePublication": "2015-11-17T01:00:00.000+01:00",
        "dateFin": "2015-11-18T01:00:00.000+01:00",
        "preseance": "20",
        "nominPrincipale": "1",
        "infosQualite": {
          "codeQualite": "Titulaire",
          "libQualite": "Membre titulaire",
          "libQualiteSex": "Membre titulaire"
        },
        "organes": {
          "organeRef": "PO710132"
        }
      },
      {
        "@xsi:type": "MandatSimple_Type",
        "uid": "PM711061",
        "acteurRef": "PA429836",
        "legislature": null,
        "typeOrgane": "CMP",
        "dateDebut": "2015-12-17T01:00:00.000+01:00",
        "datePublication": "2016-01-09T01:00:00.000+01:00",
        "dateFin": "2016-02-11T01:00:00.000+01:00",
        "preseance": "20",
        "nominPrincipale": "1",
        "infosQualite": {
          "codeQualite": "Titulaire",
          "libQualite": "Membre titulaire",
          "libQualiteSex": "Membre titulaire"
        },
        "organes": {
          "organeRef": "PO710237"
        }
      },
      {
        "@xsi:type": "MandatSimple_Type",
        "uid": "PM711136",
        "acteurRef": "PA429836",
        "legislature": null,
        "typeOrgane": "CMP",
        "dateDebut": "2015-12-17T01:00:00.000+01:00",
        "datePublication": "2016-01-15T01:00:00.000+01:00",
        "dateFin": "2016-02-11T01:00:00.000+01:00",
        "preseance": "20",
        "nominPrincipale": "1",
        "infosQualite": {
          "codeQualite": "Titulaire",
          "libQualite": "Membre titulaire",
          "libQualiteSex": "Membre titulaire"
        },
        "organes": {
          "organeRef": "PO709882"
        }
      },
      {
        "@xsi:type": "MandatSimple_Type",
        "uid": "PM741299",
        "acteurRef": "PA429836",
        "legislature": null,
        "typeOrgane": "COMSENAT",
        "dateDebut": "2017-10-05T02:00:00.000+02:00",
        "datePublication": null,
        "dateFin": null,
        "preseance": null,
        "nominPrincipale": "1",
        "infosQualite": {
          "codeQualite": null,
          "libQualite": "Vice-Président",
          "libQualiteSex": null
        },
        "organes": {
          "organeRef": "PO211493"
        }
      },
      {
        "@xsi:type": "MandatSimple_Type",
        "uid": "PM741414",
        "acteurRef": "PA429836",
        "legislature": null,
        "typeOrgane": "DELEGSENAT",
        "dateDebut": "2017-10-18T02:00:00.000+02:00",
        "datePublication": null,
        "dateFin": null,
        "preseance": "4",
        "nominPrincipale": "1",
        "infosQualite": {
          "codeQualite": "Membre",
          "libQualite": "Membre",
          "libQualiteSex": "Membre"
        },
        "organes": {
          "organeRef": "PO310693"
        }
      },
      {
        "@xsi:type": "MandatSimple_Type",
        "uid": "PM741463",
        "acteurRef": "PA429836",
        "legislature": null,
        "typeOrgane": "DELEGSENAT",
        "dateDebut": "2017-10-18T02:00:00.000+02:00",
        "datePublication": null,
        "dateFin": null,
        "preseance": "4",
        "nominPrincipale": "1",
        "infosQualite": {
          "codeQualite": "Membre",
          "libQualite": "Membre",
          "libQualiteSex": "Membre"
        },
        "organes": {
          "organeRef": "PO704856"
        }
      },
      {
        "@xsi:type": "MandatSimple_Type",
        "uid": "PM742221",
        "acteurRef": "PA429836",
        "legislature": null,
        "typeOrgane": "DELEGSENAT",
        "dateDebut": "2017-10-26T02:00:00.000+02:00",
        "datePublication": null,
        "dateFin": null,
        "preseance": null,
        "nominPrincipale": "1",
        "infosQualite": {
          "codeQualite": null,
          "libQualite": "Vice-Président",
          "libQualiteSex": null
        },
        "organes": {
          "organeRef": "PO310693"
        }
      },
      {
        "@xsi:type": "MandatSimple_Type",
        "uid": "PM743699",
        "acteurRef": "PA429836",
        "legislature": null,
        "typeOrgane": "CMP",
        "dateDebut": "2017-11-17T01:00:00.000+01:00",
        "datePublication": "2017-11-22T01:00:00.000+01:00",
        "dateFin": "2017-12-22T01:00:00.000+01:00",
        "preseance": "28",
        "nominPrincipale": "1",
        "infosQualite": {
          "codeQualite": "Suppléant",
          "libQualite": "Membre suppléant",
          "libQualiteSex": "Membre suppléante"
        },
        "organes": {
          "organeRef": "PO743571"
        }
      },
      {
        "@xsi:type": "MandatSimple_Type",
        "uid": "PM744570",
        "acteurRef": "PA429836",
        "legislature": null,
        "typeOrgane": "CMP",
        "dateDebut": "2017-11-30T01:00:00.000+01:00",
        "datePublication": "2017-12-01T01:00:00.000+01:00",
        "dateFin": "2017-12-20T01:00:00.000+01:00",
        "preseance": "28",
        "nominPrincipale": "1",
        "infosQualite": {
          "codeQualite": "Suppléant",
          "libQualite": "Membre suppléant",
          "libQualiteSex": "Membre suppléante"
        },
        "organes": {
          "organeRef": "PO739840"
        }
      },
      {
        "@xsi:type": "MandatSimple_Type",
        "uid": "PM744597",
        "acteurRef": "PA429836",
        "legislature": null,
        "typeOrgane": "CMP",
        "dateDebut": "2017-11-30T01:00:00.000+01:00",
        "datePublication": "2017-12-01T01:00:00.000+01:00",
        "dateFin": "2018-02-15T01:00:00.000+01:00",
        "preseance": "28",
        "nominPrincipale": "1",
        "infosQualite": {
          "codeQualite": "Suppléant",
          "libQualite": "Membre suppléant",
          "libQualiteSex": "Membre suppléante"
        },
        "organes": {
          "organeRef": "PO739847"
        }
      }
    ]
  }
}