{
  "uid": {
    "@xsi:type": "IdActeur_type",
    "#text": "PA415468"
  },
  "etatCivil": {
    "ident": {
      "civ": "Mme",
      "prenom": "Samia",
      "nom": "Ghali",
      "alpha": "GHALI SAMIA",
      "trigramme": null
    },
    "infoNaissance": {
      "dateNais": "1968-06-10T01:00:00.000+01:00",
      "villeNais": null,
      "depNais": null,
      "paysNais": null
    },
    "dateDeces": null
  },
  "uri_hatvp": null,
  "mandats": {
    "mandat": [
      {
        "@xsi:type": "MandatSimple_Type",
        "uid": "PM431002",
        "acteurRef": "PA415468",
        "legislature": null,
        "typeOrgane": "GROUPESENAT",
        "dateDebut": "2011-11-02T01:00:00.000+01:00",
        "datePublication": null,
        "dateFin": "2014-10-06T02:00:00.000+02:00",
        "preseance": null,
        "nominPrincipale": "1",
        "infosQualite": {
          "codeQualite": null,
          "libQualite": "Vice-Président",
          "libQualiteSex": null
        },
        "organes": {
          "organeRef": "PO77710"
        }
      },
      {
        "@xsi:type": "MandatSimple_Type",
        "uid": "PM436962",
        "acteurRef": "PA415468",
        "legislature": null,
        "typeOrgane": "DELEGSENAT",
        "dateDebut": "2011-11-30T01:00:00.000+01:00",
        "datePublication": null,
        "dateFin": null,
        "preseance": "4",
        "nominPrincipale": "1",
        "infosQualite": {
          "codeQualite": "Membre",
          "libQualite": "Membre",
          "libQualiteSex": "Membre"
        },
        "organes": {
          "organeRef": "PO420388"
        }
      },
      {
        "@xsi:type": "MandatSimple_Type",
        "uid": "PM696356",
        "acteurRef": "PA415468",
        "legislature": null,
        "typeOrgane": "COMSENAT",
        "dateDebut": "2013-07-15T02:00:00.000+02:00",
        "datePublication": null,
        "dateFin": "2013-11-18T01:00:00.000+01:00",
        "preseance": "10",
        "nominPrincipale": "1",
        "infosQualite": {
          "codeQualite": "Membre",
          "libQualite": "Membre",
          "libQualiteSex": "Membre"
        },
        "organes": {
          "organeRef": "PO211490"
        }
      },
      {
        "@xsi:type": "MandatParlementaire_type",
        "uid": "PM415559",
        "acteurRef": "PA415468",
        "legislature": null,
        "typeOrgane": "SENAT",
        "dateDebut": "2008-10-01T02:00:00.000+02:00",
        "datePublication": null,
        "dateFin": "2014-09-30T02:00:00.000+02:00",
        "preseance": "20",
        "nominPrincipale": "1",
        "infosQualite": {
          "codeQualite": "Sénateur",
          "libQualite": "SENATEUR",
          "libQualiteSex": "Sénateur 5ème République"
        },
        "organes": {
          "organeRef": "PO78718"
        },
        "suppleants": null,
        "election": {
          "lieu": {
            "region": null,
            "regionType": null,
            "departement": null,
            "numDepartement": "13",
            "numCirco": null
          },
          "causeMandat": null
        },
        "InfosHorsSIAN": {
          "HATVP_URI": null
        },
        "mandature": {
          "datePriseFonction": null,
          "causeFin": null,
          "premiereElection": null,
          "placeHemicycle": null,
          "mandatRemplaceRef": null
        }
      },
      {
        "@xsi:type": "MandatSimple_Type",
        "uid": "PM415944",
        "acteurRef": "PA415468",
        "legislature": null,
        "typeOrgane": "COMSENAT",
        "dateDebut": "2008-10-07T02:00:00.000+02:00",
        "datePublication": null,
        "dateFin": "2013-07-14T02:00:00.000+02:00",
        "preseance": "10",
        "nominPrincipale": "1",
        "infosQualite": {
          "codeQualite": "Membre",
          "libQualite": "Membre",
          "libQualiteSex": "Membre"
        },
        "organes": {
          "organeRef": "PO211493"
        }
      },
      {
        "@xsi:type": "MandatSimple_Type",
        "uid": "PM699897",
        "acteurRef": "PA415468",
        "legislature": null,
        "typeOrgane": "COMSENAT",
        "dateDebut": "2013-11-19T01:00:00.000+01:00",
        "datePublication": null,
        "dateFin": "2014-10-07T02:00:00.000+02:00",
        "preseance": "10",
        "nominPrincipale": "1",
        "infosQualite": {
          "codeQualite": "Membre",
          "libQualite": "Membre",
          "libQualiteSex": "Membre"
        },
        "organes": {
          "organeRef": "PO211493"
        }
      },
      {
        "@xsi:type": "MandatParlementaire_type",
        "uid": "PM703648",
        "acteurRef": "PA415468",
        "legislature": null,
        "typeOrgane": "SENAT",
        "dateDebut": "2014-10-01T02:00:00.000+02:00",
        "datePublication": null,
        "dateFin": null,
        "preseance": "20",
        "nominPrincipale": "1",
        "infosQualite": {
          "codeQualite": "Sénateur",
          "libQualite": "SENATEUR",
          "libQualiteSex": "Sénateur 5ème République"
        },
        "organes": {
          "organeRef": "PO78718"
        },
        "suppleants": null,
        "election": {
          "lieu": {
            "region": null,
            "regionType": null,
            "departement": null,
            "numDepartement": "13",
            "numCirco": null
          },
          "causeMandat": null
        },
        "InfosHorsSIAN": {
          "HATVP_URI": null
        },
        "mandature": {
          "datePriseFonction": null,
          "causeFin": null,
          "premiereElection": null,
          "placeHemicycle": null,
          "mandatRemplaceRef": null
        }
      },
      {
        "@xsi:type": "MandatSimple_Type",
        "uid": "PM703888",
        "acteurRef": "PA415468",
        "legislature": null,
        "typeOrgane": "GROUPESENAT",
        "dateDebut": "2014-10-07T02:00:00.000+02:00",
        "datePublication": null,
        "dateFin": null,
        "preseance": "4",
        "nominPrincipale": "1",
        "infosQualite": {
          "codeQualite": "Membre",
          "libQualite": "Membre",
          "libQualiteSex": "Membre du"
        },
        "organes": {
          "organeRef": "PO77710"
        }
      },
      {
        "@xsi:type": "MandatSimple_Type",
        "uid": "PM704004",
        "acteurRef": "PA415468",
        "legislature": null,
        "typeOrgane": "COMSENAT",
        "dateDebut": "2014-10-08T02:00:00.000+02:00",
        "datePublication": null,
        "dateFin": "2017-10-03T02:00:00.000+02:00",
        "preseance": "10",
        "nominPrincipale": "1",
        "infosQualite": {
          "codeQualite": "Membre",
          "libQualite": "Membre",
          "libQualiteSex": "Membre"
        },
        "organes": {
          "organeRef": "PO211490"
        }
      },
      {
        "@xsi:type": "MandatSimple_Type",
        "uid": "PM741063",
        "acteurRef": "PA415468",
        "legislature": null,
        "typeOrgane": "COMSENAT",
        "dateDebut": "2017-10-04T02:00:00.000+02:00",
        "datePublication": null,
        "dateFin": null,
        "preseance": "10",
        "nominPrincipale": "1",
        "infosQualite": {
          "codeQualite": "Membre",
          "libQualite": "Membre",
          "libQualiteSex": "Membre"
        },
        "organes": {
          "organeRef": "PO211490"
        }
      },
      {
        "@xsi:type": "MandatSimple_Type",
        "uid": "PM748136",
        "acteurRef": "PA415468",
        "legislature": null,
        "typeOrgane": "ORGAINT",
        "dateDebut": "2018-01-26T01:00:00.000+01:00",
        "datePublication": null,
        "dateFin": null,
        "preseance": "42",
        "nominPrincipale": "1",
        "infosQualite": {
          "codeQualite": "Membre",
          "libQualite": "Membre",
          "libQualiteSex": "Membre"
        },
        "organes": {
          "organeRef": "PO201115"
        }
      }
    ]
  }
}