{
  "uid": {
    "@xsi:type": "IdActeur_type",
    "#text": "PA267075"
  },
  "etatCivil": {
    "ident": {
      "civ": "M.",
      "prenom": "Étienne",
      "nom": "Blanc",
      "alpha": "Blanc E",
      "trigramme": null
    },
    "infoNaissance": {
      "dateNais": "1954-08-29T01:00:00.000+01:00",
      "villeNais": "Givors",
      "depNais": "Rhône",
      "paysNais": "France"
    },
    "dateDeces": null
  },
  "uri_hatvp": null,
  "mandats": {
    "mandat": [
      {
        "@xsi:type": "MandatParlementaire_type",
        "uid": "PM645258",
        "acteurRef": "PA267075",
        "legislature": "14",
        "typeOrgane": "ASSEMBLEE",
        "dateDebut": "2012-06-20T02:00:00.000+02:00",
        "datePublication": null,
        "dateFin": "2016-03-10T01:00:00.000+01:00",
        "preseance": "50",
        "nominPrincipale": "1",
        "infosQualite": {
          "codeQualite": "membre",
          "libQualite": "membre",
          "libQualiteSex": "membre"
        },
        "organes": {
          "organeRef": "PO644420"
        },
        "suppleants": {
          "suppleant": {
            "dateDebut": "2012-06-20T02:00:00.000+02:00",
            "dateFin": "2016-03-10T01:00:00.000+01:00",
            "suppleantRef": "PA643183"
          }
        },
        "election": {
          "lieu": {
            "region": "Auvergne-Rhône-Alpes",
            "regionType": "Métropolitain",
            "departement": "Ain",
            "numDepartement": "01",
            "numCirco": "3"
          },
          "causeMandat": "élections générales",
          "refCirconscription": "PO644423"
        },
        "mandature": {
          "datePriseFonction": "2012-06-20T02:00:00.000+02:00",
          "causeFin": "Démission",
          "premiereElection": "1",
          "placeHemicycle": null,
          "mandatRemplaceRef": null
        }
      },
      {
        "@xsi:type": "MandatSimple_Type",
        "uid": "PM656336",
        "acteurRef": "PA267075",
        "legislature": "14",
        "typeOrgane": "GP",
        "dateDebut": "2012-06-26T02:00:00.000+02:00",
        "datePublication": "2012-06-27T02:00:00.000+02:00",
        "dateFin": "2015-06-01T02:00:00.000+02:00",
        "preseance": "20",
        "nominPrincipale": "1",
        "infosQualite": {
          "codeQualite": "Membre",
          "libQualite": "Membre du",
          "libQualiteSex": "Membre du"
        },
        "organes": {
          "organeRef": "PO656006"
        }
      },
      {
        "@xsi:type": "MandatSimple_Type",
        "uid": "PM656988",
        "acteurRef": "PA267075",
        "legislature": "14",
        "typeOrgane": "COMPER",
        "dateDebut": "2012-06-28T02:00:00.000+02:00",
        "datePublication": "2012-06-28T02:00:00.000+02:00",
        "dateFin": "2016-03-10T01:00:00.000+01:00",
        "preseance": "32",
        "nominPrincipale": "1",
        "infosQualite": {
          "codeQualite": "Membre",
          "libQualite": "Membre",
          "libQualiteSex": "Membre"
        },
        "organes": {
          "organeRef": "PO59048"
        }
      },
      {
        "@xsi:type": "MandatAvecSuppleant_Type",
        "uid": "PM670982",
        "acteurRef": "PA267075",
        "legislature": "14",
        "typeOrgane": "COMNL",
        "dateDebut": "2012-07-11T02:00:00.000+02:00",
        "datePublication": "2012-07-11T02:00:00.000+02:00",
        "dateFin": "2016-03-10T01:00:00.000+01:00",
        "preseance": "24",
        "nominPrincipale": "1",
        "infosQualite": {
          "codeQualite": "Titulaire",
          "libQualite": "Membre titulaire",
          "libQualiteSex": "Membre titulaire"
        },
        "organes": {
          "organeRef": "PO271850"
        },
        "suppleants": null
      },
      {
        "@xsi:type": "MandatSimple_Type",
        "uid": "PM678346",
        "acteurRef": "PA267075",
        "legislature": "14",
        "typeOrgane": "CNPS",
        "dateDebut": "2012-09-25T02:00:00.000+02:00",
        "datePublication": "2012-09-26T02:00:00.000+02:00",
        "dateFin": "2012-11-22T01:00:00.000+01:00",
        "preseance": "20",
        "nominPrincipale": "1",
        "infosQualite": {
          "codeQualite": "Membre",
          "libQualite": "Membre",
          "libQualiteSex": "Membre"
        },
        "organes": {
          "organeRef": "PO678157"
        }
      },
      {
        "@xsi:type": "MandatSimple_Type",
        "uid": "PM679847",
        "acteurRef": "PA267075",
        "legislature": "14",
        "typeOrgane": "GA",
        "dateDebut": "2012-10-12T02:00:00.000+02:00",
        "datePublication": null,
        "dateFin": "2016-03-10T01:00:00.000+01:00",
        "preseance": "20",
        "nominPrincipale": "1",
        "infosQualite": {
          "codeQualite": "Membre",
          "libQualite": "Membre",
          "libQualiteSex": "Membre"
        },
        "organes": {
          "organeRef": "PO675844"
        }
      },
      {
        "@xsi:type": "MandatSimple_Type",
        "uid": "PM679846",
        "acteurRef": "PA267075",
        "legislature": "14",
        "typeOrgane": "GA",
        "dateDebut": "2012-10-12T02:00:00.000+02:00",
        "datePublication": null,
        "dateFin": "2016-03-10T01:00:00.000+01:00",
        "preseance": "20",
        "nominPrincipale": "1",
        "infosQualite": {
          "codeQualite": "Membre",
          "libQualite": "Membre",
          "libQualiteSex": "Membre"
        },
        "organes": {
          "organeRef": "PO675792"
        }
      },
      {
        "@xsi:type": "MandatSimple_Type",
        "uid": "PM679848",
        "acteurRef": "PA267075",
        "legislature": "14",
        "typeOrgane": "GA",
        "dateDebut": "2012-10-12T02:00:00.000+02:00",
        "datePublication": null,
        "dateFin": "2016-03-10T01:00:00.000+01:00",
        "preseance": "20",
        "nominPrincipale": "1",
        "infosQualite": {
          "codeQualite": "Membre",
          "libQualite": "Membre",
          "libQualiteSex": "Membre"
        },
        "organes": {
          "organeRef": "PO675718"
        }
      },
      {
        "@xsi:type": "MandatSimple_Type",
        "uid": "PM684406",
        "acteurRef": "PA267075",
        "legislature": "14",
        "typeOrgane": "GA",
        "dateDebut": "2012-11-14T01:00:00.000+01:00",
        "datePublication": null,
        "dateFin": "2016-03-10T01:00:00.000+01:00",
        "preseance": "8",
        "nominPrincipale": "1",
        "infosQualite": {
          "codeQualite": "Vice-Président",
          "libQualite": "Vice-Président",
          "libQualiteSex": "Vice-Président"
        },
        "organes": {
          "organeRef": "PO675718"
        }
      },
      {
        "@xsi:type": "MandatSimple_Type",
        "uid": "PM685433",
        "acteurRef": "PA267075",
        "legislature": null,
        "typeOrgane": "PARPOL",
        "dateDebut": "2012-12-01T01:00:00.000+01:00",
        "datePublication": null,
        "dateFin": "2015-11-30T01:00:00.000+01:00",
        "preseance": "5",
        "nominPrincipale": "1",
        "infosQualite": {
          "codeQualite": "Membre",
          "libQualite": "Membre",
          "libQualiteSex": "Membre"
        },
        "organes": {
          "organeRef": "PO684942"
        }
      },
      {
        "@xsi:type": "MandatSimple_Type",
        "uid": "PM687685",
        "acteurRef": "PA267075",
        "legislature": "14",
        "typeOrgane": "GE",
        "dateDebut": "2013-01-10T01:00:00.000+01:00",
        "datePublication": null,
        "dateFin": "2016-03-10T01:00:00.000+01:00",
        "preseance": "20",
        "nominPrincipale": "1",
        "infosQualite": {
          "codeQualite": "Membre",
          "libQualite": "Membre",
          "libQualiteSex": "Membre"
        },
        "organes": {
          "organeRef": "PO686397"
        }
      },
      {
        "@xsi:type": "MandatSimple_Type",
        "uid": "PM687763",
        "acteurRef": "PA267075",
        "legislature": "14",
        "typeOrgane": "GE",
        "dateDebut": "2013-01-15T01:00:00.000+01:00",
        "datePublication": null,
        "dateFin": "2016-03-10T01:00:00.000+01:00",
        "preseance": "20",
        "nominPrincipale": "1",
        "infosQualite": {
          "codeQualite": "Membre",
          "libQualite": "Membre",
          "libQualiteSex": "Membre"
        },
        "organes": {
          "organeRef": "PO686415"
        }
      },
      {
        "@xsi:type": "MandatSimple_Type",
        "uid": "PM688527",
        "acteurRef": "PA267075",
        "legislature": "14",
        "typeOrgane": "GE",
        "dateDebut": "2013-01-24T01:00:00.000+01:00",
        "datePublication": null,
        "dateFin": "2016-03-10T01:00:00.000+01:00",
        "preseance": "20",
        "nominPrincipale": "1",
        "infosQualite": {
          "codeQualite": "Membre",
          "libQualite": "Membre",
          "libQualiteSex": "Membre"
        },
        "organes": {
          "organeRef": "PO686188"
        }
      },
      {
        "@xsi:type": "MandatSimple_Type",
        "uid": "PM688697",
        "acteurRef": "PA267075",
        "legislature": "14",
        "typeOrgane": "GE",
        "dateDebut": "2013-01-25T01:00:00.000+01:00",
        "datePublication": null,
        "dateFin": "2016-03-10T01:00:00.000+01:00",
        "preseance": "20",
        "nominPrincipale": "1",
        "infosQualite": {
          "codeQualite": "Membre",
          "libQualite": "Membre",
          "libQualiteSex": "Membre"
        },
        "organes": {
          "organeRef": "PO686501"
        }
      },
      {
        "@xsi:type": "MandatSimple_Type",
        "uid": "PM689263",
        "acteurRef": "PA267075",
        "legislature": "14",
        "typeOrgane": "GE",
        "dateDebut": "2013-01-02T01:00:00.000+01:00",
        "datePublication": null,
        "dateFin": "2016-03-10T01:00:00.000+01:00",
        "preseance": "20",
        "nominPrincipale": "1",
        "infosQualite": {
          "codeQualite": "Membre",
          "libQualite": "Membre",
          "libQualiteSex": "Membre"
        },
        "organes": {
          "organeRef": "PO686617"
        }
      },
      {
        "@xsi:type": "MandatSimple_Type",
        "uid": "PM689679",
        "acteurRef": "PA267075",
        "legislature": "14",
        "typeOrgane": "GE",
        "dateDebut": "2013-01-30T01:00:00.000+01:00",
        "datePublication": null,
        "dateFin": "2016-03-10T01:00:00.000+01:00",
        "preseance": "20",
        "nominPrincipale": "1",
        "infosQualite": {
          "codeQualite": "Membre",
          "libQualite": "Membre",
          "libQualiteSex": "Membre"
        },
        "organes": {
          "organeRef": "PO686424"
        }
      },
      {
        "@xsi:type": "MandatAvecSuppleant_Type",
        "uid": "PM689729",
        "acteurRef": "PA267075",
        "legislature": "14",
        "typeOrgane": "COMNL",
        "dateDebut": "2014-11-05T01:00:00.000+01:00",
        "datePublication": "2014-11-06T01:00:00.000+01:00",
        "dateFin": "2016-03-10T01:00:00.000+01:00",
        "preseance": "16",
        "nominPrincipale": "1",
        "infosQualite": {
          "codeQualite": "Secrétaire",
          "libQualite": "Secrétaire",
          "libQualiteSex": "Secrétaire"
        },
        "organes": {
          "organeRef": "PO271850"
        },
        "suppleants": null
      },
      {
        "@xsi:type": "MandatSimple_Type",
        "uid": "PM689943",
        "acteurRef": "PA267075",
        "legislature": "14",
        "typeOrgane": "GE",
        "dateDebut": "2013-02-01T01:00:00.000+01:00",
        "datePublication": null,
        "dateFin": "2016-03-10T01:00:00.000+01:00",
        "preseance": "20",
        "nominPrincipale": "1",
        "infosQualite": {
          "codeQualite": "Membre",
          "libQualite": "Membre",
          "libQualiteSex": "Membre"
        },
        "organes": {
          "organeRef": "PO686541"
        }
      },
      {
        "@xsi:type": "MandatSimple_Type",
        "uid": "PM689964",
        "acteurRef": "PA267075",
        "legislature": "14",
        "typeOrgane": "GE",
        "dateDebut": "2013-02-01T01:00:00.000+01:00",
        "datePublication": null,
        "dateFin": "2016-03-10T01:00:00.000+01:00",
        "preseance": "20",
        "nominPrincipale": "1",
        "infosQualite": {
          "codeQualite": "Membre",
          "libQualite": "Membre",
          "libQualiteSex": "Membre"
        },
        "organes": {
          "organeRef": "PO686749"
        }
      },
      {
        "@xsi:type": "MandatSimple_Type",
        "uid": "PM689991",
        "acteurRef": "PA267075",
        "legislature": "14",
        "typeOrgane": "GE",
        "dateDebut": "2013-02-01T01:00:00.000+01:00",
        "datePublication": null,
        "dateFin": "2016-03-10T01:00:00.000+01:00",
        "preseance": "20",
        "nominPrincipale": "1",
        "infosQualite": {
          "codeQualite": "Membre",
          "libQualite": "Membre",
          "libQualiteSex": "Membre"
        },
        "organes": {
          "organeRef": "PO686510"
        }
      },
      {
        "@xsi:type": "MandatSimple_Type",
        "uid": "PM690922",
        "acteurRef": "PA267075",
        "legislature": "14",
        "typeOrgane": "GE",
        "dateDebut": "2013-02-08T01:00:00.000+01:00",
        "datePublication": null,
        "dateFin": "2016-03-10T01:00:00.000+01:00",
        "preseance": "20",
        "nominPrincipale": "1",
        "infosQualite": {
          "codeQualite": "Membre",
          "libQualite": "Membre",
          "libQualiteSex": "Membre"
        },
        "organes": {
          "organeRef": "PO686776"
        }
      },
      {
        "@xsi:type": "MandatSimple_Type",
        "uid": "PM691399",
        "acteurRef": "PA267075",
        "legislature": "14",
        "typeOrgane": "GE",
        "dateDebut": "2013-02-12T01:00:00.000+01:00",
        "datePublication": null,
        "dateFin": "2016-03-10T01:00:00.000+01:00",
        "preseance": "20",
        "nominPrincipale": "1",
        "infosQualite": {
          "codeQualite": "Membre",
          "libQualite": "Membre",
          "libQualiteSex": "Membre"
        },
        "organes": {
          "organeRef": "PO687120"
        }
      },
      {
        "@xsi:type": "MandatSimple_Type",
        "uid": "PM691520",
        "acteurRef": "PA267075",
        "legislature": "14",
        "typeOrgane": "GE",
        "dateDebut": "2013-02-16T01:00:00.000+01:00",
        "datePublication": null,
        "dateFin": "2016-03-10T01:00:00.000+01:00",
        "preseance": "20",
        "nominPrincipale": "1",
        "infosQualite": {
          "codeQualite": "Membre",
          "libQualite": "Membre",
          "libQualiteSex": "Membre"
        },
        "organes": {
          "organeRef": "PO687473"
        }
      },
      {
        "@xsi:type": "MandatSimple_Type",
        "uid": "PM691653",
        "acteurRef": "PA267075",
        "legislature": "14",
        "typeOrgane": "GE",
        "dateDebut": "2013-02-20T01:00:00.000+01:00",
        "datePublication": null,
        "dateFin": "2016-03-10T01:00:00.000+01:00",
        "preseance": "20",
        "nominPrincipale": "1",
        "infosQualite": {
          "codeQualite": "Membre",
          "libQualite": "Membre",
          "libQualiteSex": "Membre"
        },
        "organes": {
          "organeRef": "PO687066"
        }
      },
      {
        "@xsi:type": "MandatSimple_Type",
        "uid": "PM691849",
        "acteurRef": "PA267075",
        "legislature": "14",
        "typeOrgane": "GE",
        "dateDebut": "2013-02-20T01:00:00.000+01:00",
        "datePublication": null,
        "dateFin": "2016-03-10T01:00:00.000+01:00",
        "preseance": "20",
        "nominPrincipale": "1",
        "infosQualite": {
          "codeQualite": "Membre",
          "libQualite": "Membre",
          "libQualiteSex": "Membre"
        },
        "organes": {
          "organeRef": "PO686406"
        }
      },
      {
        "@xsi:type": "MandatSimple_Type",
        "uid": "PM692467",
        "acteurRef": "PA267075",
        "legislature": "14",
        "typeOrgane": "GE",
        "dateDebut": "2013-03-01T01:00:00.000+01:00",
        "datePublication": null,
        "dateFin": "2016-03-10T01:00:00.000+01:00",
        "preseance": "20",
        "nominPrincipale": "1",
        "infosQualite": {
          "codeQualite": "Membre",
          "libQualite": "Membre",
          "libQualiteSex": "Membre"
        },
        "organes": {
          "organeRef": "PO686528"
        }
      },
      {
        "@xsi:type": "MandatSimple_Type",
        "uid": "PM693542",
        "acteurRef": "PA267075",
        "legislature": "14",
        "typeOrgane": "GE",
        "dateDebut": "2013-04-11T02:00:00.000+02:00",
        "datePublication": null,
        "dateFin": "2016-03-10T01:00:00.000+01:00",
        "preseance": "20",
        "nominPrincipale": "1",
        "infosQualite": {
          "codeQualite": "Membre",
          "libQualite": "Membre",
          "libQualiteSex": "Membre"
        },
        "organes": {
          "organeRef": "PO686627"
        }
      },
      {
        "@xsi:type": "MandatSimple_Type",
        "uid": "PM693754",
        "acteurRef": "PA267075",
        "legislature": "14",
        "typeOrgane": "GE",
        "dateDebut": "2013-04-16T02:00:00.000+02:00",
        "datePublication": null,
        "dateFin": "2016-03-10T01:00:00.000+01:00",
        "preseance": "20",
        "nominPrincipale": "1",
        "infosQualite": {
          "codeQualite": "Membre",
          "libQualite": "Membre",
          "libQualiteSex": "Membre"
        },
        "organes": {
          "organeRef": "PO689000"
        }
      },
      {
        "@xsi:type": "MandatSimple_Type",
        "uid": "PM694325",
        "acteurRef": "PA267075",
        "legislature": "14",
        "typeOrgane": "GE",
        "dateDebut": "2013-04-15T02:00:00.000+02:00",
        "datePublication": null,
        "dateFin": "2016-03-10T01:00:00.000+01:00",
        "preseance": "20",
        "nominPrincipale": "1",
        "infosQualite": {
          "codeQualite": "Membre",
          "libQualite": "Membre",
          "libQualiteSex": "Membre"
        },
        "organes": {
          "organeRef": "PO689012"
        }
      },
      {
        "@xsi:type": "MandatSimple_Type",
        "uid": "PM694350",
        "acteurRef": "PA267075",
        "legislature": "14",
        "typeOrgane": "CNPE",
        "dateDebut": "2013-05-14T02:00:00.000+02:00",
        "datePublication": "2013-05-15T02:00:00.000+02:00",
        "dateFin": "2013-10-08T02:00:00.000+02:00",
        "preseance": "20",
        "nominPrincipale": "1",
        "infosQualite": {
          "codeQualite": "Membre",
          "libQualite": "Membre",
          "libQualiteSex": "Membre"
        },
        "organes": {
          "organeRef": "PO694085"
        }
      },
      {
        "@xsi:type": "MandatSimple_Type",
        "uid": "PM695143",
        "acteurRef": "PA267075",
        "legislature": "14",
        "typeOrgane": "GE",
        "dateDebut": "2012-12-18T01:00:00.000+01:00",
        "datePublication": null,
        "dateFin": "2016-03-10T01:00:00.000+01:00",
        "preseance": "20",
        "nominPrincipale": "1",
        "infosQualite": {
          "codeQualite": "Membre",
          "libQualite": "Membre",
          "libQualiteSex": "Membre"
        },
        "organes": {
          "organeRef": "PO686266"
        }
      },
      {
        "@xsi:type": "MandatSimple_Type",
        "uid": "PM696287",
        "acteurRef": "PA267075",
        "legislature": "14",
        "typeOrgane": "CMP",
        "dateDebut": "2013-07-19T02:00:00.000+02:00",
        "datePublication": "2013-07-20T02:00:00.000+02:00",
        "dateFin": "2013-07-23T02:00:00.000+02:00",
        "preseance": "20",
        "nominPrincipale": "1",
        "infosQualite": {
          "codeQualite": "Titulaire",
          "libQualite": "Membre titulaire",
          "libQualiteSex": "Membre titulaire"
        },
        "organes": {
          "organeRef": "PO696280"
        }
      },
      {
        "@xsi:type": "MandatSimple_Type",
        "uid": "PM696315",
        "acteurRef": "PA267075",
        "legislature": "14",
        "typeOrgane": "CMP",
        "dateDebut": "2013-07-19T02:00:00.000+02:00",
        "datePublication": "2013-07-20T02:00:00.000+02:00",
        "dateFin": "2013-07-23T02:00:00.000+02:00",
        "preseance": "20",
        "nominPrincipale": "1",
        "infosQualite": {
          "codeQualite": "Titulaire",
          "libQualite": "Membre titulaire",
          "libQualiteSex": "Membre titulaire"
        },
        "organes": {
          "organeRef": "PO696274"
        }
      },
      {
        "@xsi:type": "MandatSimple_Type",
        "uid": "PM696378",
        "acteurRef": "PA267075",
        "legislature": "14",
        "typeOrgane": "GE",
        "dateDebut": "2013-07-22T02:00:00.000+02:00",
        "datePublication": null,
        "dateFin": "2016-03-10T01:00:00.000+01:00",
        "preseance": "20",
        "nominPrincipale": "1",
        "infosQualite": {
          "codeQualite": "Membre",
          "libQualite": "Membre",
          "libQualiteSex": "Membre"
        },
        "organes": {
          "organeRef": "PO694572"
        }
      },
      {
        "@xsi:type": "MandatSimple_Type",
        "uid": "PM696997",
        "acteurRef": "PA267075",
        "legislature": "14",
        "typeOrgane": "GE",
        "dateDebut": "2013-09-18T02:00:00.000+02:00",
        "datePublication": null,
        "dateFin": "2016-03-10T01:00:00.000+01:00",
        "preseance": "20",
        "nominPrincipale": "1",
        "infosQualite": {
          "codeQualite": "Membre",
          "libQualite": "Membre",
          "libQualiteSex": "Membre"
        },
        "organes": {
          "organeRef": "PO695581"
        }
      },
      {
        "@xsi:type": "MandatSimple_Type",
        "uid": "PM697163",
        "acteurRef": "PA267075",
        "legislature": "14",
        "typeOrgane": "GE",
        "dateDebut": "2013-09-25T02:00:00.000+02:00",
        "datePublication": null,
        "dateFin": "2016-03-10T01:00:00.000+01:00",
        "preseance": "20",
        "nominPrincipale": "1",
        "infosQualite": {
          "codeQualite": "Membre",
          "libQualite": "Membre",
          "libQualiteSex": "Membre"
        },
        "organes": {
          "organeRef": "PO694578"
        }
      },
      {
        "@xsi:type": "MandatMission_Type",
        "uid": "PM698965",
        "acteurRef": "PA267075",
        "legislature": "14",
        "typeOrgane": "MISINFOPRE",
        "dateDebut": "2013-12-06T01:00:00.000+01:00",
        "datePublication": "2013-12-07T01:00:00.000+01:00",
        "dateFin": "2014-10-09T02:00:00.000+02:00",
        "preseance": "20",
        "nominPrincipale": "1",
        "infosQualite": {
          "codeQualite": "Membre",
          "libQualite": "Membre",
          "libQualiteSex": "Membre"
        },
        "organes": {
          "organeRef": "PO698927"
        },
        "libelle": null
      },
      {
        "@xsi:type": "MandatMission_Type",
        "uid": "PM699066",
        "acteurRef": "PA267075",
        "legislature": "14",
        "typeOrgane": "MISINFOPRE",
        "dateDebut": "2013-12-11T01:00:00.000+01:00",
        "datePublication": "2013-12-12T01:00:00.000+01:00",
        "dateFin": "2014-10-09T02:00:00.000+02:00",
        "preseance": "4",
        "nominPrincipale": "1",
        "infosQualite": {
          "codeQualite": "Vice-Président",
          "libQualite": "Vice-Président",
          "libQualiteSex": "Vice-Président"
        },
        "organes": {
          "organeRef": "PO698927"
        },
        "libelle": null
      },
      {
        "@xsi:type": "MandatSimple_Type",
        "uid": "PM700909",
        "acteurRef": "PA267075",
        "legislature": "14",
        "typeOrgane": "CNPE",
        "dateDebut": "2014-04-16T02:00:00.000+02:00",
        "datePublication": "2014-04-17T02:00:00.000+02:00",
        "dateFin": "2014-10-30T01:00:00.000+01:00",
        "preseance": "20",
        "nominPrincipale": "1",
        "infosQualite": {
          "codeQualite": "Membre",
          "libQualite": "Membre",
          "libQualiteSex": "Membre"
        },
        "organes": {
          "organeRef": "PO700816"
        }
      },
      {
        "@xsi:type": "MandatSimple_Type",
        "uid": "PM701112",
        "acteurRef": "PA267075",
        "legislature": "14",
        "typeOrgane": "CMP",
        "dateDebut": "2014-05-07T02:00:00.000+02:00",
        "datePublication": "2014-05-08T02:00:00.000+02:00",
        "dateFin": "2014-05-15T02:00:00.000+02:00",
        "preseance": "20",
        "nominPrincipale": "1",
        "infosQualite": {
          "codeQualite": "Titulaire",
          "libQualite": "Membre titulaire",
          "libQualiteSex": "Membre titulaire"
        },
        "organes": {
          "organeRef": "PO700948"
        }
      },
      {
        "@xsi:type": "MandatSimple_Type",
        "uid": "PM701140",
        "acteurRef": "PA267075",
        "legislature": "14",
        "typeOrgane": "CMP",
        "dateDebut": "2014-05-07T02:00:00.000+02:00",
        "datePublication": "2014-05-08T02:00:00.000+02:00",
        "dateFin": "2014-05-15T02:00:00.000+02:00",
        "preseance": "20",
        "nominPrincipale": "1",
        "infosQualite": {
          "codeQualite": "Titulaire",
          "libQualite": "Membre titulaire",
          "libQualiteSex": "Membre titulaire"
        },
        "organes": {
          "organeRef": "PO701096"
        }
      },
      {
        "@xsi:type": "MandatSimple_Type",
        "uid": "PM702156",
        "acteurRef": "PA267075",
        "legislature": "14",
        "typeOrgane": "CNPS",
        "dateDebut": "2014-07-03T02:00:00.000+02:00",
        "datePublication": "2014-07-03T02:00:00.000+02:00",
        "dateFin": "2014-12-19T01:00:00.000+01:00",
        "preseance": "20",
        "nominPrincipale": "1",
        "infosQualite": {
          "codeQualite": "Membre",
          "libQualite": "Membre",
          "libQualiteSex": "Membre"
        },
        "organes": {
          "organeRef": "PO702090"
        }
      },
      {
        "@xsi:type": "MandatSimple_Type",
        "uid": "PM702718",
        "acteurRef": "PA267075",
        "legislature": "14",
        "typeOrgane": "GE",
        "dateDebut": "2014-07-23T02:00:00.000+02:00",
        "datePublication": null,
        "dateFin": "2016-03-10T01:00:00.000+01:00",
        "preseance": "20",
        "nominPrincipale": "1",
        "infosQualite": {
          "codeQualite": "Membre",
          "libQualite": "Membre",
          "libQualiteSex": "Membre"
        },
        "organes": {
          "organeRef": "PO702209"
        }
      },
      {
        "@xsi:type": "MandatSimple_Type",
        "uid": "PM703192",
        "acteurRef": "PA267075",
        "legislature": "14",
        "typeOrgane": "GE",
        "dateDebut": "2014-09-17T02:00:00.000+02:00",
        "datePublication": null,
        "dateFin": "2016-03-10T01:00:00.000+01:00",
        "preseance": "12",
        "nominPrincipale": "1",
        "infosQualite": {
          "codeQualite": "Secrétaire",
          "libQualite": "Secrétaire",
          "libQualiteSex": "Secrétaire"
        },
        "organes": {
          "organeRef": "PO702209"
        }
      },
      {
        "@xsi:type": "MandatSimple_Type",
        "uid": "PM708068",
        "acteurRef": "PA267075",
        "legislature": "14",
        "typeOrgane": "GP",
        "dateDebut": "2015-06-02T02:00:00.000+02:00",
        "datePublication": "2015-06-02T02:00:00.000+02:00",
        "dateFin": "2016-03-10T01:00:00.000+01:00",
        "preseance": "20",
        "nominPrincipale": "1",
        "infosQualite": {
          "codeQualite": "Membre",
          "libQualite": "Membre du",
          "libQualiteSex": "Membre du"
        },
        "organes": {
          "organeRef": "PO707869"
        }
      },
      {
        "@xsi:type": "MandatSimple_Type",
        "uid": "PM708832",
        "acteurRef": "PA267075",
        "legislature": "14",
        "typeOrgane": "CNPE",
        "dateDebut": "2015-07-02T02:00:00.000+02:00",
        "datePublication": "2015-07-03T02:00:00.000+02:00",
        "dateFin": "2016-03-10T01:00:00.000+01:00",
        "preseance": "20",
        "nominPrincipale": "1",
        "infosQualite": {
          "codeQualite": "Membre",
          "libQualite": "Membre",
          "libQualiteSex": "Membre"
        },
        "organes": {
          "organeRef": "PO708697"
        }
      },
      {
        "@xsi:type": "MandatSimple_Type",
        "uid": "PM710415",
        "acteurRef": "PA267075",
        "legislature": null,
        "typeOrgane": "PARPOL",
        "dateDebut": "2015-12-01T01:00:00.000+01:00",
        "datePublication": null,
        "dateFin": "2016-03-10T01:00:00.000+01:00",
        "preseance": "5",
        "nominPrincipale": "1",
        "infosQualite": {
          "codeQualite": "Membre",
          "libQualite": "Membre",
          "libQualiteSex": "Membre"
        },
        "organes": {
          "organeRef": "PO710396"
        }
      }
    ]
  }
}