{
  "uid": {
    "@xsi:type": "IdActeur_type",
    "#text": "PA335532"
  },
  "etatCivil": {
    "ident": {
      "civ": "Mme",
      "prenom": "George",
      "nom": "Pau-Langevin",
      "alpha": "PauLangevin",
      "trigramme": "GPA"
    },
    "infoNaissance": {
      "dateNais": "1948-10-19T01:00:00.000+01:00",
      "villeNais": "Pointe-à-Pitre",
      "depNais": "Guadeloupe",
      "paysNais": "France"
    },
    "dateDeces": null
  },
  "uri_hatvp": "http://www.hatvp.fr/pages_nominatives/pau-langevin-george",
  "mandats": {
    "mandat": [
      {
        "@xsi:type": "MandatSimple_Type",
        "uid": "PM591222",
        "acteurRef": "PA335532",
        "legislature": null,
        "typeOrgane": "MINISTERE",
        "dateDebut": "2012-05-17T02:00:00.000+02:00",
        "datePublication": "2012-05-17T02:00:00.000+02:00",
        "dateFin": "2012-06-18T02:00:00.000+02:00",
        "preseance": "40",
        "nominPrincipale": "1",
        "infosQualite": {
          "codeQualite": "Ministre délégué",
          "libQualite": "Ministre délégué",
          "libQualiteSex": "Ministre déléguée"
        },
        "organes": {
          "organeRef": "PO591220"
        }
      },
      {
        "@xsi:type": "MandatParlementaire_type",
        "uid": "PM645082",
        "acteurRef": "PA335532",
        "legislature": "14",
        "typeOrgane": "ASSEMBLEE",
        "dateDebut": "2012-06-20T02:00:00.000+02:00",
        "datePublication": null,
        "dateFin": "2012-07-21T02:00:00.000+02:00",
        "preseance": "50",
        "nominPrincipale": "1",
        "infosQualite": {
          "codeQualite": "membre",
          "libQualite": "membre",
          "libQualiteSex": "membre"
        },
        "organes": {
          "organeRef": "PO644420"
        },
        "suppleants": {
          "suppleant": {
            "dateDebut": "2012-06-20T02:00:00.000+02:00",
            "dateFin": "2012-07-21T02:00:00.000+02:00",
            "suppleantRef": "PA642940"
          }
        },
        "election": {
          "lieu": {
            "region": "Ile-de-France",
            "regionType": "Métropolitain",
            "departement": "Paris",
            "numDepartement": "75",
            "numCirco": "15"
          },
          "causeMandat": "élections générales",
          "refCirconscription": "PO644830"
        },
        "mandature": {
          "datePriseFonction": "2012-06-20T02:00:00.000+02:00",
          "causeFin": "Nomination comme membre du Gouvernement",
          "premiereElection": "1",
          "placeHemicycle": "511",
          "mandatRemplaceRef": null
        }
      },
      {
        "@xsi:type": "MandatSimple_Type",
        "uid": "PM653349",
        "acteurRef": "PA335532",
        "legislature": null,
        "typeOrgane": "MINISTERE",
        "dateDebut": "2012-06-22T02:00:00.000+02:00",
        "datePublication": "2012-06-22T02:00:00.000+02:00",
        "dateFin": "2014-03-31T02:00:00.000+02:00",
        "preseance": "40",
        "nominPrincipale": "1",
        "infosQualite": {
          "codeQualite": "Ministre délégué",
          "libQualite": "Ministre délégué",
          "libQualiteSex": "Ministre déléguée"
        },
        "organes": {
          "organeRef": "PO653347"
        }
      },
      {
        "@xsi:type": "MandatSimple_Type",
        "uid": "PM656243",
        "acteurRef": "PA335532",
        "legislature": "14",
        "typeOrgane": "GP",
        "dateDebut": "2012-06-26T02:00:00.000+02:00",
        "datePublication": "2012-06-27T02:00:00.000+02:00",
        "dateFin": "2012-07-21T02:00:00.000+02:00",
        "preseance": "20",
        "nominPrincipale": "1",
        "infosQualite": {
          "codeQualite": "Membre",
          "libQualite": "Membre du",
          "libQualiteSex": "Membre du"
        },
        "organes": {
          "organeRef": "PO656002"
        }
      },
      {
        "@xsi:type": "MandatSimple_Type",
        "uid": "PM657496",
        "acteurRef": "PA335532",
        "legislature": "14",
        "typeOrgane": "COMPER",
        "dateDebut": "2012-06-28T02:00:00.000+02:00",
        "datePublication": "2012-06-28T02:00:00.000+02:00",
        "dateFin": "2012-07-21T02:00:00.000+02:00",
        "preseance": "32",
        "nominPrincipale": "1",
        "infosQualite": {
          "codeQualite": "Membre",
          "libQualite": "Membre",
          "libQualiteSex": "Membre"
        },
        "organes": {
          "organeRef": "PO420120"
        }
      },
      {
        "@xsi:type": "MandatSimple_Type",
        "uid": "PM15591222",
        "acteurRef": "PA335532",
        "legislature": null,
        "typeOrgane": "GOUVERNEMENT",
        "dateDebut": "2012-05-17T02:00:00.000+02:00",
        "datePublication": "2012-05-17T02:00:00.000+02:00",
        "dateFin": "2012-06-18T02:00:00.000+02:00",
        "preseance": "50",
        "nominPrincipale": "1",
        "infosQualite": {
          "codeQualite": "membre",
          "libQualite": "membre",
          "libQualiteSex": "membre"
        },
        "organes": {
          "organeRef": "PO590011"
        }
      },
      {
        "@xsi:type": "MandatSimple_Type",
        "uid": "PM15653349",
        "acteurRef": "PA335532",
        "legislature": null,
        "typeOrgane": "GOUVERNEMENT",
        "dateDebut": "2012-06-22T02:00:00.000+02:00",
        "datePublication": "2012-06-22T02:00:00.000+02:00",
        "dateFin": "2014-03-31T02:00:00.000+02:00",
        "preseance": "50",
        "nominPrincipale": "1",
        "infosQualite": {
          "codeQualite": "membre",
          "libQualite": "membre",
          "libQualiteSex": "membre"
        },
        "organes": {
          "organeRef": "PO653199"
        }
      },
      {
        "@xsi:type": "MandatSimple_Type",
        "uid": "PM700760",
        "acteurRef": "PA335532",
        "legislature": null,
        "typeOrgane": "MINISTERE",
        "dateDebut": "2014-04-03T02:00:00.000+02:00",
        "datePublication": "2014-04-03T02:00:00.000+02:00",
        "dateFin": "2014-08-26T02:00:00.000+02:00",
        "preseance": "30",
        "nominPrincipale": "1",
        "infosQualite": {
          "codeQualite": "Ministre",
          "libQualite": "Ministre",
          "libQualiteSex": "Ministre"
        },
        "organes": {
          "organeRef": "PO700758"
        }
      },
      {
        "@xsi:type": "MandatSimple_Type",
        "uid": "PM15700760",
        "acteurRef": "PA335532",
        "legislature": null,
        "typeOrgane": "GOUVERNEMENT",
        "dateDebut": "2014-04-03T02:00:00.000+02:00",
        "datePublication": "2014-04-03T02:00:00.000+02:00",
        "dateFin": "2014-08-26T02:00:00.000+02:00",
        "preseance": "50",
        "nominPrincipale": "1",
        "infosQualite": {
          "codeQualite": "membre",
          "libQualite": "membre",
          "libQualiteSex": "membre"
        },
        "organes": {
          "organeRef": "PO700706"
        }
      },
      {
        "@xsi:type": "MandatSimple_Type",
        "uid": "PM702985",
        "acteurRef": "PA335532",
        "legislature": null,
        "typeOrgane": "MINISTERE",
        "dateDebut": "2014-08-27T02:00:00.000+02:00",
        "datePublication": "2014-08-27T02:00:00.000+02:00",
        "dateFin": "2016-08-30T02:00:00.000+02:00",
        "preseance": "30",
        "nominPrincipale": "1",
        "infosQualite": {
          "codeQualite": "Ministre",
          "libQualite": "Ministre",
          "libQualiteSex": "Ministre"
        },
        "organes": {
          "organeRef": "PO702936"
        }
      },
      {
        "@xsi:type": "MandatSimple_Type",
        "uid": "PM15702985",
        "acteurRef": "PA335532",
        "legislature": null,
        "typeOrgane": "GOUVERNEMENT",
        "dateDebut": "2014-08-27T02:00:00.000+02:00",
        "datePublication": "2014-08-27T02:00:00.000+02:00",
        "dateFin": "2016-08-30T02:00:00.000+02:00",
        "preseance": "50",
        "nominPrincipale": "1",
        "infosQualite": {
          "codeQualite": "membre",
          "libQualite": "membre",
          "libQualiteSex": "membre"
        },
        "organes": {
          "organeRef": "PO702883"
        }
      },
      {
        "@xsi:type": "MandatParlementaire_type",
        "uid": "PM714818",
        "acteurRef": "PA335532",
        "legislature": "14",
        "typeOrgane": "ASSEMBLEE",
        "dateDebut": "2012-06-20T02:00:00.000+02:00",
        "datePublication": null,
        "dateFin": "2017-06-20T02:00:00.000+02:00",
        "preseance": "50",
        "nominPrincipale": "1",
        "infosQualite": {
          "codeQualite": "membre",
          "libQualite": "membre",
          "libQualiteSex": "membre"
        },
        "organes": {
          "organeRef": "PO644420"
        },
        "suppleants": {
          "suppleant": {
            "dateDebut": "2012-06-20T02:00:00.000+02:00",
            "dateFin": "2017-06-20T02:00:00.000+02:00",
            "suppleantRef": "PA642940"
          }
        },
        "election": {
          "lieu": {
            "region": "Ile-de-France",
            "regionType": "Métropolitain",
            "departement": "Paris",
            "numDepartement": "75",
            "numCirco": "15"
          },
          "causeMandat": "reprise de l'exercice du mandat d'un ancien membre du Gouvernement",
          "refCirconscription": "PO644830"
        },
        "mandature": {
          "datePriseFonction": "2016-10-01T02:00:00.000+02:00",
          "causeFin": "Fin de législature",
          "premiereElection": "1",
          "placeHemicycle": "511",
          "mandatRemplaceRef": "645082"
        }
      },
      {
        "@xsi:type": "MandatSimple_Type",
        "uid": "PM714819",
        "acteurRef": "PA335532",
        "legislature": "14",
        "typeOrgane": "GP",
        "dateDebut": "2016-10-01T02:00:00.000+02:00",
        "datePublication": null,
        "dateFin": "2017-06-20T02:00:00.000+02:00",
        "preseance": "20",
        "nominPrincipale": "1",
        "infosQualite": {
          "codeQualite": "Membre",
          "libQualite": "Membre du",
          "libQualiteSex": "Membre du"
        },
        "organes": {
          "organeRef": "PO713077"
        }
      },
      {
        "@xsi:type": "MandatSimple_Type",
        "uid": "PM714827",
        "acteurRef": "PA335532",
        "legislature": "14",
        "typeOrgane": "COMPER",
        "dateDebut": "2016-10-04T02:00:00.000+02:00",
        "datePublication": "2016-10-04T02:00:00.000+02:00",
        "dateFin": "2017-06-20T02:00:00.000+02:00",
        "preseance": "32",
        "nominPrincipale": "1",
        "infosQualite": {
          "codeQualite": "Membre",
          "libQualite": "Membre",
          "libQualiteSex": "Membre"
        },
        "organes": {
          "organeRef": "PO420120"
        }
      },
      {
        "@xsi:type": "MandatSimple_Type",
        "uid": "PM715723",
        "acteurRef": "PA335532",
        "legislature": null,
        "typeOrgane": "PARPOL",
        "dateDebut": "2016-12-01T01:00:00.000+01:00",
        "datePublication": null,
        "dateFin": "2017-06-20T02:00:00.000+02:00",
        "preseance": "5",
        "nominPrincipale": "1",
        "infosQualite": {
          "codeQualite": "Membre",
          "libQualite": "Membre",
          "libQualiteSex": "Membre"
        },
        "organes": {
          "organeRef": "PO684932"
        }
      },
      {
        "@xsi:type": "MandatSimple_Type",
        "uid": "PM745943",
        "acteurRef": "PA335532",
        "legislature": null,
        "typeOrgane": "PARPOL",
        "dateDebut": "2017-12-01T01:00:00.000+01:00",
        "datePublication": null,
        "dateFin": null,
        "preseance": "5",
        "nominPrincipale": "1",
        "infosQualite": {
          "codeQualite": "Membre",
          "libQualite": "Membre",
          "libQualiteSex": "Membre"
        },
        "organes": {
          "organeRef": "PO684932"
        }
      }
    ]
  }
}