{
  "uid": {
    "@xsi:type": "IdActeur_type",
    "#text": "PA2056"
  },
  "etatCivil": {
    "ident": {
      "civ": "M.",
      "prenom": "François",
      "nom": "Marc",
      "alpha": "MARC_FRANCOIS",
      "trigramme": null
    },
    "infoNaissance": {
      "dateNais": "1950-03-19T01:00:00.000+01:00",
      "villeNais": null,
      "depNais": null,
      "paysNais": null
    },
    "dateDeces": null
  },
  "uri_hatvp": null,
  "mandats": {
    "mandat": [
      {
        "@xsi:type": "MandatSimple_Type",
        "uid": "PM430382",
        "acteurRef": "PA2056",
        "legislature": null,
        "typeOrgane": "COMSENAT",
        "dateDebut": "2011-10-01T02:00:00.000+02:00",
        "datePublication": null,
        "dateFin": "2012-06-19T02:00:00.000+02:00",
        "preseance": null,
        "nominPrincipale": "1",
        "infosQualite": {
          "codeQualite": null,
          "libQualite": "Vice-Président",
          "libQualiteSex": "Vice-Président"
        },
        "organes": {
          "organeRef": "PO211494"
        }
      },
      {
        "@xsi:type": "MandatSimple_Type",
        "uid": "PM651965",
        "acteurRef": "PA2056",
        "legislature": null,
        "typeOrgane": "COMSENAT",
        "dateDebut": "2012-06-20T02:00:00.000+02:00",
        "datePublication": null,
        "dateFin": "2014-10-07T02:00:00.000+02:00",
        "preseance": "5",
        "nominPrincipale": "1",
        "infosQualite": {
          "codeQualite": "Rapporteur général",
          "libQualite": "Rapporteur général",
          "libQualiteSex": "Rapporteur général"
        },
        "organes": {
          "organeRef": "PO211494"
        }
      },
      {
        "@xsi:type": "MandatSimple_Type",
        "uid": "PM677524",
        "acteurRef": "PA2056",
        "legislature": null,
        "typeOrgane": "CMP",
        "dateDebut": "2012-07-30T02:00:00.000+02:00",
        "datePublication": "2012-07-31T02:00:00.000+02:00",
        "dateFin": "2012-07-30T02:00:00.000+02:00",
        "preseance": "20",
        "nominPrincipale": "0",
        "infosQualite": {
          "codeQualite": "Titulaire",
          "libQualite": "Membre titulaire",
          "libQualiteSex": "Membre titulaire"
        },
        "organes": {
          "organeRef": "PO677474"
        }
      },
      {
        "@xsi:type": "MandatSimple_Type",
        "uid": "PM677536",
        "acteurRef": "PA2056",
        "legislature": null,
        "typeOrgane": "CMP",
        "dateDebut": "2012-07-30T02:00:00.000+02:00",
        "datePublication": "2012-07-30T02:00:00.000+02:00",
        "dateFin": "2012-07-30T02:00:00.000+02:00",
        "preseance": "16",
        "nominPrincipale": "1",
        "infosQualite": {
          "codeQualite": "Rapporteur",
          "libQualite": "Rapporteur",
          "libQualiteSex": "Rapporteur"
        },
        "organes": {
          "organeRef": "PO677474"
        }
      },
      {
        "@xsi:type": "MandatSimple_Type",
        "uid": "PM683948",
        "acteurRef": "PA2056",
        "legislature": null,
        "typeOrgane": "CMP",
        "dateDebut": "2012-11-06T01:00:00.000+01:00",
        "datePublication": "2012-11-07T01:00:00.000+01:00",
        "dateFin": "2012-11-09T01:00:00.000+01:00",
        "preseance": "20",
        "nominPrincipale": "1",
        "infosQualite": {
          "codeQualite": "Titulaire",
          "libQualite": "Membre titulaire",
          "libQualiteSex": "Membre titulaire"
        },
        "organes": {
          "organeRef": "PO683757"
        }
      },
      {
        "@xsi:type": "MandatSimple_Type",
        "uid": "PM684247",
        "acteurRef": "PA2056",
        "legislature": null,
        "typeOrgane": "CMP",
        "dateDebut": "2012-11-07T01:00:00.000+01:00",
        "datePublication": "2012-11-08T01:00:00.000+01:00",
        "dateFin": "2012-11-09T01:00:00.000+01:00",
        "preseance": "16",
        "nominPrincipale": "1",
        "infosQualite": {
          "codeQualite": "Rapporteur",
          "libQualite": "Rapporteur",
          "libQualiteSex": "Rapporteur"
        },
        "organes": {
          "organeRef": "PO683757"
        }
      },
      {
        "@xsi:type": "MandatSimple_Type",
        "uid": "PM685295",
        "acteurRef": "PA2056",
        "legislature": null,
        "typeOrgane": "CMP",
        "dateDebut": "2012-12-04T01:00:00.000+01:00",
        "datePublication": "2012-12-05T01:00:00.000+01:00",
        "dateFin": "2012-12-19T01:00:00.000+01:00",
        "preseance": "20",
        "nominPrincipale": "1",
        "infosQualite": {
          "codeQualite": "Titulaire",
          "libQualite": "Membre titulaire",
          "libQualiteSex": "Membre titulaire"
        },
        "organes": {
          "organeRef": "PO684249"
        }
      },
      {
        "@xsi:type": "MandatSimple_Type",
        "uid": "PM685331",
        "acteurRef": "PA2056",
        "legislature": null,
        "typeOrgane": "CMP",
        "dateDebut": "2012-12-04T01:00:00.000+01:00",
        "datePublication": "2012-12-05T01:00:00.000+01:00",
        "dateFin": "2012-12-19T01:00:00.000+01:00",
        "preseance": "20",
        "nominPrincipale": "1",
        "infosQualite": {
          "codeQualite": "Titulaire",
          "libQualite": "Membre titulaire",
          "libQualiteSex": "Membre titulaire"
        },
        "organes": {
          "organeRef": "PO685148"
        }
      },
      {
        "@xsi:type": "MandatSimple_Type",
        "uid": "PM686065",
        "acteurRef": "PA2056",
        "legislature": null,
        "typeOrgane": "CMP",
        "dateDebut": "2012-12-06T01:00:00.000+01:00",
        "datePublication": "2012-12-07T01:00:00.000+01:00",
        "dateFin": "2012-12-19T01:00:00.000+01:00",
        "preseance": "16",
        "nominPrincipale": "1",
        "infosQualite": {
          "codeQualite": "Rapporteur",
          "libQualite": "Rapporteur",
          "libQualiteSex": "Rapporteur"
        },
        "organes": {
          "organeRef": "PO685148"
        }
      },
      {
        "@xsi:type": "MandatSimple_Type",
        "uid": "PM686069",
        "acteurRef": "PA2056",
        "legislature": null,
        "typeOrgane": "CMP",
        "dateDebut": "2012-12-06T01:00:00.000+01:00",
        "datePublication": "2012-12-07T01:00:00.000+01:00",
        "dateFin": "2012-12-19T01:00:00.000+01:00",
        "preseance": "16",
        "nominPrincipale": "1",
        "infosQualite": {
          "codeQualite": "Rapporteur",
          "libQualite": "Rapporteur",
          "libQualiteSex": "Rapporteur"
        },
        "organes": {
          "organeRef": "PO684249"
        }
      },
      {
        "@xsi:type": "MandatSimple_Type",
        "uid": "PM686657",
        "acteurRef": "PA2056",
        "legislature": null,
        "typeOrgane": "CMP",
        "dateDebut": "2012-12-12T01:00:00.000+01:00",
        "datePublication": "2012-12-13T01:00:00.000+01:00",
        "dateFin": "2012-12-20T01:00:00.000+01:00",
        "preseance": "20",
        "nominPrincipale": "1",
        "infosQualite": {
          "codeQualite": "Titulaire",
          "libQualite": "Membre titulaire",
          "libQualiteSex": "Membre titulaire"
        },
        "organes": {
          "organeRef": "PO686310"
        }
      },
      {
        "@xsi:type": "MandatSimple_Type",
        "uid": "PM686735",
        "acteurRef": "PA2056",
        "legislature": null,
        "typeOrgane": "CMP",
        "dateDebut": "2012-12-13T01:00:00.000+01:00",
        "datePublication": "2012-12-14T01:00:00.000+01:00",
        "dateFin": "2012-12-20T01:00:00.000+01:00",
        "preseance": "16",
        "nominPrincipale": "1",
        "infosQualite": {
          "codeQualite": "Rapporteur",
          "libQualite": "Rapporteur",
          "libQualiteSex": "Rapporteur"
        },
        "organes": {
          "organeRef": "PO686310"
        }
      },
      {
        "@xsi:type": "MandatSimple_Type",
        "uid": "PM687181",
        "acteurRef": "PA2056",
        "legislature": null,
        "typeOrgane": "CMP",
        "dateDebut": "2012-12-17T01:00:00.000+01:00",
        "datePublication": "2012-12-18T01:00:00.000+01:00",
        "dateFin": "2012-12-19T01:00:00.000+01:00",
        "preseance": "20",
        "nominPrincipale": "0",
        "infosQualite": {
          "codeQualite": "Titulaire",
          "libQualite": "Membre titulaire",
          "libQualiteSex": "Membre titulaire"
        },
        "organes": {
          "organeRef": "PO687137"
        }
      },
      {
        "@xsi:type": "MandatSimple_Type",
        "uid": "PM687194",
        "acteurRef": "PA2056",
        "legislature": null,
        "typeOrgane": "CMP",
        "dateDebut": "2012-12-17T01:00:00.000+01:00",
        "datePublication": "2012-12-18T01:00:00.000+01:00",
        "dateFin": "2012-12-19T01:00:00.000+01:00",
        "preseance": "16",
        "nominPrincipale": "1",
        "infosQualite": {
          "codeQualite": "Rapporteur",
          "libQualite": "Rapporteur",
          "libQualiteSex": "Rapporteur"
        },
        "organes": {
          "organeRef": "PO687137"
        }
      },
      {
        "@xsi:type": "MandatSimple_Type",
        "uid": "PM695978",
        "acteurRef": "PA2056",
        "legislature": null,
        "typeOrgane": "CMP",
        "dateDebut": "2013-07-12T02:00:00.000+02:00",
        "datePublication": "2013-07-13T02:00:00.000+02:00",
        "dateFin": "2013-07-16T02:00:00.000+02:00",
        "preseance": "20",
        "nominPrincipale": "1",
        "infosQualite": {
          "codeQualite": "Titulaire",
          "libQualite": "Membre titulaire",
          "libQualiteSex": "Membre titulaire"
        },
        "organes": {
          "organeRef": "PO695808"
        }
      },
      {
        "@xsi:type": "MandatSimple_Type",
        "uid": "PM696217",
        "acteurRef": "PA2056",
        "legislature": null,
        "typeOrgane": "CMP",
        "dateDebut": "2013-07-16T02:00:00.000+02:00",
        "datePublication": "2013-07-17T02:00:00.000+02:00",
        "dateFin": "2013-07-16T02:00:00.000+02:00",
        "preseance": "16",
        "nominPrincipale": "1",
        "infosQualite": {
          "codeQualite": "Rapporteur",
          "libQualite": "Rapporteur",
          "libQualiteSex": "Rapporteur"
        },
        "organes": {
          "organeRef": "PO695808"
        }
      },
      {
        "@xsi:type": "MandatSimple_Type",
        "uid": "PM696312",
        "acteurRef": "PA2056",
        "legislature": null,
        "typeOrgane": "CMP",
        "dateDebut": "2013-07-19T02:00:00.000+02:00",
        "datePublication": "2013-07-20T02:00:00.000+02:00",
        "dateFin": "2013-07-23T02:00:00.000+02:00",
        "preseance": "20",
        "nominPrincipale": "1",
        "infosQualite": {
          "codeQualite": "Titulaire",
          "libQualite": "Membre titulaire",
          "libQualiteSex": "Membre titulaire"
        },
        "organes": {
          "organeRef": "PO696280"
        }
      },
      {
        "@xsi:type": "MandatSimple_Type",
        "uid": "PM696340",
        "acteurRef": "PA2056",
        "legislature": null,
        "typeOrgane": "CMP",
        "dateDebut": "2013-07-19T02:00:00.000+02:00",
        "datePublication": "2013-07-20T02:00:00.000+02:00",
        "dateFin": "2013-07-23T02:00:00.000+02:00",
        "preseance": "28",
        "nominPrincipale": "1",
        "infosQualite": {
          "codeQualite": "Suppléant",
          "libQualite": "Membre suppléant",
          "libQualiteSex": "Membre suppléant"
        },
        "organes": {
          "organeRef": "PO696274"
        }
      },
      {
        "@xsi:type": "MandatParlementaire_type",
        "uid": "PM415567",
        "acteurRef": "PA2056",
        "legislature": null,
        "typeOrgane": "SENAT",
        "dateDebut": "2008-10-01T02:00:00.000+02:00",
        "datePublication": null,
        "dateFin": "2014-09-30T02:00:00.000+02:00",
        "preseance": "20",
        "nominPrincipale": "1",
        "infosQualite": {
          "codeQualite": "Sénateur",
          "libQualite": "SENATEUR",
          "libQualiteSex": "SENATEUR"
        },
        "organes": {
          "organeRef": "PO78718"
        },
        "suppleants": null,
        "election": {
          "lieu": {
            "region": null,
            "regionType": null,
            "departement": null,
            "numDepartement": "29",
            "numCirco": null
          },
          "causeMandat": null
        },
        "InfosHorsSIAN": {
          "HATVP_URI": null
        },
        "mandature": {
          "datePriseFonction": null,
          "causeFin": null,
          "premiereElection": null,
          "placeHemicycle": null,
          "mandatRemplaceRef": null
        }
      },
      {
        "@xsi:type": "MandatAvecSuppleant_Type",
        "uid": "PM416611",
        "acteurRef": "PA2056",
        "legislature": null,
        "typeOrgane": "OFFPAR",
        "dateDebut": "2008-10-29T01:00:00.000+01:00",
        "datePublication": "2008-10-30T01:00:00.000+01:00",
        "dateFin": "2012-06-19T02:00:00.000+02:00",
        "preseance": "24",
        "nominPrincipale": "1",
        "infosQualite": {
          "codeQualite": "Membre",
          "libQualite": "Membre",
          "libQualiteSex": "Membre"
        },
        "organes": {
          "organeRef": "PO416588"
        },
        "suppleants": null
      },
      {
        "@xsi:type": "MandatSimple_Type",
        "uid": "PM698878",
        "acteurRef": "PA2056",
        "legislature": null,
        "typeOrgane": "CMP",
        "dateDebut": "2013-11-28T01:00:00.000+01:00",
        "datePublication": "2013-12-05T01:00:00.000+01:00",
        "dateFin": "2014-01-02T01:00:00.000+01:00",
        "preseance": "20",
        "nominPrincipale": "1",
        "infosQualite": {
          "codeQualite": "Titulaire",
          "libQualite": "Membre titulaire",
          "libQualiteSex": "Membre titulaire"
        },
        "organes": {
          "organeRef": "PO698794"
        }
      },
      {
        "@xsi:type": "MandatSimple_Type",
        "uid": "PM698937",
        "acteurRef": "PA2056",
        "legislature": null,
        "typeOrgane": "CMP",
        "dateDebut": "2013-12-05T01:00:00.000+01:00",
        "datePublication": "2013-12-06T01:00:00.000+01:00",
        "dateFin": "2014-01-02T01:00:00.000+01:00",
        "preseance": "16",
        "nominPrincipale": "1",
        "infosQualite": {
          "codeQualite": "Rapporteur",
          "libQualite": "Rapporteur",
          "libQualiteSex": "Rapporteur"
        },
        "organes": {
          "organeRef": "PO698794"
        }
      },
      {
        "@xsi:type": "MandatSimple_Type",
        "uid": "PM699137",
        "acteurRef": "PA2056",
        "legislature": null,
        "typeOrgane": "CMP",
        "dateDebut": "2013-12-13T01:00:00.000+01:00",
        "datePublication": "2013-12-17T01:00:00.000+01:00",
        "dateFin": "2014-01-02T01:00:00.000+01:00",
        "preseance": "20",
        "nominPrincipale": "1",
        "infosQualite": {
          "codeQualite": "Titulaire",
          "libQualite": "Membre titulaire",
          "libQualiteSex": "Membre titulaire"
        },
        "organes": {
          "organeRef": "PO699107"
        }
      },
      {
        "@xsi:type": "MandatSimple_Type",
        "uid": "PM701368",
        "acteurRef": "PA2056",
        "legislature": null,
        "typeOrgane": "CMP",
        "dateDebut": "2014-05-13T02:00:00.000+02:00",
        "datePublication": "2014-05-16T02:00:00.000+02:00",
        "dateFin": "2014-06-10T02:00:00.000+02:00",
        "preseance": "20",
        "nominPrincipale": "1",
        "infosQualite": {
          "codeQualite": "Titulaire",
          "libQualite": "Membre titulaire",
          "libQualiteSex": "Membre titulaire"
        },
        "organes": {
          "organeRef": "PO701178"
        }
      },
      {
        "@xsi:type": "MandatSimple_Type",
        "uid": "PM701446",
        "acteurRef": "PA2056",
        "legislature": null,
        "typeOrgane": "CMP",
        "dateDebut": "2014-05-20T02:00:00.000+02:00",
        "datePublication": "2014-05-21T02:00:00.000+02:00",
        "dateFin": "2014-06-10T02:00:00.000+02:00",
        "preseance": "16",
        "nominPrincipale": "1",
        "infosQualite": {
          "codeQualite": "Rapporteur",
          "libQualite": "Rapporteur",
          "libQualiteSex": "Rapporteur"
        },
        "organes": {
          "organeRef": "PO701178"
        }
      },
      {
        "@xsi:type": "MandatSimple_Type",
        "uid": "PM716267",
        "acteurRef": "PA2056",
        "legislature": null,
        "typeOrgane": "CMP",
        "dateDebut": "2016-12-16T01:00:00.000+01:00",
        "datePublication": "2016-12-17T01:00:00.000+01:00",
        "dateFin": "2016-12-20T01:00:00.000+01:00",
        "preseance": "28",
        "nominPrincipale": "1",
        "infosQualite": {
          "codeQualite": "Suppléant",
          "libQualite": "Membre suppléant",
          "libQualiteSex": "Membre suppléant"
        },
        "organes": {
          "organeRef": "PO716192"
        }
      },
      {
        "@xsi:type": "MandatSimple_Type",
        "uid": "PM702379",
        "acteurRef": "PA2056",
        "legislature": null,
        "typeOrgane": "CMP",
        "dateDebut": "2014-07-09T02:00:00.000+02:00",
        "datePublication": "2014-07-10T02:00:00.000+02:00",
        "dateFin": "2014-07-23T02:00:00.000+02:00",
        "preseance": "20",
        "nominPrincipale": "1",
        "infosQualite": {
          "codeQualite": "Titulaire",
          "libQualite": "Membre titulaire",
          "libQualiteSex": "Membre titulaire"
        },
        "organes": {
          "organeRef": "PO702354"
        }
      },
      {
        "@xsi:type": "MandatSimple_Type",
        "uid": "PM702390",
        "acteurRef": "PA2056",
        "legislature": null,
        "typeOrgane": "CMP",
        "dateDebut": "2014-07-10T02:00:00.000+02:00",
        "datePublication": "2014-07-11T02:00:00.000+02:00",
        "dateFin": "2014-07-23T02:00:00.000+02:00",
        "preseance": "16",
        "nominPrincipale": "1",
        "infosQualite": {
          "codeQualite": "Rapporteur",
          "libQualite": "Rapporteur",
          "libQualiteSex": "Rapporteur"
        },
        "organes": {
          "organeRef": "PO702354"
        }
      },
      {
        "@xsi:type": "MandatSimple_Type",
        "uid": "PM702566",
        "acteurRef": "PA2056",
        "legislature": null,
        "typeOrgane": "CMP",
        "dateDebut": "2014-07-16T02:00:00.000+02:00",
        "datePublication": "2014-07-17T02:00:00.000+02:00",
        "dateFin": "2014-07-23T02:00:00.000+02:00",
        "preseance": "20",
        "nominPrincipale": "1",
        "infosQualite": {
          "codeQualite": "Titulaire",
          "libQualite": "Membre titulaire",
          "libQualiteSex": "Membre titulaire"
        },
        "organes": {
          "organeRef": "PO702527"
        }
      },
      {
        "@xsi:type": "MandatSimple_Type",
        "uid": "PM702582",
        "acteurRef": "PA2056",
        "legislature": null,
        "typeOrgane": "CMP",
        "dateDebut": "2014-07-17T02:00:00.000+02:00",
        "datePublication": "2014-07-18T02:00:00.000+02:00",
        "dateFin": "2014-07-23T02:00:00.000+02:00",
        "preseance": "16",
        "nominPrincipale": "1",
        "infosQualite": {
          "codeQualite": "Rapporteur",
          "libQualite": "Rapporteur",
          "libQualiteSex": "Rapporteur"
        },
        "organes": {
          "organeRef": "PO702527"
        }
      },
      {
        "@xsi:type": "MandatParlementaire_type",
        "uid": "PM703583",
        "acteurRef": "PA2056",
        "legislature": null,
        "typeOrgane": "SENAT",
        "dateDebut": "2014-10-01T02:00:00.000+02:00",
        "datePublication": null,
        "dateFin": "2017-09-24T02:00:00.000+02:00",
        "preseance": "20",
        "nominPrincipale": "1",
        "infosQualite": {
          "codeQualite": "Sénateur",
          "libQualite": "SENATEUR",
          "libQualiteSex": "SENATEUR"
        },
        "organes": {
          "organeRef": "PO78718"
        },
        "suppleants": null,
        "election": {
          "lieu": {
            "region": null,
            "regionType": null,
            "departement": null,
            "numDepartement": "29",
            "numCirco": null
          },
          "causeMandat": null
        },
        "InfosHorsSIAN": {
          "HATVP_URI": null
        },
        "mandature": {
          "datePriseFonction": null,
          "causeFin": null,
          "premiereElection": null,
          "placeHemicycle": null,
          "mandatRemplaceRef": null
        }
      },
      {
        "@xsi:type": "MandatSimple_Type",
        "uid": "PM704131",
        "acteurRef": "PA2056",
        "legislature": null,
        "typeOrgane": "COMSENAT",
        "dateDebut": "2014-10-08T02:00:00.000+02:00",
        "datePublication": null,
        "dateFin": "2014-10-08T02:00:00.000+02:00",
        "preseance": "10",
        "nominPrincipale": "1",
        "infosQualite": {
          "codeQualite": "Membre",
          "libQualite": "Membre",
          "libQualiteSex": "Membre"
        },
        "organes": {
          "organeRef": "PO211494"
        }
      },
      {
        "@xsi:type": "MandatSimple_Type",
        "uid": "PM704171",
        "acteurRef": "PA2056",
        "legislature": null,
        "typeOrgane": "COMSENAT",
        "dateDebut": "2014-10-09T02:00:00.000+02:00",
        "datePublication": null,
        "dateFin": "2017-09-24T02:00:00.000+02:00",
        "preseance": null,
        "nominPrincipale": "1",
        "infosQualite": {
          "codeQualite": null,
          "libQualite": "Secrétaire",
          "libQualiteSex": "Secrétaire"
        },
        "organes": {
          "organeRef": "PO211494"
        }
      },
      {
        "@xsi:type": "MandatSimple_Type",
        "uid": "PM89647",
        "acteurRef": "PA2056",
        "legislature": null,
        "typeOrgane": "GROUPESENAT",
        "dateDebut": "1998-10-05T02:00:00.000+02:00",
        "datePublication": null,
        "dateFin": "2017-09-24T02:00:00.000+02:00",
        "preseance": "4",
        "nominPrincipale": "1",
        "infosQualite": {
          "codeQualite": "Membre",
          "libQualite": "Membre",
          "libQualiteSex": "Membre"
        },
        "organes": {
          "organeRef": "PO77710"
        }
      },
      {
        "@xsi:type": "MandatSimple_Type",
        "uid": "PM708994",
        "acteurRef": "PA2056",
        "legislature": null,
        "typeOrgane": "CMP",
        "dateDebut": "2015-07-10T02:00:00.000+02:00",
        "datePublication": "2015-07-11T02:00:00.000+02:00",
        "dateFin": "2015-07-16T02:00:00.000+02:00",
        "preseance": "20",
        "nominPrincipale": "1",
        "infosQualite": {
          "codeQualite": "Titulaire",
          "libQualite": "Membre titulaire",
          "libQualiteSex": "Membre titulaire"
        },
        "organes": {
          "organeRef": "PO708938"
        }
      },
      {
        "@xsi:type": "MandatSimple_Type",
        "uid": "PM715990",
        "acteurRef": "PA2056",
        "legislature": null,
        "typeOrgane": "CMP",
        "dateDebut": "2016-11-30T01:00:00.000+01:00",
        "datePublication": "2016-12-09T01:00:00.000+01:00",
        "dateFin": "2016-12-16T01:00:00.000+01:00",
        "preseance": "28",
        "nominPrincipale": "1",
        "infosQualite": {
          "codeQualite": "Suppléant",
          "libQualite": "Membre suppléant",
          "libQualiteSex": "Membre suppléant"
        },
        "organes": {
          "organeRef": "PO715651"
        }
      }
    ]
  }
}