{
  "@xsi:type": "OrganeParlementaire_Type",
  "uid": "PO696167",
  "codeType": "CMP",
  "libelle": "Commission mixte paritaire chargée de proposer un texte sur les dispositions restant en discussion du projet de loi organique relatif à la transparence de la vie publique",
  "libelleEdition": "du projet de loi organique relatif à la transparence de la vie publique",
  "libelleAbrege": "Transparence (org)",
  "libelleAbrev": "CMP_1004",
  "viMoDe": {
    "dateDebut": "2013-07-16T02:00:00.000+02:00",
    "dateAgrement": null,
    "dateFin": "2013-07-16T02:00:00.000+02:00"
  },
  "regime": "5ème République",
  "legislature": "14",
  "secretariat": {
    "secretaire01": null,
    "secretaire02": null
  }
}