{
  "uid": {
    "@xsi:type": "IdActeur_type",
    "#text": "PA607603"
  },
  "etatCivil": {
    "ident": {
      "civ": "M.",
      "prenom": "Philippe",
      "nom": "Le Ray",
      "alpha": "LeRay",
      "trigramme": null
    },
    "infoNaissance": {
      "dateNais": "1968-06-16T01:00:00.000+01:00",
      "villeNais": "Vannes",
      "depNais": "Morbihan",
      "paysNais": "France"
    },
    "dateDeces": null
  },
  "uri_hatvp": null,
  "mandats": {
    "mandat": [
      {
        "@xsi:type": "MandatParlementaire_type",
        "uid": "PM645379",
        "acteurRef": "PA607603",
        "legislature": "14",
        "typeOrgane": "ASSEMBLEE",
        "dateDebut": "2012-06-20T02:00:00.000+02:00",
        "datePublication": null,
        "dateFin": "2017-06-20T02:00:00.000+02:00",
        "preseance": "50",
        "nominPrincipale": "1",
        "infosQualite": {
          "codeQualite": "membre",
          "libQualite": "membre",
          "libQualiteSex": "membre"
        },
        "organes": {
          "organeRef": "PO644420"
        },
        "suppleants": {
          "suppleant": {
            "dateDebut": "2012-06-20T02:00:00.000+02:00",
            "dateFin": "2017-06-20T02:00:00.000+02:00",
            "suppleantRef": "PA642822"
          }
        },
        "election": {
          "lieu": {
            "region": "Bretagne",
            "regionType": "Métropolitain",
            "departement": "Morbihan",
            "numDepartement": "56",
            "numCirco": "2"
          },
          "causeMandat": "élections générales",
          "refCirconscription": "PO644679"
        },
        "mandature": {
          "datePriseFonction": "2012-06-20T02:00:00.000+02:00",
          "causeFin": "Fin de législature",
          "premiereElection": "0",
          "placeHemicycle": null,
          "mandatRemplaceRef": null
        }
      },
      {
        "@xsi:type": "MandatSimple_Type",
        "uid": "PM656515",
        "acteurRef": "PA607603",
        "legislature": "14",
        "typeOrgane": "GP",
        "dateDebut": "2012-06-26T02:00:00.000+02:00",
        "datePublication": "2012-06-27T02:00:00.000+02:00",
        "dateFin": "2015-06-01T02:00:00.000+02:00",
        "preseance": "24",
        "nominPrincipale": "1",
        "infosQualite": {
          "codeQualite": "Membre apparenté",
          "libQualite": "Apparenté au",
          "libQualiteSex": "Apparenté au"
        },
        "organes": {
          "organeRef": "PO656006"
        }
      },
      {
        "@xsi:type": "MandatSimple_Type",
        "uid": "PM657222",
        "acteurRef": "PA607603",
        "legislature": "14",
        "typeOrgane": "COMPER",
        "dateDebut": "2012-06-28T02:00:00.000+02:00",
        "datePublication": "2012-06-28T02:00:00.000+02:00",
        "dateFin": "2017-06-20T02:00:00.000+02:00",
        "preseance": "32",
        "nominPrincipale": "1",
        "infosQualite": {
          "codeQualite": "Membre",
          "libQualite": "Membre",
          "libQualiteSex": "Membre"
        },
        "organes": {
          "organeRef": "PO419610"
        }
      },
      {
        "@xsi:type": "MandatSimple_Type",
        "uid": "PM678803",
        "acteurRef": "PA607603",
        "legislature": "14",
        "typeOrgane": "ORGEXTPARL",
        "dateDebut": "2012-09-28T02:00:00.000+02:00",
        "datePublication": "2012-09-29T02:00:00.000+02:00",
        "dateFin": "2016-06-20T02:00:00.000+02:00",
        "preseance": "20",
        "nominPrincipale": "1",
        "infosQualite": {
          "codeQualite": "Titulaire",
          "libQualite": "Membre titulaire",
          "libQualiteSex": "Membre titulaire"
        },
        "organes": {
          "organeRef": "PO60166"
        }
      },
      {
        "@xsi:type": "MandatSimple_Type",
        "uid": "PM685535",
        "acteurRef": "PA607603",
        "legislature": null,
        "typeOrgane": "PARPOL",
        "dateDebut": "2012-12-01T01:00:00.000+01:00",
        "datePublication": null,
        "dateFin": "2015-11-30T01:00:00.000+01:00",
        "preseance": "5",
        "nominPrincipale": "1",
        "infosQualite": {
          "codeQualite": "Membre",
          "libQualite": "Membre",
          "libQualiteSex": "Membre"
        },
        "organes": {
          "organeRef": "PO684942"
        }
      },
      {
        "@xsi:type": "MandatSimple_Type",
        "uid": "PM687912",
        "acteurRef": "PA607603",
        "legislature": "14",
        "typeOrgane": "GE",
        "dateDebut": "2013-01-09T01:00:00.000+01:00",
        "datePublication": null,
        "dateFin": "2017-06-20T02:00:00.000+02:00",
        "preseance": "20",
        "nominPrincipale": "1",
        "infosQualite": {
          "codeQualite": "Membre",
          "libQualite": "Membre",
          "libQualiteSex": "Membre"
        },
        "organes": {
          "organeRef": "PO686793"
        }
      },
      {
        "@xsi:type": "MandatSimple_Type",
        "uid": "PM689377",
        "acteurRef": "PA607603",
        "legislature": "14",
        "typeOrgane": "GE",
        "dateDebut": "2013-01-23T01:00:00.000+01:00",
        "datePublication": null,
        "dateFin": "2017-06-20T02:00:00.000+02:00",
        "preseance": "20",
        "nominPrincipale": "1",
        "infosQualite": {
          "codeQualite": "Membre",
          "libQualite": "Membre",
          "libQualiteSex": "Membre"
        },
        "organes": {
          "organeRef": "PO687076"
        }
      },
      {
        "@xsi:type": "MandatSimple_Type",
        "uid": "PM690487",
        "acteurRef": "PA607603",
        "legislature": "14",
        "typeOrgane": "GE",
        "dateDebut": "2013-01-23T01:00:00.000+01:00",
        "datePublication": null,
        "dateFin": "2017-06-20T02:00:00.000+02:00",
        "preseance": "20",
        "nominPrincipale": "0",
        "infosQualite": {
          "codeQualite": "Membre",
          "libQualite": "Membre",
          "libQualiteSex": "Membre"
        },
        "organes": {
          "organeRef": "PO686337"
        }
      },
      {
        "@xsi:type": "MandatSimple_Type",
        "uid": "PM690566",
        "acteurRef": "PA607603",
        "legislature": "14",
        "typeOrgane": "GE",
        "dateDebut": "2013-01-23T01:00:00.000+01:00",
        "datePublication": null,
        "dateFin": "2017-06-20T02:00:00.000+02:00",
        "preseance": "8",
        "nominPrincipale": "1",
        "infosQualite": {
          "codeQualite": "Vice-Président",
          "libQualite": "Vice-Président",
          "libQualiteSex": "Vice-Président"
        },
        "organes": {
          "organeRef": "PO686337"
        }
      },
      {
        "@xsi:type": "MandatSimple_Type",
        "uid": "PM690899",
        "acteurRef": "PA607603",
        "legislature": "14",
        "typeOrgane": "GE",
        "dateDebut": "2013-02-06T01:00:00.000+01:00",
        "datePublication": null,
        "dateFin": "2017-06-20T02:00:00.000+02:00",
        "preseance": "20",
        "nominPrincipale": "1",
        "infosQualite": {
          "codeQualite": "Membre",
          "libQualite": "Membre",
          "libQualiteSex": "Membre"
        },
        "organes": {
          "organeRef": "PO686451"
        }
      },
      {
        "@xsi:type": "MandatSimple_Type",
        "uid": "PM691159",
        "acteurRef": "PA607603",
        "legislature": "14",
        "typeOrgane": "GE",
        "dateDebut": "2013-01-16T01:00:00.000+01:00",
        "datePublication": null,
        "dateFin": "2017-06-20T02:00:00.000+02:00",
        "preseance": "20",
        "nominPrincipale": "1",
        "infosQualite": {
          "codeQualite": "Membre",
          "libQualite": "Membre",
          "libQualiteSex": "Membre"
        },
        "organes": {
          "organeRef": "PO687381"
        }
      },
      {
        "@xsi:type": "MandatSimple_Type",
        "uid": "PM692054",
        "acteurRef": "PA607603",
        "legislature": "14",
        "typeOrgane": "GE",
        "dateDebut": "2013-02-19T01:00:00.000+01:00",
        "datePublication": null,
        "dateFin": "2017-06-20T02:00:00.000+02:00",
        "preseance": "12",
        "nominPrincipale": "1",
        "infosQualite": {
          "codeQualite": "Secrétaire",
          "libQualite": "Secrétaire",
          "libQualiteSex": "Secrétaire"
        },
        "organes": {
          "organeRef": "PO687381"
        }
      },
      {
        "@xsi:type": "MandatMission_Type",
        "uid": "PM698733",
        "acteurRef": "PA607603",
        "legislature": "14",
        "typeOrgane": "MISINFOPRE",
        "dateDebut": "2013-11-26T01:00:00.000+01:00",
        "datePublication": "2013-11-28T01:00:00.000+01:00",
        "dateFin": "2014-05-14T02:00:00.000+02:00",
        "preseance": "20",
        "nominPrincipale": "1",
        "infosQualite": {
          "codeQualite": "Membre",
          "libQualite": "Membre",
          "libQualiteSex": "Membre"
        },
        "organes": {
          "organeRef": "PO698717"
        },
        "libelle": null
      },
      {
        "@xsi:type": "MandatSimple_Type",
        "uid": "PM703861",
        "acteurRef": "PA607603",
        "legislature": "14",
        "typeOrgane": "GE",
        "dateDebut": "2014-10-08T02:00:00.000+02:00",
        "datePublication": null,
        "dateFin": "2017-06-20T02:00:00.000+02:00",
        "preseance": "20",
        "nominPrincipale": "1",
        "infosQualite": {
          "codeQualite": "Membre",
          "libQualite": "Membre",
          "libQualiteSex": "Membre"
        },
        "organes": {
          "organeRef": "PO686501"
        }
      },
      {
        "@xsi:type": "MandatSimple_Type",
        "uid": "PM707926",
        "acteurRef": "PA607603",
        "legislature": "14",
        "typeOrgane": "GP",
        "dateDebut": "2015-06-02T02:00:00.000+02:00",
        "datePublication": "2015-06-02T02:00:00.000+02:00",
        "dateFin": "2015-09-15T02:00:00.000+02:00",
        "preseance": "24",
        "nominPrincipale": "1",
        "infosQualite": {
          "codeQualite": "Membre apparenté",
          "libQualite": "Apparenté au",
          "libQualiteSex": "Apparenté au"
        },
        "organes": {
          "organeRef": "PO707869"
        }
      },
      {
        "@xsi:type": "MandatMission_Type",
        "uid": "PM709605",
        "acteurRef": "PA607603",
        "legislature": "14",
        "typeOrgane": "MISINFO",
        "dateDebut": "2015-07-22T02:00:00.000+02:00",
        "datePublication": null,
        "dateFin": "2016-03-30T02:00:00.000+02:00",
        "preseance": "10",
        "nominPrincipale": "1",
        "infosQualite": {
          "codeQualite": "Membre",
          "libQualite": "Membre",
          "libQualiteSex": "Membre"
        },
        "organes": {
          "organeRef": "PO709593"
        },
        "libelle": null
      },
      {
        "@xsi:type": "MandatSimple_Type",
        "uid": "PM710523",
        "acteurRef": "PA607603",
        "legislature": null,
        "typeOrgane": "PARPOL",
        "dateDebut": "2015-12-01T01:00:00.000+01:00",
        "datePublication": null,
        "dateFin": "2017-06-20T02:00:00.000+02:00",
        "preseance": "5",
        "nominPrincipale": "1",
        "infosQualite": {
          "codeQualite": "Membre",
          "libQualite": "Membre",
          "libQualiteSex": "Membre"
        },
        "organes": {
          "organeRef": "PO710396"
        }
      },
      {
        "@xsi:type": "MandatSimple_Type",
        "uid": "PM709384",
        "acteurRef": "PA607603",
        "legislature": "14",
        "typeOrgane": "GP",
        "dateDebut": "2015-09-16T02:00:00.000+02:00",
        "datePublication": "2015-09-16T02:00:00.000+02:00",
        "dateFin": "2017-06-20T02:00:00.000+02:00",
        "preseance": "20",
        "nominPrincipale": "1",
        "infosQualite": {
          "codeQualite": "Membre",
          "libQualite": "Membre du",
          "libQualiteSex": "Membre du"
        },
        "organes": {
          "organeRef": "PO707869"
        }
      },
      {
        "@xsi:type": "MandatSimple_Type",
        "uid": "PM712209",
        "acteurRef": "PA607603",
        "legislature": "14",
        "typeOrgane": "CNPE",
        "dateDebut": "2016-03-30T02:00:00.000+02:00",
        "datePublication": "2016-03-31T02:00:00.000+02:00",
        "dateFin": "2016-09-20T02:00:00.000+02:00",
        "preseance": "20",
        "nominPrincipale": "1",
        "infosQualite": {
          "codeQualite": "Membre",
          "libQualite": "Membre",
          "libQualiteSex": "Membre"
        },
        "organes": {
          "organeRef": "PO712082"
        }
      }
    ]
  }
}