{
  "uid": {
    "@xsi:type": "IdActeur_type",
    "#text": "PA2424"
  },
  "etatCivil": {
    "ident": {
      "civ": "M.",
      "prenom": "Henri",
      "nom": "Plagnol",
      "alpha": "Plagnol",
      "trigramme": null
    },
    "infoNaissance": {
      "dateNais": "1961-02-11T01:00:00.000+01:00",
      "villeNais": "Paris",
      "depNais": "Paris",
      "paysNais": "France"
    },
    "dateDeces": null
  },
  "uri_hatvp": null,
  "mandats": {
    "mandat": [
      {
        "@xsi:type": "MandatParlementaire_type",
        "uid": "PM645129",
        "acteurRef": "PA2424",
        "legislature": "14",
        "typeOrgane": "ASSEMBLEE",
        "dateDebut": "2012-06-20T02:00:00.000+02:00",
        "datePublication": null,
        "dateFin": "2012-10-18T02:00:00.000+02:00",
        "preseance": "50",
        "nominPrincipale": "1",
        "infosQualite": {
          "codeQualite": "membre",
          "libQualite": "membre",
          "libQualiteSex": "membre"
        },
        "organes": {
          "organeRef": "PO644420"
        },
        "suppleants": {
          "suppleant": {
            "dateDebut": "2012-06-20T02:00:00.000+02:00",
            "dateFin": "2012-10-18T02:00:00.000+02:00",
            "suppleantRef": "PA347122"
          }
        },
        "election": {
          "lieu": {
            "region": "Ile-de-France",
            "regionType": "Métropolitain",
            "departement": "Val-de-Marne",
            "numDepartement": "94",
            "numCirco": "1"
          },
          "causeMandat": "élections générales",
          "refCirconscription": "PO644955"
        },
        "mandature": {
          "datePriseFonction": "2012-06-20T02:00:00.000+02:00",
          "causeFin": "Annulation de l'élection sur décision du Conseil constitutionnel",
          "premiereElection": "1",
          "placeHemicycle": null,
          "mandatRemplaceRef": null
        }
      },
      {
        "@xsi:type": "MandatSimple_Type",
        "uid": "PM656973",
        "acteurRef": "PA2424",
        "legislature": "14",
        "typeOrgane": "COMPER",
        "dateDebut": "2012-06-28T02:00:00.000+02:00",
        "datePublication": "2012-06-28T02:00:00.000+02:00",
        "dateFin": "2012-10-18T02:00:00.000+02:00",
        "preseance": "32",
        "nominPrincipale": "1",
        "infosQualite": {
          "codeQualite": "Membre",
          "libQualite": "Membre",
          "libQualiteSex": "Membre"
        },
        "organes": {
          "organeRef": "PO59047"
        }
      },
      {
        "@xsi:type": "MandatSimple_Type",
        "uid": "PM677615",
        "acteurRef": "PA2424",
        "legislature": "14",
        "typeOrgane": "API",
        "dateDebut": "2012-08-02T02:00:00.000+02:00",
        "datePublication": "2012-08-02T02:00:00.000+02:00",
        "dateFin": "2012-10-18T02:00:00.000+02:00",
        "preseance": "20",
        "nominPrincipale": "1",
        "infosQualite": {
          "codeQualite": "Membre",
          "libQualite": "Membre",
          "libQualiteSex": "Membre"
        },
        "organes": {
          "organeRef": "PO58976"
        }
      },
      {
        "@xsi:type": "MandatSimple_Type",
        "uid": "PM678307",
        "acteurRef": "PA2424",
        "legislature": "14",
        "typeOrgane": "CNPS",
        "dateDebut": "2012-09-25T02:00:00.000+02:00",
        "datePublication": "2012-09-26T02:00:00.000+02:00",
        "dateFin": "2012-10-18T02:00:00.000+02:00",
        "preseance": "20",
        "nominPrincipale": "1",
        "infosQualite": {
          "codeQualite": "Membre",
          "libQualite": "Membre",
          "libQualiteSex": "Membre"
        },
        "organes": {
          "organeRef": "PO678157"
        }
      },
      {
        "@xsi:type": "MandatSimple_Type",
        "uid": "PM656547",
        "acteurRef": "PA2424",
        "legislature": "14",
        "typeOrgane": "GP",
        "dateDebut": "2012-06-26T02:00:00.000+02:00",
        "datePublication": "2012-06-27T02:00:00.000+02:00",
        "dateFin": "2012-10-18T02:00:00.000+02:00",
        "preseance": "20",
        "nominPrincipale": "1",
        "infosQualite": {
          "codeQualite": "Membre",
          "libQualite": "Membre du",
          "libQualiteSex": "Membre du"
        },
        "organes": {
          "organeRef": "PO656010"
        }
      }
    ]
  }
}