{
  "@xsi:type": "OrganeExterne_Type",
  "uid": "PO730011",
  "codeType": "MINISTERE",
  "libelle": "Ministère de l'action et des comptes publics",
  "libelleEdition": "de l'action et des comptes publics",
  "libelleAbrege": "Action et comptes publics",
  "libelleAbrev": "CPA",
  "viMoDe": {
    "dateDebut": "2017-06-22T02:00:00.000+02:00",
    "dateAgrement": null,
    "dateFin": null
  }
}