{
  "@xsi:type": "OrganeParlementaire_Type",
  "uid": "PO415287",
  "codeType": "COMNL",
  "libelle": "Commission des affaires européennes",
  "libelleEdition": "de la commission des affaires européennes",
  "libelleAbrege": "Affaires européennes",
  "libelleAbrev": "DUE",
  "viMoDe": {
    "dateDebut": "2008-09-17T02:00:00.000+02:00",
    "dateAgrement": null,
    "dateFin": null
  },
  "regime": "5ème République",
  "legislature": "13",
  "secretariat": {
    "secretaire01": "M. Guy Chauvin",
    "secretaire02": null
  }
}