<?xml version="1.0" encoding="UTF-8" standalone="no"?>
<svg
   xmlns:dc="http://purl.org/dc/elements/1.1/"
   xmlns:cc="http://creativecommons.org/ns#"
   xmlns:rdf="http://www.w3.org/1999/02/22-rdf-syntax-ns#"
   xmlns:svg="http://www.w3.org/2000/svg"
   xmlns="http://www.w3.org/2000/svg"
   xmlns:xlink="http://www.w3.org/1999/xlink"
   xmlns:sodipodi="http://sodipodi.sourceforge.net/DTD/sodipodi-0.dtd"
   xmlns:inkscape="http://www.inkscape.org/namespaces/inkscape"
   version="1.1"
   id="svg2"
   xml:space="preserve"
   width="559.37067"
   height="793.70135"
   viewBox="0 0 559.37067 793.70135"
   sodipodi:docname="33.svg"
   inkscape:version="1.0.2 (e86c870879, 2021-01-15)"><metadata
     id="metadata8"><rdf:RDF><cc:Work
         rdf:about=""><dc:format>image/svg+xml</dc:format><dc:type
           rdf:resource="http://purl.org/dc/dcmitype/StillImage" /><dc:title></dc:title></cc:Work></rdf:RDF></metadata><defs
     id="defs6"><clipPath
       clipPathUnits="userSpaceOnUse"
       id="clipPath18"><path
         d="M 81.247,206.772 H 297.261 V 543.68 H 81.247 Z"
         id="path16" /></clipPath></defs><sodipodi:namedview
     pagecolor="#ffffff"
     bordercolor="#666666"
     borderopacity="1"
     objecttolerance="10"
     gridtolerance="10"
     guidetolerance="10"
     inkscape:pageopacity="0"
     inkscape:pageshadow="2"
     inkscape:window-width="962"
     inkscape:window-height="480"
     id="namedview4"
     showgrid="false"
     inkscape:zoom="1.0910905"
     inkscape:cx="279.68533"
     inkscape:cy="396.85068"
     inkscape:window-x="0"
     inkscape:window-y="23"
     inkscape:window-maximized="0"
     inkscape:current-layer="g10" /><g
     id="g10"
     inkscape:groupmode="layer"
     inkscape:label="Miroir de Valem3"
     transform="matrix(1.3333333,0,0,-1.3333333,0,793.70133)"><g
       id="g12"><g
         id="g14"
         clip-path="url(#clipPath18)"><g
           id="g20"><g
             id="g22"
             transform="matrix(216.01435,0,0,336.90834,81.247826,206.77202)"><image
               xlink:href="33.png"
               id="image24"
               transform="matrix(1,0,0,-1,0,1)"
               preserveAspectRatio="none"
               style="image-rendering:optimizeSpeed"
               height="1"
               width="1" /></g></g></g></g><text
       transform="matrix(1,0,0,-1,13.8975,292.9434)"
       style="font-variant:normal;font-weight:normal;font-stretch:normal;font-size:17px;font-family:Cormorant;-inkscape-font-specification:Cormorant;writing-mode:lr-tb;fill:#231f20;fill-opacity:1;fill-rule:nonzero;stroke:none"
       id="text28"><tspan
         x="0 7.973"
         y="0"
         sodipodi:role="line"
         id="tspan26">33</tspan></text><text
       transform="matrix(1,0,0,-1,46.3457,175.0518)"
       style="font-variant:normal;font-weight:normal;font-stretch:normal;font-size:10px;font-family:'Century Schoolbook';-inkscape-font-specification:CenturySchoolbook;writing-mode:lr-tb;fill:#131110;fill-opacity:1;fill-rule:nonzero;stroke:none"
       id="text46"><tspan
         x="0 7.2199998 13.33 16.110001 21.67 27.23 32.790001 38.349998 41.130001 46.130001 49.279999 52.43 57.43 60.209999 65.949997 70.949997 75.389999 78.540001 84.279999 89.279999 92.059998 97.800003 102.8 105.58 110.02 115.02 121.13 126.13 132.24001 136.67999 141.67999 146.12 148.89999 154.46001 157.24001 161.87 166.87 171.5 174.28 178.72 183.72 188.35001 194.09 199.09 205.2 209.83 215.39 220.95 224.10001 227.25 230.39999 234.28999 239.28999 243.92"
         y="0"
         sodipodi:role="line"
         id="tspan30">En 2015 elle décide de renoncer à ses responsabilités </tspan><tspan
         x="0 5.7399998 10.18 15.18 18.51 23.51 28.139999 32.77 35.919998 40.919998 47.029999 53.139999 58.139999 61.290001 64.440002 69.440002 74.07 76.849998 82.589996 87.589996 93.699997 98.139999 100.92 105.55 110.55 113.33 117.77 122.77 128.88 133.50999 139.07001 143.50999 147.95 152.95 157.39 160.17 165.91 169.06 175.17 179.8 182.58 188.32001 191.47 196.47 199.62 205.73 210.73 219.62 224.62 230.73 234.62 237.39999 242.96001 245.74001 248.89 254.45"
         y="14"
         sodipodi:role="line"
         id="tspan32">professionnelles pour se consacrer plus pleinement à la </tspan><tspan
         x="0 4.6300001 9.0699997 15.18 18.33 24.07 27.959999 34.07 38.509998 43.509998 46.290001 49.07 55.740002 60.740002 63.52 67.410004 72.410004 81.300003 87.040001 91.669998 94.449997 100.01 106.12 108.16 113.16 116.31 119.46 124.46 127.24 132.98 138.53999 142.98 148.35001 151.5 156.5 162.61 166.5 169.28 174.84 177.62 183.36 187.8 192.8 197.42999 202.42999 208.53999 212.42999 215.21001 220.77"
         y="28"
         sodipodi:role="line"
         id="tspan34">sculpture. Le temps qu'elle parvient à présent à </tspan><tspan
         x="0 4.6300001 6.6700001 12.23 16.67 21.110001 26.110001 30.549999 36.290001 41.290001 45.73 48.509998 51.66 57.220001 60.369999 65 69.629997 74.629997 77.410004 83.150002 86.300003 91.860001 96.300003 101.3 104.08 109.64 112.42 115.57 121.13 123.91 132.8 138.36 142.25 148.36 152.8 158.36 162.25 165.39999 170.39999 176.50999 179.28999 185.03 187.07001 190.22 196.33 200.22 206.33 209.48 213.37 216.52 221.52 227.63 232.25999 235.03999 240.03999 243.92999"
         y="42"
         sodipodi:role="line"
         id="tspan36">s'accorder laisse place à la maturation d'intuitions et </tspan><tspan
         x="0 5.7399998 7.7800002 10.93 16.67 21.67 26.67 31.299999 34.080002 39.080002 45.189999 47.970001 53.34 58.34 62.970001 66.860001 72.419998 76.309998 79.459999 84.459999 90.57 93.349998 96.129997 98.910004 102.8 105.95 107.99 115.21 119.65 123.54 126.32 132.06 137.06 140.21001 144.10001 146.88 151.32001 156.32001 159.47 162.62 167.62 172.06 174.84 177.99001 182.99001 187.62 190.39999 195.39999 199.28999 203.73 208.73 213.36 216.14 218.92 221.7 225.59 228.37"
         y="56"
         sodipodi:role="line"
         id="tspan38">d'idées en gestation : &quot;l'Art doit relier les êtres...&quot;, </tspan><tspan
         x="0 3.8900001 7.04 9.0799999 15.19 21.299999 30.190001 35.75 41.860001 45.009998 48.900002 53.900002 56.68 62.419998 67.419998 70.57 74.459999 77.239998 82.800003 88.540001 94.279999 98.720001 103.72 109.83 115.57 120.01 125.01 127.79 133.35001 136.13 141.87 147.42999 151.87 155.75999 161.32001 166.69 171.69 176.13 178.91 181.69 187.25 192.62 197.62 202.06 204.84 207.99001 212.99001 215.77 220.21001 225.21001 229.84 233.73 238.73 241.50999 247.25 253.36"
         y="70"
         sodipodi:role="line"
         id="tspan40">&quot;l'humanité doit apprendre à partager, avec le reste du </tspan><tspan
         x="0 5.3699999 8.5200005 13.89 19.450001 25.559999 29.450001 32.23 35.009998 41.119999 47.23 52.23 55.009998 58.900002 63.900002 68.339996 72.779999 77.779999 80.559998 83.889999 87.040001 93.150002 96.300003 101.3 104.08 109.08 112.97 115.75 120.75 126.49 132.60001 135.75 140.38 145.94 151.5 154.64999 159.64999 162.42999 165.21001 167.99001 171.88 174.66 177.44 181.33 188 193 197.63 200.41 204.85001 210.96001 214.11 218 224.11 228.55 233.55 238.17999"
         y="84"
         sodipodi:role="line"
         id="tspan42">vivant, une terre finie et épuisable...&quot;, &quot;Les cultures </tspan><tspan
         x="0 4.6300001 9.6300001 15.74 19.629999 22.41 28.52 34.630001 39.630001 42.41 46.849998 50 54.439999 60.549999 65.550003 70.18 74.809998 79.809998 82.589996 85.370003 88.150002"
         y="98"
         sodipodi:role="line"
         id="tspan44">sont une richesse...&quot;</tspan></text></g></svg>
