<?xml version="1.0" encoding="UTF-8" standalone="no"?>
<svg
   xmlns:dc="http://purl.org/dc/elements/1.1/"
   xmlns:cc="http://creativecommons.org/ns#"
   xmlns:rdf="http://www.w3.org/1999/02/22-rdf-syntax-ns#"
   xmlns:svg="http://www.w3.org/2000/svg"
   xmlns="http://www.w3.org/2000/svg"
   xmlns:xlink="http://www.w3.org/1999/xlink"
   xmlns:sodipodi="http://sodipodi.sourceforge.net/DTD/sodipodi-0.dtd"
   xmlns:inkscape="http://www.inkscape.org/namespaces/inkscape"
   version="1.1"
   id="svg2"
   xml:space="preserve"
   width="559.37067"
   height="793.70135"
   viewBox="0 0 559.37067 793.70135"
   sodipodi:docname="3.svg"
   inkscape:version="1.0.2 (e86c870879, 2021-01-15)"><metadata
     id="metadata8"><rdf:RDF><cc:Work
         rdf:about=""><dc:format>image/svg+xml</dc:format><dc:type
           rdf:resource="http://purl.org/dc/dcmitype/StillImage" /><dc:title></dc:title></cc:Work></rdf:RDF></metadata><defs
     id="defs6"><clipPath
       clipPathUnits="userSpaceOnUse"
       id="clipPath18"><path
         d="M 0,595.276 H 419.528 V 0 H 0 Z"
         id="path16" /></clipPath><clipPath
       clipPathUnits="userSpaceOnUse"
       id="clipPath56"><path
         d="M 158.872,26.275 H 260.655 V 61.92 H 158.872 Z"
         id="path54" /></clipPath></defs><sodipodi:namedview
     pagecolor="#ffffff"
     bordercolor="#666666"
     borderopacity="1"
     objecttolerance="10"
     gridtolerance="10"
     guidetolerance="10"
     inkscape:pageopacity="0"
     inkscape:pageshadow="2"
     inkscape:window-width="962"
     inkscape:window-height="480"
     id="namedview4"
     showgrid="false"
     inkscape:zoom="1.0910905"
     inkscape:cx="279.68533"
     inkscape:cy="396.85068"
     inkscape:window-x="0"
     inkscape:window-y="23"
     inkscape:window-maximized="0"
     inkscape:current-layer="g10" /><g
     id="g10"
     inkscape:groupmode="layer"
     inkscape:label="Miroir de Valem3"
     transform="matrix(1.3333333,0,0,-1.3333333,0,793.70133)"><g
       id="g12"><g
         id="g14"
         clip-path="url(#clipPath18)"><text
           transform="matrix(1,0,0,-1,-386.5869,219.7383)"
           style="font-variant:normal;font-weight:normal;font-stretch:normal;font-size:59px;font-family:'MADE Canvas';-inkscape-font-specification:MADECanvas;writing-mode:lr-tb;fill:#2a3d95;fill-opacity:1;fill-rule:nonzero;stroke:none"
           id="text24"><tspan
             x="0 36.049 67.968002 80.358002 133.104 150.69189 175.6489 210.5179 228.1058 254.2428 266.63281 301.26581 333.18481"
             y="0"
             sodipodi:role="line"
             id="tspan20">Le Miroir de </tspan><tspan
             x="0 38.821999 68.440002 86.670998 118.59"
             y="70.800003"
             sodipodi:role="line"
             id="tspan22">Valem</tspan></text></g></g><text
       transform="matrix(1,0,0,-1,147.543,74.6255)"
       style="font-variant:normal;font-weight:normal;font-stretch:normal;font-size:10px;font-family:'Century Schoolbook';-inkscape-font-specification:CenturySchoolbook;writing-mode:lr-tb;fill:#231f20;fill-opacity:1;fill-rule:nonzero;stroke:none"
       id="text48"><tspan
         x="0 6.3000002 11.3 17.41 22.040001 24.82 27.969999 31.120001 35.560001 40.560001 46.669998 51.110001 56.110001 58.889999 66.110001 73.330002 76.660004 83.879997 90.919998 94.25 100.55 107.77 110.55 116.11 118.89 124.45"
         y="0"
         sodipodi:role="line"
         id="tspan26">Sous licence CC-BY-SA 4.0 </tspan><tspan
         x="-109.44 -102.22 -96.110001 -92.220001 -87.220001 -81.110001 -76.669998 -72.040001 -69.260002 -64.260002 -60.369999 -57.59 -53.150002 -48.709999 -43.709999 -37.970001 -34.82 -30.93"
         y="-444.35001"
         sodipodi:role="line"
         id="tspan28">Auteurs et crédits</tspan><tspan
         x="-109.44 -102.77 -97.769997 -92.400002 -88.510002 -83.510002 -80.730003 -77.949997 -75.169998 -67.949997 -62.389999 -59.240002 -54.240002 -45.349998 -42.57 -34.419998 -31.639999 -26.08 -19.969999 -16.82 -13.67 -8.6700001 -2.5599999 0.22 7.4400001 12.44 16.879999 20.77 26.879999 31.879999"
         y="-418.35001"
         sodipodi:role="line"
         id="tspan30">Texte : Valem &amp; Julien Berthod</tspan><tspan
         x="-109.44 -101.66 -96.660004 -92.029999 -87.400002 -84.25 -78.139999 -73.510002 -70.730003 -64.989998 -59.990002 -55.549999 -51.66 -47.220001 -41.66 -38.509998 -34.619999 -29.99 -27.209999 -24.43 -17.209999 -11.65 -8.5 -3.5"
         y="-405.35001"
         sodipodi:role="line"
         id="tspan32">Dessins portraits: Valem</tspan><tspan
         x="-109.44 -102.77 -96.660004 -91.660004 -87.769997 -82.769997 -79.989998 -74.25 -68.139999 -65.360001 -59.060001 -54.060001 -47.950001 -42.389999 -37.02 -31.459999 -28.309999 -25.530001 -22.75 -14.97 -8.8599997 -3.3 2.4400001"
         y="-392.35001"
         sodipodi:role="line"
         id="tspan34">Photo du Sénagal: Khady</tspan><tspan
         x="-109.44 -100 -96.849998 -92.220001 -87.220001 -84.440002 -79.440002 -73.330002 -70.550003 -64.809998 -59.25 -53.880001 -48.880001 -46.099998 -43.32 -40.540001 -33.869999 -28.309999 -22.200001 -17.76 -12.76 -9.6099997 -6.46 -0.34999999 4.6500001 7.4299998 15.21 20.77 23.92 29.48 35.59"
         y="-379.35001"
         sodipodi:role="line"
         id="tspan36">Mise en page : Laureline Dalaut</tspan><tspan
         x="-109.44 -102.22 -99.07 -94.440002 -88.330002 -83.330002 -80.18 -75.550003 -72.769997 -67.029999 -60.919998 -58.139999 -52.400002 -49.25 -44.619999 -38.880001 -33.880001 -29.25 -26.1 -22.209999 -19.059999 -15.73 -12.95 -10.17 -7.3899999 -0.72000003 4.8400002 10.95 15.39 20.389999 23.540001 26.690001 32.799999 37.799999 40.580002 48.360001 53.919998 57.07 62.630001 68.739998"
         y="-366.35001"
         sodipodi:role="line"
         id="tspan38">Visuels du dispositif : Laureline Dalaut</tspan><tspan
         x="-109.44 -102.22 -97.220001 -91.660004 -88.510002 -85.360001 -80.730003 -75.169998 -71.279999 -68.129997 -63.130001 -57.02 -54.240002 -48.5 -42.389999 -39.610001 -33.869999 -30.719999 -26.09 -20.35 -15.35 -10.72 -7.5700002 -3.6800001 -0.52999997 2.8 5.5799999 8.3599997 11.14 18.360001 22.25 27.25 30.4 33.549999 38.549999 42.990002 45.77 51.509998 56.509998 61.139999 63.919998 71.139999 76.139999 79.290001 83.919998 86.699997 93.370003 98.370003 102.81 107.81 113.92 120.03 125.03"
         y="-353.35001"
         sodipodi:role="line"
         id="tspan40">Réalisation du dispositif : Atelier des Bois Pérennes</tspan><tspan
         x="-109.44 -101.29 -95.18 -92.400002 -87.029999 -82.589996 -77.029999 -70.919998 -65.18 -62.400002 -53.509998 -48.509998 -44.07 -39.630001 -36.48 -33.700001 -28.139999 -22.030001 -16.66 -13.88 -7.77 -3.8800001 -0.73000002 2.4200001 5.5700002 10.2 15.76 19.65 24.65 30.76 35.200001 39.830002 42.610001 48.349998 54.459999 57.240002 62.98 66.129997 70.760002 76.5 81.5 86.129997 89.279999 93.169998 96.32 99.650002 104.28 107.06 112.8 117.8 123.91 128.35001 131.13 136.69 142.06 147.06 150.21001 154.64999 157.42999 163.17 168.17 174.28 180.39 185.39 188.17 191.32001 196.32001 202.42999 206.87"
         y="-327.35001"
         sodipodi:role="line"
         id="tspan42">Un grand merci aux utilisateurs du dispositifs pour avoir donné leur </tspan><tspan
         x="-109.44 -103.88 -99.440002 -95 -90 -85.559998 -79.82 -77.040001 -71.300003 -66.300003 -60.189999 -55.75 -52.970001 -47.41 -41.299999 -36.299999 -33.52 -30.370001 -25.370001 -19.26 -14.82 -12.04 -7.5999999 -2.5999999 0.73000002 3.8800001 8.8800001 12.77 15.55 21.290001 27.4 30.549999 35.18 39.810001 44.810001 47.59 53.150002 58.889999 64.629997 70.190002 74.629997 80.190002 83.339996 87.230003 91.669998 96.669998 99.449997 105.19 110.75 116.86 121.49 124.27 128.71001 133.71001 137.60001 140.38 145.38 151.49001 156.86 161.3 166.86 172.23"
         y="-314.35001"
         sodipodi:role="line"
         id="tspan44">accord pour que leur reflet puisse apparaître dans cet ouvrage</tspan><tspan
         x="1.14 8.9200001 14.48 18.370001 23.370001 26.15 31.889999 36.889999 39.669998 44.110001 49.110001 54.669998 57.82 60.970001 65.599998 71.160004 75.050003 78.199997 83.199997 89.309998 92.089996 94.870003 97.650002 103.21 108.77 114.33"
         y="-16.57"
         sodipodi:role="line"
         id="tspan46">Date de réalisation : 2021</tspan></text><g
       id="g50"><g
         id="g52"
         clip-path="url(#clipPath56)"><g
           id="g58"
           transform="matrix(101.78295,0,0,35.645506,158.8723,26.275591)"><image
             xlink:href="01.png"
             id="image60"
             transform="matrix(1,0,0,-1,0,1)"
             preserveAspectRatio="none"
             style="image-rendering:optimizeSpeed"
             height="1"
             width="1" /></g></g></g></g></svg>
