<?xml version="1.0" encoding="UTF-8" standalone="no"?>
<svg
   xmlns:dc="http://purl.org/dc/elements/1.1/"
   xmlns:cc="http://creativecommons.org/ns#"
   xmlns:rdf="http://www.w3.org/1999/02/22-rdf-syntax-ns#"
   xmlns:svg="http://www.w3.org/2000/svg"
   xmlns="http://www.w3.org/2000/svg"
   xmlns:xlink="http://www.w3.org/1999/xlink"
   xmlns:sodipodi="http://sodipodi.sourceforge.net/DTD/sodipodi-0.dtd"
   xmlns:inkscape="http://www.inkscape.org/namespaces/inkscape"
   version="1.1"
   id="svg2"
   xml:space="preserve"
   width="559.37067"
   height="793.70135"
   viewBox="0 0 559.37067 793.70135"
   sodipodi:docname="36.svg"
   inkscape:version="1.0.2 (e86c870879, 2021-01-15)"><metadata
     id="metadata8"><rdf:RDF><cc:Work
         rdf:about=""><dc:format>image/svg+xml</dc:format><dc:type
           rdf:resource="http://purl.org/dc/dcmitype/StillImage" /><dc:title></dc:title></cc:Work></rdf:RDF></metadata><defs
     id="defs6"><clipPath
       clipPathUnits="userSpaceOnUse"
       id="clipPath38"><path
         d="m 381.705,37.768 h 31.496 v 31.76 h -31.496 z"
         id="path36" /></clipPath><clipPath
       clipPathUnits="userSpaceOnUse"
       id="clipPath54"><path
         d="M 115.603,305.855 H 309.106 V 564.75 H 115.603 Z"
         id="path52" /></clipPath></defs><sodipodi:namedview
     pagecolor="#ffffff"
     bordercolor="#666666"
     borderopacity="1"
     objecttolerance="10"
     gridtolerance="10"
     guidetolerance="10"
     inkscape:pageopacity="0"
     inkscape:pageshadow="2"
     inkscape:window-width="962"
     inkscape:window-height="480"
     id="namedview4"
     showgrid="false"
     inkscape:zoom="1.0910905"
     inkscape:cx="279.68533"
     inkscape:cy="396.85068"
     inkscape:window-x="0"
     inkscape:window-y="23"
     inkscape:window-maximized="0"
     inkscape:current-layer="g10" /><g
     id="g10"
     inkscape:groupmode="layer"
     inkscape:label="Miroir de Valem3"
     transform="matrix(1.3333333,0,0,-1.3333333,0,793.70133)"><g
       id="g12"><g
         id="g14"
         transform="matrix(166.91136,0,0,238.42713,252.6162,24.382319)"><image
           xlink:href="36a.png"
           id="image16"
           transform="matrix(1,0,0,-1,0,1)"
           preserveAspectRatio="none"
           style="image-rendering:optimizeSpeed"
           height="1"
           width="1" /></g></g><text
       transform="matrix(1,0,0,-1,38.4043,205.2109)"
       style="font-variant:normal;font-weight:normal;font-stretch:normal;font-size:10px;font-family:'Century Schoolbook';-inkscape-font-specification:CenturySchoolbook;writing-mode:lr-tb;fill:#231f20;fill-opacity:1;fill-rule:nonzero;stroke:none"
       id="text30"><tspan
         x="0 7.7800002 12.22 17.780001 22.219999 27.219999 30 35.560001 38.34 42.970001 47.970001 54.080002 56.860001 60.75 65.75 74.639999 80.379997 85.010002"
         y="0"
         sodipodi:role="line"
         id="tspan18">Grâce à son temps </tspan><tspan
         x="0 4.6300001 10.74 16.48 22.219999 25.370001 30.370001 39.259998 44.259998 50.369999 54.259998 59.82 62.970001 67.410004 72.410004 75.190002 77.970001 84.080002 89.080002 91.860001 95.010002 100.01 102.79 107.23 112.23 118.34 122.78 127.78 133.52 137.41 140.19 145.92999 152.03999"
         y="14"
         sodipodi:role="line"
         id="tspan20">supplémentaire, né le concept du </tspan><tspan
         x="0 8.8900003 12.04 16.48 21.48 24.629999 29.07 31.85 37.59 42.59 45.369999 52.59 58.150002 61.299999 66.300003 75.190002 77.970001 80.75 86.860001 92.970001 95.75 101.49 104.64 109.27 115.01 120.01 124.64 127.79 131.67999 134.83 138.16"
         y="28"
         sodipodi:role="line"
         id="tspan22">miroir de Valem, un dispositif </tspan><tspan
         x="0 5.7399998 11.85 17.219999 21.85 25 30.559999 36.669998 41.669998 44.450001 50.189999 52.23 57.790001 62.23 66.120003 68.900002 75.010002 81.120003 90.010002 95.010002 99.449997 102.6 108.16 114.27 119.27 122.05 125.2 128.35001 133.91 138.35001 143.35001 146.13"
         y="42"
         sodipodi:role="line"
         id="tspan24">physique d'art numérique libre, </tspan><tspan
         x="0 4.6300001 9.6300001 12.78 15.93 21.67 27.23 30.379999 34.82 39.82 42.599998 45.380001 50.380001 56.119999 61.119999 67.230003 70.559998 75.190002 80.190002 86.300003 90.739998 95.18 100.18 102.96 105.74 108.89 113.89 121.67 125 128.89 133.89 138.33 144.44 147.22"
         y="56"
         sodipodi:role="line"
         id="tspan26">solidaire, open-source, low-tech, </tspan><tspan
         x="0 3.1500001 9.2600002 13.15 18.15 22.59 28.15 32.59 36.48 39.630001 42.959999 45.740002 48.52 52.959999 57.959999 64.07 67.959999 72.400002 75.550003 81.110001 87.220001 91.110001 94.260002 97.589996 100.37 105.37 109.26 112.04 117.04 122.41 127.41 130.56 136.67 140.56 143.71001 147.03999"
         y="70"
         sodipodi:role="line"
         id="tspan28">interactif, contributif et évolutif.</tspan></text><g
       id="g32"><g
         id="g34"
         clip-path="url(#clipPath38)"><g
           id="g40"
           transform="matrix(31.495334,0,0,31.760001,381.70563,37.768296)"><image
             xlink:href="36b.png"
             id="image42"
             transform="matrix(1,0,0,-1,0,1)"
             preserveAspectRatio="none"
             style="image-rendering:optimizeSpeed"
             height="1"
             width="1" /></g></g></g><text
       transform="matrix(1,0,0,-1,389.4844,292.9434)"
       style="font-variant:normal;font-weight:normal;font-stretch:normal;font-size:17px;font-family:Cormorant;-inkscape-font-specification:Cormorant;writing-mode:lr-tb;fill:#231f20;fill-opacity:1;fill-rule:nonzero;stroke:none"
       id="text46"><tspan
         x="0 7.973"
         y="0"
         sodipodi:role="line"
         id="tspan44">36</tspan></text><g
       id="g48"><g
         id="g50"
         clip-path="url(#clipPath54)"><g
           id="g56"
           transform="matrix(193.50205,0,0,258.89471,115.60356,305.85554)"><image
             xlink:href="36c.png"
             id="image58"
             transform="matrix(1,0,0,-1,0,1)"
             preserveAspectRatio="none"
             style="image-rendering:optimizeSpeed"
             height="1"
             width="1" /></g></g></g></g></svg>
