<?xml version="1.0" encoding="UTF-8" standalone="no"?>
<svg
   xmlns:dc="http://purl.org/dc/elements/1.1/"
   xmlns:cc="http://creativecommons.org/ns#"
   xmlns:rdf="http://www.w3.org/1999/02/22-rdf-syntax-ns#"
   xmlns:svg="http://www.w3.org/2000/svg"
   xmlns="http://www.w3.org/2000/svg"
   xmlns:xlink="http://www.w3.org/1999/xlink"
   xmlns:sodipodi="http://sodipodi.sourceforge.net/DTD/sodipodi-0.dtd"
   xmlns:inkscape="http://www.inkscape.org/namespaces/inkscape"
   version="1.1"
   id="svg2"
   xml:space="preserve"
   width="559.37067"
   height="793.70135"
   viewBox="0 0 559.37067 793.70135"
   sodipodi:docname="21.svg"
   inkscape:version="1.0.2 (e86c870879, 2021-01-15)"><metadata
     id="metadata8"><rdf:RDF><cc:Work
         rdf:about=""><dc:format>image/svg+xml</dc:format><dc:type
           rdf:resource="http://purl.org/dc/dcmitype/StillImage" /><dc:title></dc:title></cc:Work></rdf:RDF></metadata><defs
     id="defs6"><clipPath
       clipPathUnits="userSpaceOnUse"
       id="clipPath42"><path
         d="m 181.32,40.561 h 149.793 v 158 H 181.32 Z"
         id="path40" /></clipPath><clipPath
       clipPathUnits="userSpaceOnUse"
       id="clipPath54"><path
         d="m 266.318,35.755 h 31.219 v 28.617 h -31.219 z"
         id="path52" /></clipPath></defs><sodipodi:namedview
     pagecolor="#ffffff"
     bordercolor="#666666"
     borderopacity="1"
     objecttolerance="10"
     gridtolerance="10"
     guidetolerance="10"
     inkscape:pageopacity="0"
     inkscape:pageshadow="2"
     inkscape:window-width="962"
     inkscape:window-height="480"
     id="namedview4"
     showgrid="false"
     inkscape:zoom="1.0910905"
     inkscape:cx="279.68533"
     inkscape:cy="396.85068"
     inkscape:window-x="0"
     inkscape:window-y="23"
     inkscape:window-maximized="0"
     inkscape:current-layer="g10" /><g
     id="g10"
     inkscape:groupmode="layer"
     inkscape:label="Miroir de Valem3"
     transform="matrix(1.3333333,0,0,-1.3333333,0,793.70133)"><text
       transform="matrix(1,0,0,-1,13.8965,289.8721)"
       style="font-variant:normal;font-weight:normal;font-stretch:normal;font-size:17px;font-family:Cormorant;-inkscape-font-specification:Cormorant;writing-mode:lr-tb;fill:#231f20;fill-opacity:1;fill-rule:nonzero;stroke:none"
       id="text14"><tspan
         x="0 7.973"
         y="0"
         sodipodi:role="line"
         id="tspan12">21</tspan></text><text
       transform="matrix(1,0,0,-1,41.4663,280.7666)"
       style="font-variant:normal;font-weight:normal;font-stretch:normal;font-size:10px;font-family:'Century Schoolbook';-inkscape-font-specification:CenturySchoolbook;writing-mode:lr-tb;fill:#131110;fill-opacity:1;fill-rule:nonzero;stroke:none"
       id="text30"><tspan
         x="0 4.0700002 7.2199998 11.85 14.63 20 22.780001 27.219999 32.220001 36.110001 41.110001 47.220001 51.66 57.77 62.77 67.209999 72.209999 78.32 82.209999 84.989998 90.550003 93.330002 96.660004 101.66 104.81 109.44 112.22 117.22 123.33 127.22 131.66 136.66 139.44 145 150.56 156.12 161.67999 164.46001 169.46001 173.35001 176.13 181.69 187.25 192.81 198.37 201.14999 203.92999 209.49001 213.92999 218.37 224.48 229.48 232.63 235.78 238.92999 242.08 246.71001"
         y="0"
         sodipodi:role="line"
         id="tspan16">Ils y retourneront 6 fois entre 2003 et 2007, accueillis </tspan><tspan
         x="0 4.4400001 10.55 15.55 20.360001 23.139999 29.809999 35.369999 38.52 42.41 47.779999 50.560001 53.34 56.490002 61.490002 64.269997 68.709999 73.709999 79.82 84.449997 87.599998 93.709999 96.489998 102.23 107.23 110.01 117.79 123.9 129.46001 135.2 140.57001 143.35001 146.13 151.69 157.8 160.58 166.14 171.14 177.25 181.14 183.92 189.66 195.77 198.55 204.11 210.22 215.78 220.22 224.11 227.25999 232.25999 236.7"
         y="14"
         sodipodi:role="line"
         id="tspan18">chez Laity, le cousin de Khady, au bout du quartier </tspan><tspan
         x="0 5.7399998 7.7800002 15.56 21.67 26.110001 31.67 37.41 40.189999 42.970001 48.529999 54.639999 57.419998 62.049999 67.050003 70.199997 76.309998 79.089996 84.830002 86.870003 92.980003 99.089996 104.09 106.87 110.2 115.76 124.65 127.8 130.95 134.10001 139.10001 141.88 145.77 150.21001 155.77 161.50999 164.66 168.55 171.7 176.7 182.81 188.92 193.92 197.07001 200.22 205.22 208 213 219.11 221.89 227.25999 230.41 235.78 240.78 246.89 250.78"
         y="28"
         sodipodi:role="line"
         id="tspan20">d'Oncad, au sein d'une famille traditionnelle où vivent </tspan><tspan
         x="0 5 11.11 15.74 20.74 29.629999 35.189999 38.34 43.34 47.970001 50.75 59.639999 64.639999 69.080002 74.080002 78.709999 81.489998 84.269997 89.639999 94.080002 99.639999 105.75 111.49 116.12 119.45 128.34 133.34 137.78 142.78 147.41 150.19 152.97 156.3 161.3 170.19 179.08 184.08 188.71001 191.49001 194.27 198.89999 207.23 213.34 217.78 222.41 225.19 227.97 231.3 235.74001 240.74001 245.17999 250.17999 254.81 257.59"
         y="42"
         sodipodi:role="line"
         id="tspan22">ensembles mères, grands-mères, femmes, sœurs, frères, </tspan><tspan
         x="0 4.4400001 9.4399996 15.55 20.18 23.33 29.440001 34.07 36.849998 41.849998 45.740002 48.52 54.630001 60.740002 65.739998 68.519997 77.410004 82.779999 87.220001 90.370003 95.93 101.67 106.67 111.3 114.08 119.82 124.82 127.6 133.16 138.72 147.61 153.17 156.32001 162.42999 167.06 169.84 172.62 175.39999 178.17999 182.25 185.39999 190.03 192.81 197.81 203.92"
         y="56"
         sodipodi:role="line"
         id="tspan24">cousins et une myriades de bambins... Ils en </tspan><tspan
         x="0 5.7399998 11.3 15.74 19.629999 25.190001 30.559999 35.560001 40 45 51.110001 55 57.779999 60.93 65.93 70.559998 73.339996 76.669998 81.669998 85.559998 90.559998 95.190002 97.970001 100.75 103.9 108.9 113.53 116.31 121.87 127.43 133.17 137.06 142.06 150.95 155.95 160.58 163.36 166.14 169.28999 174.28999 178.92 181.7 190.59 196.14999 200.59 203.74001 209.3 214.67 219.67 224.3 227.08 229.86 234.86 238.75"
         y="70"
         sodipodi:role="line"
         id="tspan26">partageront les fêtes, les baptêmes, les mariages, et </tspan><tspan
         x="0 5.7399998 11.3 15.74 19.07 24.07 27.219999 31.85 34.630001 37.779999 42.779999 47.41 50.189999 55.93 60.369999 65.93 74.82 79.82 84.449997 87.230003"
         y="84"
         sodipodi:role="line"
         id="tspan28">parfois les drames. </tspan></text><g
       id="g32"
       transform="matrix(158.16767,0,0,244.8448,20.475433,319.73437)"><image
         xlink:href="21a.png"
         id="image34"
         transform="matrix(1,0,0,-1,0,1)"
         preserveAspectRatio="none"
         style="image-rendering:optimizeSpeed"
         height="1"
         width="1" /></g><g
       id="g36"><g
         id="g38"
         clip-path="url(#clipPath42)"><g
           id="g44"
           transform="matrix(149.79399,0,0,157.99914,181.31998,40.561375)"><image
             xlink:href="21b.png"
             id="image46"
             transform="matrix(1,0,0,-1,0,1)"
             preserveAspectRatio="none"
             style="image-rendering:optimizeSpeed"
             height="1"
             width="1" /></g></g></g><g
       id="g48"><g
         id="g50"
         clip-path="url(#clipPath54)"><g
           id="g56"
           transform="matrix(31.21959,0,0,28.617957,266.31781,35.754868)"><image
             xlink:href="21c.png"
             id="image58"
             transform="matrix(1,0,0,-1,0,1)"
             preserveAspectRatio="none"
             style="image-rendering:optimizeSpeed"
             height="1"
             width="1" /></g></g></g><g
       id="g60"
       transform="matrix(187.33697,0,0,259.93161,216.90407,313.64132)"><image
         xlink:href="21d.png"
         id="image62"
         transform="matrix(1,0,0,-1,0,1)"
         preserveAspectRatio="none"
         style="image-rendering:optimizeSpeed"
         height="1"
         width="1" /></g></g></svg>
