<?xml version="1.0" encoding="UTF-8" standalone="no"?>
<svg
   xmlns:dc="http://purl.org/dc/elements/1.1/"
   xmlns:cc="http://creativecommons.org/ns#"
   xmlns:rdf="http://www.w3.org/1999/02/22-rdf-syntax-ns#"
   xmlns:svg="http://www.w3.org/2000/svg"
   xmlns="http://www.w3.org/2000/svg"
   xmlns:xlink="http://www.w3.org/1999/xlink"
   xmlns:sodipodi="http://sodipodi.sourceforge.net/DTD/sodipodi-0.dtd"
   xmlns:inkscape="http://www.inkscape.org/namespaces/inkscape"
   version="1.1"
   id="svg2"
   xml:space="preserve"
   width="559.37067"
   height="793.70135"
   viewBox="0 0 559.37067 793.70135"
   sodipodi:docname="72.svg"
   inkscape:version="1.0.2 (e86c870879, 2021-01-15)"><metadata
     id="metadata8"><rdf:RDF><cc:Work
         rdf:about=""><dc:format>image/svg+xml</dc:format><dc:type
           rdf:resource="http://purl.org/dc/dcmitype/StillImage" /><dc:title /></cc:Work></rdf:RDF></metadata><defs
     id="defs6" /><sodipodi:namedview
     pagecolor="#ffffff"
     bordercolor="#666666"
     borderopacity="1"
     objecttolerance="10"
     gridtolerance="10"
     guidetolerance="10"
     inkscape:pageopacity="0"
     inkscape:pageshadow="2"
     inkscape:window-width="962"
     inkscape:window-height="480"
     id="namedview4"
     showgrid="false"
     inkscape:zoom="1.0910905"
     inkscape:cx="279.68533"
     inkscape:cy="396.85068"
     inkscape:window-x="515"
     inkscape:window-y="323"
     inkscape:window-maximized="0"
     inkscape:current-layer="g10"
     inkscape:document-rotation="0" /><g
     id="g10"
     inkscape:groupmode="layer"
     inkscape:label="Miroir de Valem3"
     transform="matrix(1.3333333,0,0,-1.3333333,0,793.70133)"><image
       sodipodi:absref="/media/stph/data/git/mdv-book/src/72b.png"
       xlink:href="72b.png"
       width="1"
       height="1"
       style="image-rendering:optimizeSpeed"
       preserveAspectRatio="none"
       transform="matrix(231.79499,0,0,-307.67673,96.212039,367.71203)"
       mask="none"
       id="image20" /><text
       transform="matrix(1,0,0,-1,106.5146,501.8242)"
       style="font-variant:normal;font-weight:normal;font-stretch:normal;font-size:10px;font-family:'Century Schoolbook';-inkscape-font-specification:CenturySchoolbook;writing-mode:lr-tb;fill:#131110;fill-opacity:1;fill-rule:nonzero;stroke:none"
       id="text34"><tspan
         x="0 6.6700001 12.23 16.67 19.450001 24.08 29.08 32.23 35.380001 41.119999 46.68 51.119999 54.27 58.16 63.16 65.940002 71.68 76.68 82.790001 87.230003 90.010002 93.160004 98.160004 102.79 105.57 111.31 116.31 120.75 125.38 130.38 136.49001 142.60001 147.60001 152.23 155.00999 158.16 163.16 167.78999 170.57001 176.31 179.46001 185.57001 190.2 192.98 198.72 203.72 212.61 218.72 224.83 227.98 232.98 237.61 240.39 243.17 249.84 255.39999"
         y="0"
         sodipodi:role="line"
         id="tspan22">Par solidarité pour les personnes les plus démunies, La </tspan><tspan
         x="-19.51 -16.18 -10.62 -1.73 1.42 4.5700002 7.7199998 12.72 15.5 21.24 26.24 29.02 35.689999 41.25 44.400002 48.290001 53.66 56.439999 59.220001 64.779999 70.889999 74.040001 76.82 81.82 85.709999 91.269997 94.419998 98.309998 101.09 104.24 109.8 112.58 118.32 122.76 125.91 132.02 136.46001 139.61 145.35001 150.91 154.06 159.06 161.84 166.28 169.42999 174.99001 178.14 183.14 185.92 191.66 196.66 201.28999 204.07001 209.81 214.81 220.92 225.55 228.33 231.11 236.67 239.45 242.78 248.34 251.49001 255.38"
         y="14"
         sodipodi:role="line"
         id="tspan24">famille de Laity, qui était la principale cible des dons, a fait </tspan><tspan
         x="-23.91 -20.76 -15.76 -12.98 -8.54 -2.4300001 2.5699999 5.7199998 11.09 13.87 19.610001 24.610001 27.389999 33.130001 38.689999 43.130001 47.02 52.580002 57.950001 62.950001 67.389999 70.169998 74.610001 79.610001 82.389999 87.949997 94.059998 96.099998 101.1 104.25 107.4 112.4 115.18 120.74 126.11 131.67 134.82001 138.71001 141.49001 145.92999 150.92999 155.37 161.48 164.25999 169.82001 175.19 180.19 184.63 187.41 190.56 195.56 200.19 202.97 206.3 211.86 220.75 223.89999 227.05 230.2 235.2 239.83 242.61 245.75999 250.75999 255.39"
         y="28"
         sodipodi:role="line"
         id="tspan26">le choix de partager ce qu’elle avait reçu avec les familles les </tspan><tspan
         x="-11.69 -5.9499998 -2.8 3.3099999 7.9400001 10.72 16.459999 22.02 28.129999 33.5 37.939999 42.939999 47.57 50.349998 56.09 62.200001 64.980003 70.540001 76.650002 82.209999 86.650002 90.540001 93.690002 98.690002 103.13 105.91 108.69 113.13 118.13 120.91 125.54 130.53999 136.64999 140.53999 143.32001 148.88 152.03 158.14 162.77 165.92 168.7 174.44 177.59 183.7 188.33 191.11 196.85001 201.85001 204.63 210.19 215.75 218.53 221.86 227.42 236.31 239.46001 242.61 245.75999 250.75999 255.39"
         y="42"
         sodipodi:role="line"
         id="tspan28">plus pauvres du quartier, ce sont ainsi plus de 50 familles </tspan><tspan
         x="2.24 7.8000002 13.91 17.059999 19.84 24.84 30.950001 34.84 37.619999 43.360001 49.470001 52.25 57.810001 62.810001 68.919998 73.919998 77.25 80.400002 84.839996 87.989998 92.989998 97.43 100.21 104.65 109.65 113.54 116.32 120.76 125.76 129.64999 133.53999 138.53999 141.32001 146.88 150.03 155.77 160.77 163.55 169.28999 174.28999 180.39999 184.84 187.62 191.50999 195.95 201.50999 206.88 211.88 216.32001 220.95 225.95 230.39 233.17 237.61 242.61 246.5 250.39 255.39"
         y="56"
         sodipodi:role="line"
         id="tspan30">qui ont pu bénéficier cet cette aide pour traverser cette </tspan><tspan
         x="181.31 187.05 192.05 196.49001 199.64 204.64 210.38 215.38 218.16 223.89999 227.05 230.38 233.71001 236.86 241.3 244.45 247.60001 252.60001"
         y="70"
         sodipodi:role="line"
         id="tspan32">période difficile.</tspan></text><text
       transform="matrix(1,0,0,-1,389.4844,292.9443)"
       style="font-variant:normal;font-weight:normal;font-stretch:normal;font-size:17px;font-family:Cormorant;-inkscape-font-specification:Cormorant;writing-mode:lr-tb;fill:#231f20;fill-opacity:1;fill-rule:nonzero;stroke:none"
       id="text38"><tspan
         x="0 7.973"
         y="0"
         sodipodi:role="line"
         id="tspan36">72</tspan></text></g></svg>
