<?xml version="1.0" encoding="UTF-8" standalone="no"?>
<svg
   xmlns:dc="http://purl.org/dc/elements/1.1/"
   xmlns:cc="http://creativecommons.org/ns#"
   xmlns:rdf="http://www.w3.org/1999/02/22-rdf-syntax-ns#"
   xmlns:svg="http://www.w3.org/2000/svg"
   xmlns="http://www.w3.org/2000/svg"
   xmlns:sodipodi="http://sodipodi.sourceforge.net/DTD/sodipodi-0.dtd"
   xmlns:inkscape="http://www.inkscape.org/namespaces/inkscape"
   version="1.1"
   id="svg2"
   xml:space="preserve"
   width="559.37067"
   height="793.70135"
   viewBox="0 0 559.37067 793.70135"
   sodipodi:docname="53.ai.svg"
   inkscape:version="1.0.2 (e86c870879, 2021-01-15)"><metadata
     id="metadata8"><rdf:RDF><cc:Work
         rdf:about=""><dc:format>image/svg+xml</dc:format><dc:type
           rdf:resource="http://purl.org/dc/dcmitype/StillImage" /><dc:title></dc:title></cc:Work></rdf:RDF></metadata><defs
     id="defs6" /><sodipodi:namedview
     pagecolor="#ffffff"
     bordercolor="#666666"
     borderopacity="1"
     objecttolerance="10"
     gridtolerance="10"
     guidetolerance="10"
     inkscape:pageopacity="0"
     inkscape:pageshadow="2"
     inkscape:window-width="962"
     inkscape:window-height="480"
     id="namedview4"
     showgrid="false"
     inkscape:zoom="1.0910905"
     inkscape:cx="279.68533"
     inkscape:cy="396.85068"
     inkscape:window-x="0"
     inkscape:window-y="23"
     inkscape:window-maximized="0"
     inkscape:current-layer="g10" /><g
     id="g10"
     inkscape:groupmode="layer"
     inkscape:label="Miroir de Valem3"
     transform="matrix(1.3333333,0,0,-1.3333333,0,793.70133)"><text
       transform="matrix(1,0,0,-1,13.8975,289.873)"
       style="font-variant:normal;font-weight:normal;font-stretch:normal;font-size:17px;font-family:Cormorant;-inkscape-font-specification:Cormorant;writing-mode:lr-tb;fill:#231f20;fill-opacity:1;fill-rule:nonzero;stroke:none"
       id="text14"><tspan
         x="0 7.973"
         y="0"
         sodipodi:role="line"
         id="tspan12">53</tspan></text><text
       transform="matrix(1,0,0,-1,125.7246,363.4736)"
       style="font-variant:normal;font-weight:normal;font-stretch:normal;font-size:55px;font-family:'MADE Canvas';-inkscape-font-specification:MADECanvas;writing-mode:lr-tb;fill:#231f20;fill-opacity:1;fill-rule:nonzero;stroke:none"
       id="text18"><tspan
         x="0 34.759998 63.580002 93.329498 127.3195 143.7095"
         y="0"
         sodipodi:role="line"
         id="tspan16">Avenir</tspan></text><text
       transform="matrix(1,0,0,-1,122.436,302.2217)"
       style="font-variant:normal;font-weight:normal;font-stretch:normal;font-size:16px;font-family:Cormorant;-inkscape-font-specification:Cormorant;writing-mode:lr-tb;fill:#231f20;fill-opacity:1;fill-rule:nonzero;stroke:none"
       id="text22"><tspan
         x="0 9.1680002 15.84 19.84 25.007999 32.848 37.52 45.360001 50.688 54.688 62.688 70.528 74.528 86.863998 90.528 95.856003 104.016 107.68 113.008 117.008 125.008 131.67999 135.67999 145.4928 151.9888 155.6528 162.3248"
         y="0"
         sodipodi:role="line"
         id="tspan20">Le futur du miroir de Valem</tspan></text><g
       id="g24"
       transform="translate(108.0975,277.5917)"><path
         d="M 0,0 H 203.333"
         style="fill:none;stroke:#231f20;stroke-width:0.75;stroke-linecap:butt;stroke-linejoin:miter;stroke-miterlimit:10;stroke-dasharray:none;stroke-opacity:1"
         id="path26" /></g><g
       id="g28"
       transform="translate(43.6473,159.3534)"><path
         d="M 0,0 H 89.75"
         style="fill:none;stroke:#231f20;stroke-width:0.75;stroke-linecap:butt;stroke-linejoin:miter;stroke-miterlimit:10;stroke-dasharray:none;stroke-opacity:1"
         id="path30" /></g><text
       transform="matrix(1,0,0,-1,37.6934,176.627)"
       style="font-variant:normal;font-weight:normal;font-stretch:normal;font-size:16px;font-family:Cormorant;-inkscape-font-specification:Cormorant;writing-mode:lr-tb;fill:#231f20;fill-opacity:1;fill-rule:nonzero;stroke:none"
       id="text34"><tspan
         x="0 12.336 19.007999 26.1952 32.867199 36.5312 44.6912 52.8512 61.0112 67.683197 80.019203 86.6912 94.851196 99.523201 103.5232 111.5232 115.0272 122.8672 131.02721 137.6992 141.6992 145.3632 153.52319 158.19521 164.8672 170.19521 175.3632 181.85921 188.5312 195.2032 199.2032 209.6096 216.2816"
         y="0"
         sodipodi:role="line"
         id="tspan32">Développement d’une interface web</tspan></text><text
       transform="matrix(1,0,0,-1,43.6465,131.8906)"
       style="font-variant:normal;font-weight:normal;font-stretch:normal;font-size:10px;font-family:'Century Schoolbook';-inkscape-font-specification:CenturySchoolbook;writing-mode:lr-tb;fill:#231f20;fill-opacity:1;fill-rule:nonzero;stroke:none"
       id="text44"><tspan
         x="0 7.2199998 10.55 13.7 19.809999 22.59 28.33 33.330002 36.110001 45 50.560001 54.450001 59.450001 63.889999 67.040001 72.599998 75.75 78.900002 83.529999 88.529999 92.970001 95.75 98.900002 103.9 106.68 109.83 112.98 117.98 124.09 126.87 131.87 137.98 141.87 146.31 151.31 154.09 157.24001 162.24001 166.87 169.64999 174.09 180.2 183.35001 187.24001 193.35001 197.78999 202.78999 207.42 210.2 215.94 221.5 225.94 228.72 231.87 237.42999"
         y="0"
         sodipodi:role="line"
         id="tspan36">Afin de matérialiser le lien entre les cultures par la </tspan><tspan
         x="0 4.4400001 8.8800001 13.88 19.440001 23.33 26.48 31.48 37.59 40.369999 46.110001 51.110001 53.889999 58.330002 63.330002 66.660004 69.809998 74.809998 78.699997 83.330002 86.110001 95 100 104.63 110.19 113.34 118.9 125.01 130.00999 134.64 137.42 140.2 146.31 152.42 157.42 160.2 163.35001 169.46001 173.35001 178.35001 182.78999 186.12 191.67999 196.12 201.12 203.89999 211.67999 216.67999 222.24001 225.02 230.02 234.64999 238.53999 241.32001 246.32001 252.42999"
         y="14"
         sodipodi:role="line"
         id="tspan38">création de reflets mosaïques, une interface web est en </tspan><tspan
         x="0 4.4400001 9.4399996 15.55 19.99 24.620001 27.4 33.139999 38.139999 40.919998 46.66 51.66 57.029999 62.029999 65.18 70.18 75.919998 81.660004 86.660004 95.550003 100.55 106.66 110.55 113.33 119.07 124.07 130.17999 134.62 137.39999 143.14 148.14 152.58 161.47 166.47 170.36 174.25 178.69 183.69 186.47 192.03 198.14 200.92 206.66 212.77 218.33 221.48 224.63 229.07001 231.85001 237.59 242.59"
         y="28"
         sodipodi:role="line"
         id="tspan40">cours de développement pour permettre au public de </tspan><tspan
         x="0 5.3699999 10.37 16.48 21.48 25.92 30.92 35.360001 38.139999 42.77 47.77 53.880001 56.66 61.099998 66.099998 69.43 72.580002 77.580002 81.470001 84.25 89.809998 92.589996 98.330002 101.48 106.11 110 115.56 121.67 126.11 131.11 133.89 139.45 142.23 147.97 153.53 157.97 161.86 165.00999 169.45 172.23 177.97 180.00999 186.12 192.23 197.23 200.00999 205.75 211.86 216.86 220.75 225.75"
         y="42"
         sodipodi:role="line"
         id="tspan42">générer son reflet à distance à partir d'une photo.</tspan></text></g></svg>
