<?xml version="1.0" encoding="UTF-8" standalone="no"?>
<svg
   xmlns:dc="http://purl.org/dc/elements/1.1/"
   xmlns:cc="http://creativecommons.org/ns#"
   xmlns:rdf="http://www.w3.org/1999/02/22-rdf-syntax-ns#"
   xmlns:svg="http://www.w3.org/2000/svg"
   xmlns="http://www.w3.org/2000/svg"
   xmlns:xlink="http://www.w3.org/1999/xlink"
   xmlns:sodipodi="http://sodipodi.sourceforge.net/DTD/sodipodi-0.dtd"
   xmlns:inkscape="http://www.inkscape.org/namespaces/inkscape"
   version="1.1"
   id="svg2"
   xml:space="preserve"
   width="559.37067"
   height="793.70135"
   viewBox="0 0 559.37067 793.70135"
   sodipodi:docname="50.svg"
   inkscape:version="1.0.2 (e86c870879, 2021-01-15)"><metadata
     id="metadata8"><rdf:RDF><cc:Work
         rdf:about=""><dc:format>image/svg+xml</dc:format><dc:type
           rdf:resource="http://purl.org/dc/dcmitype/StillImage" /><dc:title></dc:title></cc:Work></rdf:RDF></metadata><defs
     id="defs6" /><sodipodi:namedview
     pagecolor="#ffffff"
     bordercolor="#666666"
     borderopacity="1"
     objecttolerance="10"
     gridtolerance="10"
     guidetolerance="10"
     inkscape:pageopacity="0"
     inkscape:pageshadow="2"
     inkscape:window-width="962"
     inkscape:window-height="480"
     id="namedview4"
     showgrid="false"
     inkscape:zoom="1.0910905"
     inkscape:cx="129.24696"
     inkscape:cy="396.85068"
     inkscape:window-x="0"
     inkscape:window-y="23"
     inkscape:window-maximized="0"
     inkscape:current-layer="g10" /><g
     id="g10"
     inkscape:groupmode="layer"
     inkscape:label="Miroir de Valem3"
     transform="matrix(1.3333333,0,0,-1.3333333,0,793.70133)"><g
       id="g12"
       transform="translate(40.2482,236.2112)"><path
         d="M 0,0 H 89.75"
         style="fill:none;stroke:#231f20;stroke-width:0.75;stroke-linecap:butt;stroke-linejoin:miter;stroke-miterlimit:10;stroke-dasharray:none;stroke-opacity:1"
         id="path14" /></g><text
       transform="matrix(1,0,0,-1,34.2939,253.4839)"
       style="font-variant:normal;font-weight:normal;font-stretch:normal;font-size:16px;font-family:Cormorant;-inkscape-font-specification:Cormorant;writing-mode:lr-tb;fill:#231f20;fill-opacity:1;fill-rule:nonzero;stroke:none"
       id="text18"><tspan
         x="0 9.1680002 15.664 19.664 26.336 34.175999 37.84 42.512001 50.352001 55.68 62.352001 66.351997 70.015999 73.68 81.839996 87.167999"
         y="0"
         sodipodi:role="line"
         id="tspan16">La culture libre</tspan></text><text
       transform="matrix(1,0,0,-1,40.248,208.748)"
       style="font-variant:normal;font-weight:normal;font-stretch:normal;font-size:10px;font-family:'Century Schoolbook';-inkscape-font-specification:CenturySchoolbook;writing-mode:lr-tb;fill:#231f20;fill-opacity:1;fill-rule:nonzero;stroke:none"
       id="text34"><tspan
         x="0 7.2199998 12.22 15 20.74 23.889999 28.52 34.259998 39.259998 43.889999 47.040001 50.93 54.080002 57.41 60.189999 65.190002 69.080002 71.860001 75.010002 80.010002 84.639999 87.419998 93.160004 97.599998 102.6 108.34 114.45 117.6 121.49 126.12 128.89999 134.46001 140.57001 143.72 146.5 149.64999 154.64999 157.42999 161.87 166.87 175.75999 181.5 186.5 191.13 196.13 202.24001 206.13 208.91 213.91 217.8 220.58 225.58 231.69"
         y="0"
         sodipodi:role="line"
         id="tspan20">Ce dispositif et les produits qui le composent et en </tspan><tspan
         x="0 5.7399998 10.74 15.18 20.18 26.290001 29.440001 34.439999 40.549999 44.439999 47.220001 53.330002 58.330002 61.110001 65.739998 70.739998 76.849998 80.739998 83.519997 86.669998 92.230003 95.010002 100.75 105.19 110.19 115.93 120.37 123.52 128.52 132.41 137.41 140.19 145.92999 150.92999 153.71001 159.45 164.45 168.89 173.52 178.52 184.63 190.74001 195.74001 198.52 201.3 205.37 208.52 213.14999"
         y="14"
         sodipodi:role="line"
         id="tspan22">découlent ne sont la propriété de personne. Ils </tspan><tspan
         x="0 5.5599999 11.3 17.040001 22.6 27.040001 30.93 34.080002 39.080002 45.189999 51.299999 56.299999 62.41 66.300003 69.080002 74.639999 77.419998 81.309998 86.309998 92.419998 96.309998 99.089996 102.24 107.24 110.02 118.91 123.91 130.02 135.75999 140.75999 143.53999 146.32001 152.99001 157.99001 162.62 165.39999 170.96001 176.7 182.44 185.59 188.74001 193.17999 198.74001 202.63 205.78 210.78 216.89 221.52 224.3 227.45 232.45 237.82001 240.97 245.41 248.56 253.56 256.70999 261.34 264.12"
         y="28"
         sodipodi:role="line"
         id="tspan24">appartiennent à tout le monde. Les applications logiciels, </tspan><tspan
         x="0 3.1500001 8.1499996 12.78 15.56 21.299999 24.450001 30.01 36.119999 40.75 43.529999 49.27 54.27 57.049999 61.490002 66.489998 72.599998 77.040001 82.040001 87.779999 91.669998 94.82 99.82 105.93 108.71 117.6 122.6 127.04 132.60001 138.71001 141.86 147.42 153.53 158.53 161.31 164.09 167.24001 172.24001 176.87 179.64999 185.39 190.39 195.02 199.64999 202.8 208.91 213.53999 216.32001 222.06 227.06 229.84 237.06 242.62 245.77 250.77 259.66 262.44"
         y="42"
         sodipodi:role="line"
         id="tspan26">les plans de conception mécanique, les dessins de Valem, </tspan><tspan
         x="0 3.1500001 8.1499996 12.78 15.56 20 25 28.33 31.48 36.48 40.369999 45 47.779999 53.150002 58.150002 64.260002 69.260002 73.699997 78.699997 83.330002 86.110001 88.889999 93.519997 98.519997 104.63 108.52 111.3 115.19 120.19 126.3 130.92999 133.71001 138.34 143.34 149.45 154.08 156.86 160.00999 163.16 167.60001 172.60001 178.71001 183.14999 188.14999 190.92999 194.08 197.23 202.78999 207.23 212.23 215.00999 217.78999 225.00999 231.12 236.67999 241.12 247.23 253.34"
         y="56"
         sodipodi:role="line"
         id="tspan28">les reflets générés, sont tous sous licence libre. Chacun </tspan><tspan
         x="0 5.7399998 10.74 16.85 20.74 23.52 29.26 34.259998 40.369999 44.810001 47.59 50.740002 55.740002 60.369999 63.150002 69.260002 73.150002 76.300003 79.449997 82.599998 87.230003 92.230003 96.669998 99.449997 104.45 108.34 111.12 114.27 119.27 123.9 126.68 132.42 135.57001 138.89999 142.23 148.34 152.97 157.97 162.41 165.19 170.75 173.53 178.16 183.72 186.5 191.87 197.98 201.13 205.75999 210.75999 213.53999 218.17 223.17 229.28 233.91 236.69 241.13 246.13 250.75999 255.75999 260.20001 265.57001 270.57001"
         y="70"
         sodipodi:role="line"
         id="tspan30">peut donc les utiliser et les diffuser à sa guise sous réserve </tspan><tspan
         x="0 5.7399998 7.7800002 12.78 18.889999 21.67 26.110001 29.26 33.150002 38.150002 42.59 45.369999 48.52 54.080002 56.860001 61.490002 66.489998 72.599998 77.040001 81.480003 86.480003 89.260002 94.260002 100.37 103.15 106.3 108.34 113.9 120.01 123.9 128.89999 135.00999 139.45"
         y="84"
         sodipodi:role="line"
         id="tspan32">d'en citer la source ou l'auteur.</tspan></text><g
       id="g36"
       transform="matrix(163.64975,0,0,231.59098,40.247887,343.6846)"><image
         xlink:href="50a.png"
         id="image38"
         transform="matrix(1,0,0,-1,0,1)"
         preserveAspectRatio="none"
         style="image-rendering:optimizeSpeed"
         height="1"
         width="1" /></g><g
       id="g40"
       transform="matrix(153.13302,0,0,231.50052,220.14122,343.72983)"><image
         xlink:href="50b.png"
         id="image42"
         transform="matrix(1,0,0,-1,0,1)"
         preserveAspectRatio="none"
         style="image-rendering:optimizeSpeed"
         height="1"
         width="1" /></g><path
       d="m 378.518,343.685 h -163.62 v 231.591 h 163.62 z"
       style="fill:none;stroke:#231f20;stroke-width:0.25;stroke-linecap:butt;stroke-linejoin:miter;stroke-miterlimit:10;stroke-dasharray:none;stroke-opacity:1"
       id="path44" /><text
       transform="matrix(1,0,0,-1,389.4844,292.9434)"
       style="font-variant:normal;font-weight:normal;font-stretch:normal;font-size:17px;font-family:Cormorant;-inkscape-font-specification:Cormorant;writing-mode:lr-tb;fill:#231f20;fill-opacity:1;fill-rule:nonzero;stroke:none"
       id="text48"><tspan
         x="0 7.973"
         y="0"
         sodipodi:role="line"
         id="tspan46">50</tspan></text></g></svg>
