<?xml version="1.0" encoding="UTF-8" standalone="no"?>
<svg
   xmlns:dc="http://purl.org/dc/elements/1.1/"
   xmlns:cc="http://creativecommons.org/ns#"
   xmlns:rdf="http://www.w3.org/1999/02/22-rdf-syntax-ns#"
   xmlns:svg="http://www.w3.org/2000/svg"
   xmlns="http://www.w3.org/2000/svg"
   xmlns:sodipodi="http://sodipodi.sourceforge.net/DTD/sodipodi-0.dtd"
   xmlns:inkscape="http://www.inkscape.org/namespaces/inkscape"
   width="209.62241mm"
   height="17.803921mm"
   viewBox="0 0 209.62241 17.80392"
   version="1.1"
   id="svg2890"
   inkscape:version="1.0.2 (e86c870879, 2021-01-15)"
   sodipodi:docname="lowtechisation-etapes-exemple.svg">
  <defs
     id="defs2884">
    <marker
       style="overflow:visible"
       id="Arrow2Mend"
       refX="0"
       refY="0"
       orient="auto"
       inkscape:stockid="Arrow2Mend"
       inkscape:isstock="true">
      <path
         transform="scale(-0.6)"
         d="M 8.7185878,4.0337352 -2.2072895,0.01601326 8.7185884,-4.0017078 c -1.7454984,2.3720609 -1.7354408,5.6174519 -6e-7,8.035443 z"
         style="fill:#004a02;fill-opacity:1;fill-rule:evenodd;stroke:#004a02;stroke-width:0.625;stroke-linejoin:round;stroke-opacity:1"
         id="path1160" />
    </marker>
    <marker
       style="overflow:visible"
       id="Arrow2Lend"
       refX="0"
       refY="0"
       orient="auto"
       inkscape:stockid="Arrow2Lend"
       inkscape:isstock="true">
      <path
         transform="matrix(-1.1,0,0,-1.1,-1.1,0)"
         d="M 8.7185878,4.0337352 -2.2072895,0.01601326 8.7185884,-4.0017078 c -1.7454984,2.3720609 -1.7354408,5.6174519 -6e-7,8.035443 z"
         style="fill:#000000;fill-opacity:1;fill-rule:evenodd;stroke:#000000;stroke-width:0.625;stroke-linejoin:round;stroke-opacity:1"
         id="path1154" />
    </marker>
    <marker
       style="overflow:visible"
       id="Arrow1Lend"
       refX="0"
       refY="0"
       orient="auto"
       inkscape:stockid="Arrow1Lend"
       inkscape:isstock="true">
      <path
         transform="matrix(-0.8,0,0,-0.8,-10,0)"
         style="fill:#000000;fill-opacity:1;fill-rule:evenodd;stroke:#000000;stroke-width:1pt;stroke-opacity:1"
         d="M 0,0 5,-5 -12.5,0 5,5 Z"
         id="path1136" />
    </marker>
    <marker
       style="overflow:visible"
       id="Arrow2Mend-3"
       refX="0"
       refY="0"
       orient="auto"
       inkscape:stockid="Arrow2Mend"
       inkscape:isstock="true">
      <path
         transform="scale(-0.6)"
         d="M 8.7185878,4.0337352 -2.2072895,0.01601326 8.7185884,-4.0017078 c -1.7454984,2.3720609 -1.7354408,5.6174519 -6e-7,8.035443 z"
         style="fill:#000000;fill-opacity:1;fill-rule:evenodd;stroke:#000000;stroke-width:0.625;stroke-linejoin:round;stroke-opacity:1"
         id="path1160-6" />
    </marker>
    <marker
       style="overflow:visible"
       id="Arrow2Mend-37"
       refX="0"
       refY="0"
       orient="auto"
       inkscape:stockid="Arrow2Mend"
       inkscape:isstock="true">
      <path
         transform="scale(-0.6)"
         d="M 8.7185878,4.0337352 -2.2072895,0.01601326 8.7185884,-4.0017078 c -1.7454984,2.3720609 -1.7354408,5.6174519 -6e-7,8.035443 z"
         style="fill:#000000;fill-opacity:1;fill-rule:evenodd;stroke:#000000;stroke-width:0.625;stroke-linejoin:round;stroke-opacity:1"
         id="path1160-4" />
    </marker>
    <marker
       style="overflow:visible"
       id="Arrow2Mend-2"
       refX="0"
       refY="0"
       orient="auto"
       inkscape:stockid="Arrow2Mend"
       inkscape:isstock="true">
      <path
         transform="scale(-0.6)"
         d="M 8.7185878,4.0337352 -2.2072895,0.01601326 8.7185884,-4.0017078 c -1.7454984,2.3720609 -1.7354408,5.6174519 -6e-7,8.035443 z"
         style="fill:#000000;fill-opacity:1;fill-rule:evenodd;stroke:#000000;stroke-width:0.625;stroke-linejoin:round;stroke-opacity:1"
         id="path1160-5" />
    </marker>
    <marker
       style="overflow:visible"
       id="Arrow2Mend-7"
       refX="0"
       refY="0"
       orient="auto"
       inkscape:stockid="Arrow2Mend"
       inkscape:isstock="true">
      <path
         transform="scale(-0.6)"
         d="M 8.7185878,4.0337352 -2.2072895,0.01601326 8.7185884,-4.0017078 c -1.7454984,2.3720609 -1.7354408,5.6174519 -6e-7,8.035443 z"
         style="fill:#000000;fill-opacity:1;fill-rule:evenodd;stroke:#000000;stroke-width:0.625;stroke-linejoin:round;stroke-opacity:1"
         id="path1160-44" />
    </marker>
    <marker
       style="overflow:visible"
       id="Arrow2Mend-0"
       refX="0"
       refY="0"
       orient="auto"
       inkscape:stockid="Arrow2Mend"
       inkscape:isstock="true">
      <path
         transform="scale(-0.6)"
         d="M 8.7185878,4.0337352 -2.2072895,0.01601326 8.7185884,-4.0017078 c -1.7454984,2.3720609 -1.7354408,5.6174519 -6e-7,8.035443 z"
         style="fill:#000000;fill-opacity:1;fill-rule:evenodd;stroke:#000000;stroke-width:0.625;stroke-linejoin:round;stroke-opacity:1"
         id="path1160-7" />
    </marker>
    <marker
       style="overflow:visible"
       id="Arrow2Mend-6"
       refX="0"
       refY="0"
       orient="auto"
       inkscape:stockid="Arrow2Mend"
       inkscape:isstock="true">
      <path
         transform="scale(-0.6)"
         d="M 8.7185878,4.0337352 -2.2072895,0.01601326 8.7185884,-4.0017078 c -1.7454984,2.3720609 -1.7354408,5.6174519 -6e-7,8.035443 z"
         style="fill:#004a02;fill-opacity:1;fill-rule:evenodd;stroke:#004a02;stroke-width:0.625;stroke-linejoin:round;stroke-opacity:1"
         id="path1160-8" />
    </marker>
    <marker
       style="overflow:visible"
       id="Arrow2Mend-31"
       refX="0"
       refY="0"
       orient="auto"
       inkscape:stockid="Arrow2Mend"
       inkscape:isstock="true">
      <path
         transform="scale(-0.6)"
         d="M 8.7185878,4.0337352 -2.2072895,0.01601326 8.7185884,-4.0017078 c -1.7454984,2.3720609 -1.7354408,5.6174519 -6e-7,8.035443 z"
         style="fill:#004a02;fill-opacity:1;fill-rule:evenodd;stroke:#004a02;stroke-width:0.625;stroke-linejoin:round;stroke-opacity:1"
         id="path1160-49" />
    </marker>
    <marker
       style="overflow:visible"
       id="Arrow2Mend-06"
       refX="0"
       refY="0"
       orient="auto"
       inkscape:stockid="Arrow2Mend"
       inkscape:isstock="true">
      <path
         transform="scale(-0.6)"
         d="M 8.7185878,4.0337352 -2.2072895,0.01601326 8.7185884,-4.0017078 c -1.7454984,2.3720609 -1.7354408,5.6174519 -6e-7,8.035443 z"
         style="fill:#004a02;fill-opacity:1;fill-rule:evenodd;stroke:#004a02;stroke-width:0.625;stroke-linejoin:round;stroke-opacity:1"
         id="path1160-89" />
    </marker>
    <marker
       style="overflow:visible"
       id="Arrow2Mend-3-6"
       refX="0"
       refY="0"
       orient="auto"
       inkscape:stockid="Arrow2Mend"
       inkscape:isstock="true">
      <path
         transform="scale(-0.6)"
         d="M 8.7185878,4.0337352 -2.2072895,0.01601326 8.7185884,-4.0017078 c -1.7454984,2.3720609 -1.7354408,5.6174519 -6e-7,8.035443 z"
         style="fill:#0000a8;fill-opacity:1;fill-rule:evenodd;stroke:#0000a8;stroke-width:0.625;stroke-linejoin:round;stroke-opacity:1"
         id="path1160-6-4" />
    </marker>
    <marker
       style="overflow:visible"
       id="Arrow2Mend-3-6-9"
       refX="0"
       refY="0"
       orient="auto"
       inkscape:stockid="Arrow2Mend"
       inkscape:isstock="true">
      <path
         transform="scale(-0.6)"
         d="M 8.7185878,4.0337352 -2.2072895,0.01601326 8.7185884,-4.0017078 c -1.7454984,2.3720609 -1.7354408,5.6174519 -6e-7,8.035443 z"
         style="fill:#0000a8;fill-opacity:1;fill-rule:evenodd;stroke:#0000a8;stroke-width:0.625;stroke-linejoin:round;stroke-opacity:1"
         id="path1160-6-4-7" />
    </marker>
    <marker
       style="overflow:visible"
       id="Arrow2Mend-3-6-9-9"
       refX="0"
       refY="0"
       orient="auto"
       inkscape:stockid="Arrow2Mend"
       inkscape:isstock="true">
      <path
         transform="scale(-0.6)"
         d="M 8.7185878,4.0337352 -2.2072895,0.01601326 8.7185884,-4.0017078 c -1.7454984,2.3720609 -1.7354408,5.6174519 -6e-7,8.035443 z"
         style="fill:#0000a8;fill-opacity:1;fill-rule:evenodd;stroke:#0000a8;stroke-width:0.625;stroke-linejoin:round;stroke-opacity:1"
         id="path1160-6-4-7-6" />
    </marker>
    <marker
       style="overflow:visible"
       id="Arrow2Mend-3-9"
       refX="0"
       refY="0"
       orient="auto"
       inkscape:stockid="Arrow2Mend"
       inkscape:isstock="true">
      <path
         transform="scale(-0.6)"
         d="M 8.7185878,4.0337352 -2.2072895,0.01601326 8.7185884,-4.0017078 c -1.7454984,2.3720609 -1.7354408,5.6174519 -6e-7,8.035443 z"
         style="fill:#004a02;fill-opacity:1;fill-rule:evenodd;stroke:#004a02;stroke-width:0.625;stroke-linejoin:round;stroke-opacity:1"
         id="path1160-6-8" />
    </marker>
    <marker
       style="overflow:visible"
       id="Arrow2Mend-06-0"
       refX="0"
       refY="0"
       orient="auto"
       inkscape:stockid="Arrow2Mend"
       inkscape:isstock="true">
      <path
         transform="scale(-0.6)"
         d="M 8.7185878,4.0337352 -2.2072895,0.01601326 8.7185884,-4.0017078 c -1.7454984,2.3720609 -1.7354408,5.6174519 -6e-7,8.035443 z"
         style="fill:#000000;fill-opacity:1;fill-rule:evenodd;stroke:#000000;stroke-width:0.625;stroke-linejoin:round;stroke-opacity:1"
         id="path1160-89-3" />
    </marker>
    <marker
       style="overflow:visible"
       id="Arrow2Mend-06-0-4"
       refX="0"
       refY="0"
       orient="auto"
       inkscape:stockid="Arrow2Mend"
       inkscape:isstock="true">
      <path
         transform="scale(-0.6)"
         d="M 8.7185878,4.0337352 -2.2072895,0.01601326 8.7185884,-4.0017078 c -1.7454984,2.3720609 -1.7354408,5.6174519 -6e-7,8.035443 z"
         style="fill:#004a02;fill-opacity:1;fill-rule:evenodd;stroke:#004a02;stroke-width:0.625;stroke-linejoin:round;stroke-opacity:1"
         id="path1160-89-3-4" />
    </marker>
    <marker
       style="overflow:visible"
       id="Arrow2Mend-06-0-4-4"
       refX="0"
       refY="0"
       orient="auto"
       inkscape:stockid="Arrow2Mend"
       inkscape:isstock="true">
      <path
         transform="scale(-0.6)"
         d="M 8.7185878,4.0337352 -2.2072895,0.01601326 8.7185884,-4.0017078 c -1.7454984,2.3720609 -1.7354408,5.6174519 -6e-7,8.035443 z"
         style="fill:#004a02;fill-opacity:1;fill-rule:evenodd;stroke:#004a02;stroke-width:0.625;stroke-linejoin:round;stroke-opacity:1"
         id="path1160-89-3-4-7" />
    </marker>
    <marker
       style="overflow:visible"
       id="Arrow2Mend-06-0-4-3"
       refX="0"
       refY="0"
       orient="auto"
       inkscape:stockid="Arrow2Mend"
       inkscape:isstock="true">
      <path
         transform="scale(-0.6)"
         d="M 8.7185878,4.0337352 -2.2072895,0.01601326 8.7185884,-4.0017078 c -1.7454984,2.3720609 -1.7354408,5.6174519 -6e-7,8.035443 z"
         style="fill:#0000a8;fill-opacity:1;fill-rule:evenodd;stroke:#0000a8;stroke-width:0.625;stroke-linejoin:round;stroke-opacity:1"
         id="path1160-89-3-4-1" />
    </marker>
    <marker
       style="overflow:visible"
       id="Arrow2Mend-06-0-4-4-5"
       refX="0"
       refY="0"
       orient="auto"
       inkscape:stockid="Arrow2Mend"
       inkscape:isstock="true">
      <path
         transform="scale(-0.6)"
         d="M 8.7185878,4.0337352 -2.2072895,0.01601326 8.7185884,-4.0017078 c -1.7454984,2.3720609 -1.7354408,5.6174519 -6e-7,8.035443 z"
         style="fill:#000000;fill-opacity:1;fill-rule:evenodd;stroke:#000000;stroke-width:0.625;stroke-linejoin:round;stroke-opacity:1"
         id="path1160-89-3-4-7-9" />
    </marker>
    <marker
       style="overflow:visible"
       id="Arrow2Mend-06-0-4-3-2"
       refX="0"
       refY="0"
       orient="auto"
       inkscape:stockid="Arrow2Mend"
       inkscape:isstock="true">
      <path
         transform="scale(-0.6)"
         d="M 8.7185878,4.0337352 -2.2072895,0.01601326 8.7185884,-4.0017078 c -1.7454984,2.3720609 -1.7354408,5.6174519 -6e-7,8.035443 z"
         style="fill:#0000a8;fill-opacity:1;fill-rule:evenodd;stroke:#0000a8;stroke-width:0.625;stroke-linejoin:round;stroke-opacity:1"
         id="path1160-89-3-4-1-1" />
    </marker>
  </defs>
  <sodipodi:namedview
     id="base"
     pagecolor="#ffffff"
     bordercolor="#666666"
     borderopacity="1.0"
     inkscape:pageopacity="0.0"
     inkscape:pageshadow="2"
     inkscape:zoom="1.1718567"
     inkscape:cx="434.9395"
     inkscape:cy="-66.614351"
     inkscape:document-units="mm"
     inkscape:current-layer="layer1"
     inkscape:document-rotation="0"
     showgrid="false"
     showguides="true"
     inkscape:guide-bbox="true"
     inkscape:window-width="1920"
     inkscape:window-height="1033"
     inkscape:window-x="0"
     inkscape:window-y="23"
     inkscape:window-maximized="1">
    <sodipodi:guide
       position="32.43136,297.67707"
       orientation="0,-1"
       id="guide3548" />
    <sodipodi:guide
       position="16.623517,301.82794"
       orientation="0,-1"
       id="guide4617" />
    <sodipodi:guide
       position="61.568018,13.5052"
       orientation="0,-1"
       id="guide5599" />
    <sodipodi:guide
       position="59.5589,9.31226"
       orientation="0,-1"
       id="guide5601" />
  </sodipodi:namedview>
  <metadata
     id="metadata2887">
    <rdf:RDF>
      <cc:Work
         rdf:about="">
        <dc:format>image/svg+xml</dc:format>
        <dc:type
           rdf:resource="http://purl.org/dc/dcmitype/StillImage" />
        <dc:title></dc:title>
      </cc:Work>
    </rdf:RDF>
  </metadata>
  <g
     inkscape:label="Calque 1"
     inkscape:groupmode="layer"
     id="layer1"
     transform="translate(-0.45256548,-14.65686)">
    <g
       id="g3466"
       transform="translate(-4.2747163,1.169387)"
       style="stroke:#004a02;stroke-opacity:1">
      <rect
         style="fill:none;stroke:#004a02;stroke-width:0.325831;stroke-dasharray:0.325831, 0.32583099999999998;stroke-opacity:1"
         id="rect3457"
         width="8.3068323"
         height="8.3068323"
         x="4.8901973"
         y="13.674812" />
      <text
         xml:space="preserve"
         style="font-size:5.64444px;line-height:1.25;font-family:Carlito;-inkscape-font-specification:'Carlito, Normal';letter-spacing:0px;word-spacing:0px;stroke-width:0.264583;stroke:#004a02;stroke-opacity:1"
         x="6.6031098"
         y="19.618299"
         id="text3461"><tspan
           sodipodi:role="line"
           id="tspan3459"
           x="6.6031098"
           y="19.618299"
           style="stroke-width:0.264583;stroke:#004a02;stroke-opacity:1">Et</tspan></text>
    </g>
    <g
       id="g3812"
       transform="translate(1.2642179,30.26259)"
       style="stroke:#004a02;stroke-opacity:1">
      <rect
         style="fill:none;stroke:#004a02;stroke-width:0.325831;stroke-dasharray:0.325831, 0.32583099999999998;stroke-opacity:1"
         id="rect3457-2"
         width="8.3068323"
         height="8.3068323"
         x="16.031988"
         y="-15.418391" />
      <text
         xml:space="preserve"
         style="font-size:5.64444px;line-height:1.25;font-family:Carlito;-inkscape-font-specification:'Carlito, Normal';letter-spacing:0px;word-spacing:0px;stroke-width:0.264583;stroke:#004a02;stroke-opacity:1"
         x="17.959875"
         y="-9.4749022"
         id="text3461-9"><tspan
           sodipodi:role="line"
           id="tspan3459-3"
           x="17.959875"
           y="-9.4749022"
           style="stroke-width:0.264583;stroke:#004a02;stroke-opacity:1">Id</tspan></text>
    </g>
    <g
       id="g3807"
       transform="translate(11.978552,-11.186208)"
       style="stroke:#004a02;stroke-opacity:1">
      <rect
         style="fill:none;stroke:#004a02;stroke-width:0.325831;stroke-dasharray:0.325831, 0.32583099999999998;stroke-opacity:1"
         id="rect3457-4"
         width="8.3068323"
         height="8.3068323"
         x="21.837387"
         y="26.030405" />
      <text
         xml:space="preserve"
         style="font-size:5.64444px;line-height:1.25;font-family:Carlito;-inkscape-font-specification:'Carlito, Normal';letter-spacing:0px;word-spacing:0px;stroke-width:0.264583;stroke:#004a02;stroke-opacity:1"
         x="22.059263"
         y="31.973892"
         id="text3461-7"><tspan
           sodipodi:role="line"
           id="tspan3459-8"
           x="22.059263"
           y="31.973892"
           style="stroke-width:0.264583;stroke:#004a02;stroke-opacity:1">Mq</tspan></text>
    </g>
    <g
       id="g3802"
       transform="translate(21.803232)"
       style="stroke:#004a02;stroke-opacity:1">
      <rect
         style="fill:none;stroke:#004a02;stroke-width:0.325831;stroke-dasharray:0.325831, 0.32583099999999998;stroke-opacity:1"
         id="rect3457-2-4"
         width="8.3068323"
         height="8.3068323"
         x="28.78793"
         y="14.844197" />
      <text
         xml:space="preserve"
         style="font-size:5.64444px;line-height:1.25;font-family:Carlito;-inkscape-font-specification:'Carlito, Normal';letter-spacing:0px;word-spacing:0px;stroke-width:0.264583;stroke:#004a02;stroke-opacity:1"
         x="29.986834"
         y="20.787687"
         id="text3461-9-5"><tspan
           sodipodi:role="line"
           id="tspan3459-3-0"
           x="29.986834"
           y="20.787687"
           style="stroke-width:0.264583;stroke:#004a02;stroke-opacity:1">An</tspan></text>
    </g>
    <path
       style="fill:none;stroke:#004a02;stroke-width:0.265;stroke-linecap:butt;stroke-linejoin:miter;stroke-miterlimit:4;stroke-dasharray:0.265, 0.26500000000000001;stroke-dashoffset:0;stroke-opacity:1;marker-end:url(#Arrow2Mend)"
       d="m 26.253028,19.000161 h 6.868156"
       id="path3550" />
    <g
       id="g3889"
       transform="translate(64.212063,-43.09665)"
       style="stroke:#004a02;stroke-opacity:1">
      <rect
         style="fill:none;stroke:#004a02;stroke-width:0.325831;stroke-dasharray:0.325831, 0.32583099999999998;stroke-opacity:1"
         id="rect3457-6"
         width="8.3068323"
         height="8.3068323"
         x="20.601397"
         y="57.938335" />
      <text
         xml:space="preserve"
         style="font-size:5.64444px;line-height:1.25;font-family:Carlito;-inkscape-font-specification:'Carlito, Normal';letter-spacing:0px;word-spacing:0px;stroke-width:0.264583;stroke:#004a02;stroke-opacity:1"
         x="21.804436"
         y="63.881821"
         id="text3461-3"><tspan
           sodipodi:role="line"
           id="tspan3459-2"
           x="21.804436"
           y="63.881821"
           style="stroke-width:0.264583;stroke:#004a02;stroke-opacity:1">Pu</tspan></text>
    </g>
    <g
       id="g3466-19-5"
       transform="translate(105.40134,1.1693865)"
       style="stroke:#0000a8;stroke-opacity:1">
      <rect
         style="fill:none;stroke:#0000a8;stroke-width:0.325831;stroke-dasharray:0.325831, 0.32583099999999998;stroke-opacity:1"
         id="rect3457-4-5"
         width="8.3068323"
         height="8.3068323"
         x="4.8901973"
         y="13.674812" />
      <text
         xml:space="preserve"
         style="font-size:5.64444px;line-height:1.25;font-family:Carlito;-inkscape-font-specification:'Carlito, Normal';letter-spacing:0px;word-spacing:0px;stroke-width:0.264583;stroke:#0000a8;stroke-opacity:1"
         x="6.6031098"
         y="19.618299"
         id="text3461-7-4"><tspan
           sodipodi:role="line"
           id="tspan3459-8-7"
           x="6.6031098"
           y="19.618299"
           style="stroke-width:0.264583;stroke:#0000a8;stroke-opacity:1">Et</tspan></text>
    </g>
    <path
       style="fill:none;stroke:#000000;stroke-width:0.265;stroke-linecap:butt;stroke-linejoin:miter;stroke-miterlimit:4;stroke-dasharray:0.265, 0.265;stroke-dashoffset:0;stroke-opacity:1;marker-end:url(#Arrow2Mend-3)"
       d="m 93.861923,18.955581 h 6.868157"
       id="path3550-9" />
    <path
       style="fill:none;stroke:#004a02;stroke-width:0.265;stroke-linecap:butt;stroke-linejoin:miter;stroke-miterlimit:4;stroke-dasharray:0.265, 0.26500000000000001;stroke-dashoffset:0;stroke-opacity:1;marker-end:url(#Arrow2Mend-6)"
       d="m 59.706503,19.000161 h 6.868156"
       id="path3550-84" />
    <path
       style="fill:none;stroke:#004a02;stroke-width:0.265;stroke-linecap:butt;stroke-linejoin:miter;stroke-miterlimit:4;stroke-dasharray:0.265, 0.26500000000000001;stroke-dashoffset:0;stroke-opacity:1;marker-end:url(#Arrow2Mend-31)"
       d="M 42.541564,19.000161 H 49.40972"
       id="path3550-2" />
    <path
       style="fill:none;stroke:#004a02;stroke-width:0.265;stroke-linecap:butt;stroke-linejoin:miter;stroke-miterlimit:4;stroke-dasharray:0.265, 0.26500000000000001;stroke-dashoffset:0;stroke-opacity:1;marker-end:url(#Arrow2Mend-06)"
       d="M 9.5270803,19.000161 H 16.39524"
       id="path3550-26" />
    <path
       style="fill:none;stroke:#0000a8;stroke-width:0.265;stroke-linecap:butt;stroke-linejoin:miter;stroke-miterlimit:4;stroke-dasharray:0.265, 0.26500000000000001;stroke-dashoffset:0;stroke-opacity:1;marker-end:url(#Arrow2Mend-3-6)"
       d="m 127.77915,19.000161 h 6.86815"
       id="path3550-9-9" />
    <g
       id="g3812-5"
       transform="translate(85.952691,30.26259)"
       style="stroke:#0000a8;stroke-opacity:1">
      <rect
         style="fill:none;stroke:#0000a8;stroke-width:0.325831;stroke-dasharray:0.325831, 0.32583099999999998;stroke-opacity:1"
         id="rect3457-2-0"
         width="8.3068323"
         height="8.3068323"
         x="16.031988"
         y="-15.418391" />
      <text
         xml:space="preserve"
         style="font-size:5.64444px;line-height:1.25;font-family:Carlito;-inkscape-font-specification:'Carlito, Normal';letter-spacing:0px;word-spacing:0px;stroke-width:0.264583;stroke:#0000a8;stroke-opacity:1"
         x="17.959875"
         y="-9.4749022"
         id="text3461-9-4"><tspan
           sodipodi:role="line"
           id="tspan3459-3-8"
           x="17.959875"
           y="-9.4749022"
           style="stroke-width:0.264583;stroke:#0000a8;stroke-opacity:1">Id</tspan></text>
    </g>
    <g
       id="g3889-1"
       transform="translate(97.996948,-43.094137)"
       style="stroke:#0000a8;stroke-opacity:1">
      <rect
         style="fill:none;stroke:#0000a8;stroke-width:0.325831;stroke-dasharray:0.325831, 0.32583099999999998;stroke-opacity:1"
         id="rect3457-6-0"
         width="8.3068323"
         height="8.3068323"
         x="20.601397"
         y="57.938335" />
      <text
         xml:space="preserve"
         style="font-size:5.64444px;line-height:1.25;font-family:Carlito;-inkscape-font-specification:'Carlito, Normal';letter-spacing:0px;word-spacing:0px;stroke-width:0.264583;stroke:#0000a8;stroke-opacity:1"
         x="21.804436"
         y="63.881821"
         id="text3461-3-6"><tspan
           sodipodi:role="line"
           id="tspan3459-2-1"
           x="21.804436"
           y="63.881821"
           style="stroke-width:0.264583;stroke:#0000a8;stroke-opacity:1">Pu</tspan></text>
    </g>
    <g
       id="g3466-19-5-5"
       transform="translate(138.90393,1.169387)"
       style="stroke:#0000a8;stroke-opacity:1">
      <rect
         style="fill:none;stroke:#0000a8;stroke-width:0.325831;stroke-dasharray:0.325831, 0.32583099999999998;stroke-opacity:1"
         id="rect3457-4-5-9"
         width="8.3068323"
         height="8.3068323"
         x="4.8901973"
         y="13.674812" />
      <text
         xml:space="preserve"
         style="font-size:5.64444px;line-height:1.25;font-family:Carlito;-inkscape-font-specification:'Carlito, Normal';letter-spacing:0px;word-spacing:0px;stroke-width:0.264583;stroke:#0000a8;stroke-opacity:1"
         x="6.6031098"
         y="19.618299"
         id="text3461-7-4-4"><tspan
           sodipodi:role="line"
           id="tspan3459-8-7-9"
           x="6.6031098"
           y="19.618299"
           style="stroke-width:0.264583;stroke:#0000a8;stroke-opacity:1">Ev</tspan></text>
    </g>
    <g
       id="g3812-5-0"
       transform="translate(119.45531,30.26259)"
       style="stroke:#0000a8;stroke-opacity:1">
      <rect
         style="fill:none;stroke:#0000a8;stroke-width:0.325831;stroke-dasharray:0.325831, 0.32583099999999998;stroke-opacity:1"
         id="rect3457-2-0-9"
         width="8.3068323"
         height="8.3068323"
         x="16.031988"
         y="-15.418391" />
      <text
         xml:space="preserve"
         style="font-size:5.64444px;line-height:1.25;font-family:Carlito;-inkscape-font-specification:'Carlito, Normal';letter-spacing:0px;word-spacing:0px;stroke-width:0.264583;stroke:#0000a8;stroke-opacity:1"
         x="17.959875"
         y="-9.4749022"
         id="text3461-9-4-1"><tspan
           sodipodi:role="line"
           id="tspan3459-3-8-7"
           x="17.959875"
           y="-9.4749022"
           style="stroke-width:0.264583;stroke:#0000a8;stroke-opacity:1">Id</tspan></text>
    </g>
    <g
       id="g3889-1-7"
       transform="translate(131.49957,-43.094137)"
       style="stroke:#0000a8;stroke-opacity:1">
      <rect
         style="fill:none;stroke:#0000a8;stroke-width:0.325831;stroke-dasharray:0.325831, 0.32583099999999998;stroke-opacity:1"
         id="rect3457-6-0-1"
         width="8.3068323"
         height="8.3068323"
         x="20.601397"
         y="57.938335" />
      <text
         xml:space="preserve"
         style="font-size:5.64444px;line-height:1.25;font-family:Carlito;-inkscape-font-specification:'Carlito, Normal';letter-spacing:0px;word-spacing:0px;stroke-width:0.264583;stroke:#0000a8;stroke-opacity:1"
         x="21.804436"
         y="63.881821"
         id="text3461-3-6-1"><tspan
           sodipodi:role="line"
           id="tspan3459-2-1-5"
           x="21.804436"
           y="63.881821"
           style="stroke-width:0.264583;stroke:#0000a8;stroke-opacity:1">Pu</tspan></text>
    </g>
    <path
       style="fill:none;stroke:#0000a8;stroke-width:0.265;stroke-linecap:butt;stroke-linejoin:miter;stroke-miterlimit:4;stroke-dasharray:0.265, 0.26500000000000001;stroke-dashoffset:0;stroke-opacity:1;marker-end:url(#Arrow2Mend-3-6-9)"
       d="m 161.03418,19.000158 h 6.86815"
       id="path3550-9-9-7" />
    <g
       id="g3812-5-0-5"
       transform="translate(152.71034,30.262587)"
       style="stroke:#0000a8;stroke-opacity:1">
      <rect
         style="fill:none;stroke:#0000a8;stroke-width:0.325831;stroke-dasharray:0.325831, 0.32583099999999998;stroke-opacity:1"
         id="rect3457-2-0-9-6"
         width="8.3068323"
         height="8.3068323"
         x="16.031988"
         y="-15.418391" />
      <text
         xml:space="preserve"
         style="font-size:5.64444px;line-height:1.25;font-family:Carlito;-inkscape-font-specification:'Carlito, Normal';letter-spacing:0px;word-spacing:0px;stroke-width:0.264583;stroke:#0000a8;stroke-opacity:1"
         x="17.959875"
         y="-9.4749022"
         id="text3461-9-4-1-3"><tspan
           sodipodi:role="line"
           id="tspan3459-3-8-7-9"
           x="17.959875"
           y="-9.4749022"
           style="stroke-width:0.264583;stroke:#0000a8;stroke-opacity:1">Id</tspan></text>
    </g>
    <g
       id="g3889-1-7-4"
       transform="translate(173.06142,-43.094141)"
       style="stroke:#0000a8;stroke-opacity:1">
      <rect
         style="fill:none;stroke:#0000a8;stroke-width:0.325831;stroke-dasharray:0.325831, 0.32583099999999998;stroke-opacity:1"
         id="rect3457-6-0-1-8"
         width="8.3068323"
         height="8.3068323"
         x="20.601397"
         y="57.938335" />
      <text
         xml:space="preserve"
         style="font-size:5.64444px;line-height:1.25;font-family:Carlito;-inkscape-font-specification:'Carlito, Normal';letter-spacing:0px;word-spacing:0px;stroke-width:0.264583;stroke:#0000a8;stroke-opacity:1"
         x="21.804436"
         y="63.881821"
         id="text3461-3-6-1-1"><tspan
           sodipodi:role="line"
           id="tspan3459-2-1-5-2"
           x="21.804436"
           y="63.881821"
           style="stroke-width:0.264583;stroke:#0000a8;stroke-opacity:1">Pu</tspan></text>
    </g>
    <g
       id="g3807-9"
       transform="translate(155.21177,-11.18621)"
       style="stroke:#0000a8;stroke-opacity:1">
      <rect
         style="fill:none;stroke:#0000a8;stroke-width:0.325831;stroke-dasharray:0.325831, 0.32583099999999998;stroke-opacity:1"
         id="rect3457-4-3"
         width="8.3068323"
         height="8.3068323"
         x="21.837387"
         y="26.030405" />
      <text
         xml:space="preserve"
         style="font-size:5.64444px;line-height:1.25;font-family:Carlito;-inkscape-font-specification:'Carlito, Normal';letter-spacing:0px;word-spacing:0px;stroke-width:0.264583;stroke:#0000a8;stroke-opacity:1"
         x="22.059263"
         y="31.973892"
         id="text3461-7-9"><tspan
           sodipodi:role="line"
           id="tspan3459-8-0"
           x="22.059263"
           y="31.973892"
           style="stroke-width:0.264583;stroke:#0000a8;stroke-opacity:1">Mq</tspan></text>
    </g>
    <g
       id="g3802-8"
       transform="translate(156.56806)"
       style="stroke:#0000a8;stroke-opacity:1">
      <rect
         style="fill:none;stroke:#0000a8;stroke-width:0.325831;stroke-dasharray:0.325831, 0.32583099999999998;stroke-opacity:1"
         id="rect3457-2-4-8"
         width="8.3068323"
         height="8.3068323"
         x="28.78793"
         y="14.844197" />
      <text
         xml:space="preserve"
         style="font-size:5.64444px;line-height:1.25;font-family:Carlito;-inkscape-font-specification:'Carlito, Normal';letter-spacing:0px;word-spacing:0px;stroke-width:0.264583;stroke:#0000a8;stroke-opacity:1"
         x="29.986834"
         y="20.787687"
         id="text3461-9-5-5"><tspan
           sodipodi:role="line"
           id="tspan3459-3-0-0"
           x="29.986834"
           y="20.787687"
           style="stroke-width:0.264583;stroke:#0000a8;stroke-opacity:1">An</tspan></text>
    </g>
    <path
       style="fill:none;stroke:#0000a8;stroke-width:0.265;stroke-linecap:butt;stroke-linejoin:miter;stroke-miterlimit:4;stroke-dasharray:0.265, 0.26500000000000001;stroke-dashoffset:0;stroke-opacity:1;marker-end:url(#Arrow2Mend-3-6-9-9)"
       d="m 202.80619,19.000161 h 6.86815"
       id="path3550-9-9-7-3" />
    <g
       id="g3466-19-5-5-6"
       transform="translate(63.091679,1.1449634)"
       style="stroke:#004a02;stroke-opacity:1">
      <rect
         style="fill:none;stroke:#004a02;stroke-width:0.325831;stroke-dasharray:0.325831, 0.32583099999999998;stroke-opacity:1"
         id="rect3457-4-5-9-1"
         width="8.3068323"
         height="8.3068323"
         x="4.8901973"
         y="13.674812" />
      <text
         xml:space="preserve"
         style="font-size:5.64444px;line-height:1.25;font-family:Carlito;-inkscape-font-specification:'Carlito, Normal';letter-spacing:0px;word-spacing:0px;stroke-width:0.264583;stroke:#004a02;stroke-opacity:1"
         x="6.6031098"
         y="19.618299"
         id="text3461-7-4-4-1"><tspan
           sodipodi:role="line"
           id="tspan3459-8-7-9-5"
           x="6.6031098"
           y="19.618299"
           style="stroke-width:0.264583;stroke:#004a02;stroke-opacity:1">Ev</tspan></text>
    </g>
    <path
       style="fill:none;stroke:#004a02;stroke-width:0.265;stroke-linecap:butt;stroke-linejoin:miter;stroke-miterlimit:4;stroke-dasharray:0.265, 0.26500000000000001;stroke-dashoffset:0;stroke-opacity:1;marker-end:url(#Arrow2Mend-3-9)"
       d="m 76.880853,18.955581 h 6.868156"
       id="path3550-9-4" />
    <text
       xml:space="preserve"
       style="font-size:5.64444px;line-height:1.25;font-family:Carlito;-inkscape-font-specification:'Carlito, Normal';letter-spacing:0px;word-spacing:0px;stroke-width:0.264583;stroke:#004a02;stroke-opacity:1;"
       x="19.563906"
       y="30.970787"
       id="text5841"><tspan
         sodipodi:role="line"
         id="tspan5839"
         x="19.563906"
         y="30.970787"
         style="stroke-width:0.264583;stroke:#004a02;stroke-opacity:1;">Phase 1 · mise en place</tspan></text>
    <text
       xml:space="preserve"
       style="font-size:5.64444px;line-height:1.25;font-family:Carlito;-inkscape-font-specification:'Carlito, Normal';letter-spacing:0px;word-spacing:0px;stroke-width:0.264583;stroke:#0000a8;stroke-opacity:1;"
       x="133.10707"
       y="31.404869"
       id="text5841-8"><tspan
         sodipodi:role="line"
         id="tspan5839-1"
         x="133.10707"
         y="31.404869"
         style="stroke-width:0.264583;stroke:#0000a8;stroke-opacity:1;">Phase 2 · itérations</tspan></text>
    <path
       style="fill:none;stroke:#004a02;stroke-width:0.265;stroke-linecap:butt;stroke-linejoin:miter;stroke-miterlimit:4;stroke-dasharray:0.265, 0.26500000000000001;stroke-dashoffset:0;stroke-opacity:1;marker-end:url(#Arrow2Mend-06-0-4)"
       d="M 19.144269,29.463424 H 2.871548"
       id="path3550-26-0-4"
       sodipodi:nodetypes="cc" />
    <path
       style="fill:none;stroke:#004a02;stroke-width:0.265;stroke-linecap:butt;stroke-linejoin:miter;stroke-miterlimit:4;stroke-dasharray:0.265, 0.26500000000000001;stroke-dashoffset:0;stroke-opacity:1;marker-end:url(#Arrow2Mend-06-0-4-4)"
       d="M 73.420952,29.468517 H 89.693673"
       id="path3550-26-0-4-6"
       sodipodi:nodetypes="cc" />
    <path
       style="fill:none;stroke:#0000a8;stroke-width:0.265;stroke-linecap:butt;stroke-linejoin:miter;stroke-miterlimit:4;stroke-dasharray:0.265, 0.26500000000000001;stroke-dashoffset:0;stroke-opacity:1;marker-end:url(#Arrow2Mend-06-0-4-3)"
       d="M 129.91856,29.463424 H 105.25714"
       id="path3550-26-0-4-7"
       sodipodi:nodetypes="cc" />
    <path
       style="fill:none;stroke:#0000a8;stroke-width:0.265;stroke-linecap:butt;stroke-linejoin:miter;stroke-miterlimit:4;stroke-dasharray:0.265, 0.26500000000000001;stroke-dashoffset:0;stroke-opacity:1;marker-end:url(#Arrow2Mend-06-0-4-3-2)"
       d="m 179.9756,29.468517 h 24.66142"
       id="path3550-26-0-4-7-7"
       sodipodi:nodetypes="cc" />
  </g>
</svg>
