<?xml version="1.0" encoding="UTF-8" standalone="no"?>
<svg
   xmlns:dc="http://purl.org/dc/elements/1.1/"
   xmlns:cc="http://creativecommons.org/ns#"
   xmlns:rdf="http://www.w3.org/1999/02/22-rdf-syntax-ns#"
   xmlns:svg="http://www.w3.org/2000/svg"
   xmlns="http://www.w3.org/2000/svg"
   xmlns:sodipodi="http://sodipodi.sourceforge.net/DTD/sodipodi-0.dtd"
   xmlns:inkscape="http://www.inkscape.org/namespaces/inkscape"
   height="2138.0896pt"
   id="svg4864"
   inkscape:version="0.92.3 (2405546, 2018-03-11)"
   preserveAspectRatio="xMidYMid meet"
   sodipodi:docname="lowtechnicisation-spheres.svg"
   version="1.0"
   viewBox="0 0 2237.2922 2138.0896"
   width="2237.2922pt"
   inkscape:export-filename="/home/stc/cloudutc/enseignement/lownum/schemas/lowtechnicisation-spheres.svg.png"
   inkscape:export-xdpi="49.560001"
   inkscape:export-ydpi="49.560001">
  <defs
     id="defs4868">
    <marker
       id="Arrow1Mend"
       inkscape:isstock="true"
       inkscape:stockid="Arrow1Mend"
       orient="auto"
       refX="0.0"
       refY="0.0"
       style="overflow:visible;">
      <path
         d="M 0.0,0.0 L 5.0,-5.0 L -12.5,0.0 L 5.0,5.0 L 0.0,0.0 z "
         id="path25274"
         style="fill-rule:evenodd;stroke:#000000;stroke-width:1pt;stroke-opacity:1;fill:#000000;fill-opacity:1"
         transform="scale(0.4) rotate(180) translate(10,0)" />
    </marker>
    <marker
       id="Arrow1Lend"
       inkscape:isstock="true"
       inkscape:stockid="Arrow1Lend"
       orient="auto"
       refX="0.0"
       refY="0.0"
       style="overflow:visible;">
      <path
         d="M 0.0,0.0 L 5.0,-5.0 L -12.5,0.0 L 5.0,5.0 L 0.0,0.0 z "
         id="path25268"
         style="fill-rule:evenodd;stroke:#000000;stroke-width:1pt;stroke-opacity:1;fill:#000000;fill-opacity:1"
         transform="scale(0.8) rotate(180) translate(12.5,0)" />
    </marker>
    <marker
       id="Arrow1Lend-1"
       inkscape:isstock="true"
       inkscape:stockid="Arrow1Lend"
       orient="auto"
       refX="0"
       refY="0"
       style="overflow:visible">
      <path
         d="M 0,0 5,-5 -12.5,0 5,5 Z"
         id="path25268-4"
         style="fill:#000000;fill-opacity:1;fill-rule:evenodd;stroke:#000000;stroke-width:1pt;stroke-opacity:1"
         transform="matrix(-0.8,0,0,-0.8,-10,0)" />
    </marker>
    <marker
       id="Arrow1Mend-8"
       inkscape:isstock="true"
       inkscape:stockid="Arrow1Mend"
       orient="auto"
       refX="0"
       refY="0"
       style="overflow:visible">
      <path
         d="M 0,0 5,-5 -12.5,0 5,5 Z"
         id="path25274-7"
         style="fill:#000000;fill-opacity:1;fill-rule:evenodd;stroke:#000000;stroke-width:1pt;stroke-opacity:1"
         transform="matrix(-0.4,0,0,-0.4,-4,0)" />
    </marker>
  </defs>
  <sodipodi:namedview
     bordercolor="#666666"
     borderopacity="1"
     gridtolerance="10"
     guidetolerance="10"
     id="namedview4866"
     inkscape:current-layer="svg4864"
     inkscape:cx="1107.982"
     inkscape:cy="687.44648"
     inkscape:document-rotation="0"
     inkscape:pageopacity="0"
     inkscape:pageshadow="2"
     inkscape:window-height="719"
     inkscape:window-maximized="1"
     inkscape:window-width="1366"
     inkscape:window-x="0"
     inkscape:window-y="25"
     inkscape:zoom="0.12695465"
     objecttolerance="10"
     pagecolor="#ffffff"
     showgrid="false"
     showguides="true"
     inkscape:guide-bbox="true">
    <sodipodi:guide
       position="1683.672,764.56764"
       orientation="0,-1"
       id="guide896"
       inkscape:locked="false" />
    <sodipodi:guide
       position="1243.5542,584.38519"
       orientation="0,-1"
       id="guide898"
       inkscape:locked="false" />
    <sodipodi:guide
       position="1432.5981,439.64846"
       orientation="0,-1"
       id="guide900"
       inkscape:locked="false" />
    <sodipodi:guide
       position="1213.5112,1132.4"
       orientation="0,-1"
       id="guide902"
       inkscape:locked="false" />
  </sodipodi:namedview>
  <metadata
     id="metadata2"> Created by potrace 1.15, written by Peter Selinger 2001-2017 <rdf:RDF>
  <cc:Work
     rdf:about="">
    <dc:format>image/svg+xml</dc:format>
    <dc:type
       rdf:resource="http://purl.org/dc/dcmitype/StillImage" />
    <dc:title />
  </cc:Work>
</rdf:RDF>
</metadata>
  <text
     id="text25189"
     style="font-style:normal;font-weight:normal;font-size:30px;line-height:1.25;font-family:sans-serif;letter-spacing:0px;word-spacing:0px;fill:#000000;fill-opacity:1;stroke:none;stroke-width:0.75"
     x="1759.8175"
     xml:space="preserve"
     y="573.69977"><tspan
       id="tspan25187"
       sodipodi:role="line"
       x="1759.8175"
       y="573.69977"
       style="stroke-width:0.75" /></text>
  <text
     id="text25197"
     style="font-style:normal;font-variant:normal;font-weight:normal;font-stretch:normal;font-size:175px;line-height:1.25;font-family:Carlito;-inkscape-font-specification:'Carlito, Normal';font-variant-ligatures:normal;font-variant-caps:normal;font-variant-numeric:normal;font-variant-east-asian:normal;letter-spacing:0px;word-spacing:0px;stroke-width:0.75"
     x="615.01367"
     xml:space="preserve"
     y="440.96255"><tspan
       id="tspan25195"
       sodipodi:role="line"
       style="font-style:normal;font-variant:normal;font-weight:normal;font-stretch:normal;font-size:175px;font-family:Carlito;-inkscape-font-specification:'Carlito, Normal';font-variant-ligatures:normal;font-variant-caps:normal;font-variant-numeric:normal;font-variant-east-asian:normal;stroke-width:0.75"
       x="615.01367"
       y="440.96255">Professionnel</tspan></text>
  <text
     id="text25201"
     style="font-size:174.99999621px;line-height:1.25;font-family:Carlito;-inkscape-font-specification:'Carlito, Normal';letter-spacing:0px;word-spacing:0px;stroke-width:0.75;font-weight:normal;font-style:normal;font-stretch:normal;font-variant:normal;font-variant-ligatures:normal;font-variant-caps:normal;font-variant-numeric:normal;font-variant-east-asian:normal;"
     x="91.92659"
     xml:space="preserve"
     y="1475.2808"><tspan
       id="tspan25199"
       sodipodi:role="line"
       style="stroke-width:0.75;-inkscape-font-specification:'Carlito, Normal';font-family:Carlito;font-weight:normal;font-style:normal;font-stretch:normal;font-variant:normal;font-size:174.99999621px;font-variant-ligatures:normal;font-variant-caps:normal;font-variant-numeric:normal;font-variant-east-asian:normal;"
       x="91.92659"
       y="1475.2808">Personnel</tspan></text>
  <text
     id="text25209"
     style="font-size:200px;line-height:1.25;font-family:Carlito;-inkscape-font-specification:'Carlito, Normal';letter-spacing:0px;word-spacing:0px;stroke-width:0.75;fill:#800000;"
     x="714.17603"
     xml:space="preserve"
     y="682.25421"><tspan
       id="tspan25207"
       sodipodi:role="line"
       style="font-style:normal;font-variant:normal;font-weight:normal;font-stretch:normal;font-size:100px;font-family:Carlito;-inkscape-font-specification:'Carlito, Normal';font-variant-ligatures:normal;font-variant-caps:normal;font-variant-numeric:normal;stroke-width:0.75;fill:#800000;"
       x="714.17603"
       y="682.25421">Low-technicisation</tspan></text>
  <text
     id="text25205"
     inkscape:export-xdpi="74.998596"
     inkscape:export-ydpi="74.998596"
     style="font-style:normal;font-variant:normal;font-weight:normal;font-stretch:normal;font-size:175px;line-height:1.25;font-family:Carlito;-inkscape-font-specification:'Carlito, Normal';font-variant-ligatures:normal;font-variant-caps:normal;font-variant-numeric:normal;font-variant-east-asian:normal;letter-spacing:0px;word-spacing:0px;stroke-width:0.75"
     x="1435.7174"
     xml:space="preserve"
     y="1464.0548"><tspan
       id="tspan25203"
       sodipodi:role="line"
       style="font-style:normal;font-variant:normal;font-weight:normal;font-stretch:normal;font-size:175px;font-family:Carlito;-inkscape-font-specification:'Carlito, Normal';font-variant-ligatures:normal;font-variant-caps:normal;font-variant-numeric:normal;font-variant-east-asian:normal;stroke-width:0.75"
       x="1435.7174"
       y="1464.0548">Collectif</tspan><tspan
       id="tspan922"
       sodipodi:role="line"
       x="1435.7174"
       y="1682.8048"
       style="font-style:normal;font-variant:normal;font-weight:normal;font-stretch:normal;font-size:175px;font-family:Carlito;-inkscape-font-specification:'Carlito, Normal';font-variant-ligatures:normal;font-variant-caps:normal;font-variant-numeric:normal;font-variant-east-asian:normal;stroke-width:0.75" /></text>
  <text
     id="text25213"
     style="font-size:150px;line-height:1.25;font-family:Carlito;-inkscape-font-specification:'Carlito, Normal';letter-spacing:0px;word-spacing:0px;stroke-width:0.75;fill:#800000;"
     x="522.71344"
     xml:space="preserve"
     y="1746.877"><tspan
       id="tspan25211"
       sodipodi:role="line"
       style="font-style:normal;font-variant:normal;font-weight:normal;font-stretch:normal;font-size:100px;font-family:Carlito;-inkscape-font-specification:'Carlito, Normal';font-variant-ligatures:normal;font-variant-caps:normal;font-variant-numeric:normal;stroke-width:0.75;fill:#800000;"
       x="522.71344"
       y="1746.877">Ataraxie</tspan></text>
  <text
     id="text25221"
     style="font-size:99.9997px;line-height:1.25;font-family:Carlito;-inkscape-font-specification:'Carlito, Normal';letter-spacing:0px;word-spacing:0px;stroke-width:0.75"
     x="722.17883"
     xml:space="preserve"
     y="573.84454"><tspan
       id="tspan25219"
       sodipodi:role="line"
       style="font-style:normal;font-variant:normal;font-weight:normal;font-stretch:normal;font-size:150px;font-family:Carlito;-inkscape-font-specification:'Carlito, Normal';font-variant-ligatures:normal;font-variant-caps:normal;font-variant-numeric:normal;stroke-width:0.75"
       x="722.17883"
       y="573.84454">Technologie</tspan></text>
  <text
     id="text25225"
     style="font-size:150px;line-height:1.25;font-family:Carlito;-inkscape-font-specification:'Carlito, Normal';letter-spacing:0px;word-spacing:0px;stroke-width:0.75"
     x="131.3311"
     xml:space="preserve"
     y="1632.7103"><tspan
       id="tspan25223"
       sodipodi:role="line"
       style="stroke-width:0.75"
       x="131.3311"
       y="1632.7103">Mode de vie</tspan></text>
  <text
     id="text25225-4"
     style="font-size:150px;line-height:1.25;font-family:Carlito;-inkscape-font-specification:'Carlito, Normal';letter-spacing:0px;word-spacing:0px;stroke-width:0.75"
     x="1465.7184"
     xml:space="preserve"
     y="1631.4933"><tspan
       id="tspan25223-0"
       sodipodi:role="line"
       style="stroke-width:0.75"
       x="1465.7184"
       y="1631.4933">Politique</tspan></text>
  <text
     id="text25217"
     style="font-size:99.9997px;line-height:1.25;font-family:Carlito;-inkscape-font-specification:'Carlito, Normal';letter-spacing:0px;word-spacing:0px;stroke-width:0.75;fill:#800000;"
     x="1458.2842"
     xml:space="preserve"
     y="1747.1868"><tspan
       id="tspan25255"
       sodipodi:role="line"
       style="stroke-width:0.75;fill:#800000;"
       x="1458.2842"
       y="1747.1868">Fermeture</tspan></text>
  <circle
     cx="1232.4318"
     cy="865.90137"
     id="path25261"
     r="1.1065712"
     style="fill:#cfcfcf;stroke:#e44d26;stroke-width:0.75" />
  <path
     d="m 1097.7188,2.4238281 c -341.62997,0 -619.60552,277.9758319 -619.60552,619.6054719 0,341.62992 277.97555,619.6074 619.60552,619.6074 341.6296,0 619.6074,-277.97748 619.6074,-619.6074 0,-341.62964 -277.9778,-619.6054719 -619.6074,-619.6054719 z m 0,7.21875 c 337.7147,0 612.3886,274.6720719 612.3886,612.3867219 0,337.71493 -274.6739,612.3887 -612.3886,612.3887 -337.71499,0 -612.38677,-274.67376 -612.38677,-612.3887 0,-337.71465 274.67178,-612.3867219 612.38677,-612.3867219 z m 0,44.1132809 c -25.7174,0 -51.5551,15.256962 -75.7618,42.65625 -24.20659,27.399291 -46.97803,67.121201 -66.68356,117.185551 -39.41107,100.12868 -66.4961,241.6693 -66.4961,408.43164 0,69.05698 4.83667,133.49198 13.125,192.74218 l 0.37891,2.69727 2.69727,0.37891 c 59.24767,8.28833 123.68328,13.12304 192.74028,13.12304 166.7623,0 308.3049,-27.08306 408.4335,-66.49414 50.0644,-19.70554 89.7863,-42.47697 117.1856,-66.68359 27.3993,-24.20662 42.6562,-50.04637 42.6562,-75.76367 0,-313.29416 -254.9812,-568.273441 -568.2753,-568.273441 z m 0,7.21875 c 309.3782,0 561.0566,251.676371 561.0566,561.054691 0,22.84434 -13.7323,46.95508 -40.2168,70.35351 -26.4845,23.39844 -65.5416,45.88991 -115.0508,65.37696 -99.0184,38.97408 -239.8092,65.99218 -405.789,65.99218 -67.6773,0 -130.82108,-4.70632 -189.00005,-12.7207 -8.01439,-58.18141 -12.72266,-121.32461 -12.72266,-189.00195 0,-165.97982 27.02007,-306.76866 65.99414,-405.78711 19.48704,-49.50923 41.97857,-88.56628 65.37697,-115.05078 23.3984,-26.484508 47.5072,-40.216801 70.3516,-40.216801 z m -104.66216,2.376953 -10.33398,2.13086 C 724.35159,118.79955 529.44531,348.09692 529.44531,622.0293 c 0,37.4947 32.14943,75.02128 88.01367,107.83984 55.86425,32.81856 135.99908,61.09807 234.12696,79.32813 l 4.85937,0.90234 -0.61914,-4.9043 C 848.5552,747.6035 844.66211,686.10092 844.66211,622.0293 c 0,-245.58047 57.61826,-452.66327 141.53125,-550.664066 z M 973.9668,74.894531 C 891.64255,178.27792 837.44336,381.83676 837.44336,622.0293 c 0,62.55184 3.75729,122.61027 10.67578,179.09961 -95.2727,-18.13884 -173.09878,-45.81675 -227.00391,-77.48438 -54.82351,-32.20716 -84.45117,-68.32055 -84.45117,-101.61523 0,-266.8687 187.35673,-490.62024 437.30274,-547.134769 z m 682.4316,651.798829 -8.0136,6.86328 c -98.0008,83.913 -305.0856,141.53125 -550.666,141.53125 -64.0716,0 -125.57406,-3.89532 -183.16607,-11.16406 l -4.90234,-0.61914 0.90234,4.85937 c 18.23007,98.12901 46.50958,178.26294 79.32813,234.12694 32.81854,55.864 70.34324,88.0137 107.83794,88.0137 273.9324,0 503.2297,-194.90628 556.5468,-453.27736 z m -1117.35934,0.004 2.13282,10.33007 c 45.67153,221.22412 220.32665,395.87926 441.55078,441.55076 l 10.33007,2.1328 -6.85937,-8.0156 C 931.16052,1108.389 887.30213,997.33715 863.81055,858.89453 l -0.42774,-2.52734 -2.52734,-0.42774 C 722.41445,832.49869 611.36185,788.58824 547.05469,733.55469 Z m 11.48047,18.9414 c 66.41528,52.93485 174.01769,94.22208 306.62695,116.96485 22.79002,132.60991 64.03204,240.21278 116.96485,306.62888 C 763.87441,1121.74 598.01204,955.87552 550.51953,745.63867 Z m 1094.33597,0.14453 c -56.5145,249.94602 -280.268,437.3027 -547.1367,437.3027 -33.2948,0 -69.4062,-29.6279 -101.61333,-84.4511 -31.66762,-53.9049 -59.34554,-131.73017 -77.48438,-227.00394 56.48916,6.91651 116.54571,10.67578 179.09771,10.67578 240.1925,0 443.7533,-54.19918 547.1367,-136.52344 z"
     id="path2"
     inkscape:connector-curvature="0"
     style="color:#000000;font-style:normal;font-variant:normal;font-weight:normal;font-stretch:normal;font-size:medium;line-height:normal;font-family:sans-serif;font-variant-ligatures:normal;font-variant-position:normal;font-variant-caps:normal;font-variant-numeric:normal;font-variant-alternates:normal;font-feature-settings:normal;text-indent:0;text-align:start;text-decoration:none;text-decoration-line:none;text-decoration-style:solid;text-decoration-color:#000000;letter-spacing:normal;word-spacing:normal;text-transform:none;writing-mode:lr-tb;direction:ltr;text-orientation:mixed;dominant-baseline:auto;baseline-shift:baseline;text-anchor:start;white-space:normal;shape-padding:0;clip-rule:nonzero;display:inline;overflow:visible;visibility:visible;opacity:0.5;isolation:auto;mix-blend-mode:normal;color-interpolation:sRGB;color-interpolation-filters:linearRGB;solid-color:#000000;solid-opacity:1;vector-effect:none;fill-opacity:1;fill-rule:nonzero;stroke:none;stroke-width:7.2187252;stroke-linecap:butt;stroke-linejoin:miter;stroke-miterlimit:4;stroke-dasharray:none;stroke-dashoffset:0;stroke-opacity:1;color-rendering:auto;image-rendering:auto;shape-rendering:auto;text-rendering:auto;enable-background:accumulate;fill:#6c5d53" />
  <path
     d="m 638.18667,770.41929 c -341.62989,0 -619.607423,277.97771 -619.607423,619.60741 0,341.6299 277.977533,619.6075 619.607423,619.6075 341.6297,0 619.60743,-277.9776 619.60743,-619.6075 0,-341.6297 -277.97773,-619.60741 -619.60743,-619.60741 z m 0,7.21875 c 337.71471,0 612.38863,274.67396 612.38863,612.38866 0,337.7149 -274.67392,612.3887 -612.38863,612.3887 -337.71491,0 -612.388673,-274.6738 -612.388673,-612.3887 0,-337.7147 274.673763,-612.38866 612.388673,-612.38866 z m 0,44.11524 c -25.71731,0 -51.5551,15.25696 -75.76172,42.65625 -24.20661,27.39928 -46.97806,67.12115 -66.68359,117.18555 -39.41106,100.12872 -66.49609,241.66932 -66.4961,408.43162 0,69.0571 4.83665,133.4919 13.125,192.7422 l 0.37696,2.6973 2.69726,0.3769 c 59.24772,8.2883 123.68527,13.125 192.74219,13.125 166.76236,0 308.3049,-27.083 408.43353,-66.4941 50.0644,-19.7055 89.7843,-42.4789 117.1836,-66.6855 27.3993,-24.2067 42.6582,-50.0445 42.6582,-75.7618 0,-313.2942 -254.98111,-568.27342 -568.27533,-568.27342 z m 0,7.21875 c 309.37838,0 561.05663,251.67637 561.05663,561.05467 0,22.8444 -13.7343,46.9551 -40.2188,70.3535 -26.4845,23.3985 -65.5396,45.888 -115.0488,65.375 -99.01843,38.9741 -239.80919,65.9942 -405.78903,65.9942 -67.67728,0 -130.82291,-4.7064 -189.00195,-12.7207 -8.01441,-58.1815 -12.7207,-121.3246 -12.7207,-189.002 0,-165.9798 27.02007,-306.7706 65.99414,-405.78902 19.48703,-49.5093 41.97852,-88.56435 65.37695,-115.04886 23.39842,-26.4845 47.50722,-40.21679 70.35156,-40.21679 z m -104.66406,2.375 -10.33399,2.13281 C 264.81756,886.79697 69.911279,1116.0943 69.911279,1390.0267 c 0,37.4947 32.151371,75.0194 88.015631,107.8379 55.86425,32.8186 135.99712,61.1001 234.125,79.3301 l 4.85937,0.9023 -0.61914,-4.9042 c -7.27095,-57.5918 -11.16406,-119.0944 -11.16406,-183.1661 0,-245.5804 57.62021,-452.66322 141.5332,-550.66405 z m -19.08985,11.54492 c -82.32424,103.38343 -136.52343,306.94225 -136.52343,547.13475 0,62.5512 3.75745,122.609 10.67578,179.0977 -95.27254,-18.1388 -173.09688,-45.8148 -227.00195,-77.4824 -54.82353,-32.2072 -84.453131,-68.3206 -84.453131,-101.6153 0,-266.8687 187.356741,-490.62023 437.302731,-547.13475 z m 682.43354,651.79885 -8.0156,6.8633 c -98.0008,83.913 -305.08358,141.5312 -550.66403,141.5312 -64.07156,0 -125.57401,-3.8954 -183.16601,-11.164 l -4.9043,-0.6192 0.90234,4.8594 c 18.23008,98.129 46.51154,178.263 79.33008,234.127 32.81854,55.8639 70.34322,88.0136 107.83789,88.0136 273.93251,0 503.22973,-194.9063 556.54683,-453.2773 z m -1117.359318,0 2.132812,10.3301 c 45.671536,221.2241 220.324726,395.8773 441.548826,441.5488 l 10.33008,2.1328 -6.85742,-8.0136 C 471.62845,1876.3865 427.77003,1765.3326 404.27847,1626.89 l -0.42969,-2.5254 -2.52734,-0.4297 C 262.88037,1600.4942 151.8278,1556.5857 87.520654,1501.5521 Z m 11.478515,18.9395 c 66.415453,52.9356 174.017883,94.2239 306.628913,116.9668 22.79011,132.6105 64.03362,240.2129 116.96679,306.6289 C 304.34267,1889.7383 138.47794,1723.8724 90.985497,1513.6342 Z m 1094.335903,0.1464 c -56.5145,249.946 -280.2659,437.3028 -547.13473,437.3028 -33.29473,0 -69.4081,-29.628 -101.61523,-84.4512 -31.66757,-53.9048 -59.34358,-131.7303 -77.48242,-227.0039 56.48859,6.9163 116.54642,10.6758 179.09765,10.6758 240.19252,0 443.75133,-54.1992 547.13473,-136.5235 z"
     id="path2-6"
     inkscape:connector-curvature="0"
     style="color:#000000;font-style:normal;font-variant:normal;font-weight:normal;font-stretch:normal;font-size:medium;line-height:normal;font-family:sans-serif;font-variant-ligatures:normal;font-variant-position:normal;font-variant-caps:normal;font-variant-numeric:normal;font-variant-alternates:normal;font-feature-settings:normal;text-indent:0;text-align:start;text-decoration:none;text-decoration-line:none;text-decoration-style:solid;text-decoration-color:#000000;letter-spacing:normal;word-spacing:normal;text-transform:none;writing-mode:lr-tb;direction:ltr;text-orientation:mixed;dominant-baseline:auto;baseline-shift:baseline;text-anchor:start;white-space:normal;shape-padding:0;clip-rule:nonzero;display:inline;overflow:visible;visibility:visible;opacity:0.5;isolation:auto;mix-blend-mode:normal;color-interpolation:sRGB;color-interpolation-filters:linearRGB;solid-color:#000000;solid-opacity:1;vector-effect:none;fill-opacity:1;fill-rule:nonzero;stroke:none;stroke-width:7.21872568;stroke-linecap:butt;stroke-linejoin:miter;stroke-miterlimit:4;stroke-dasharray:none;stroke-dashoffset:0;stroke-opacity:1;color-rendering:auto;image-rendering:auto;shape-rendering:auto;text-rendering:auto;enable-background:accumulate;fill:#6c5d53" />
  <path
     d="m 1578.2475,760.04729 c -341.6298,0 -619.60738,277.97771 -619.60738,619.60741 0,341.6298 277.97758,619.6074 619.60738,619.6074 341.6297,0 619.6075,-277.9776 619.6075,-619.6074 0,-341.6297 -277.9778,-619.60741 -619.6075,-619.60741 z m 0,7.21875 c 337.7148,0 612.3887,274.67396 612.3887,612.38866 0,337.7148 -274.6739,612.3887 -612.3887,612.3887 -337.7149,0 -612.38858,-274.6739 -612.38858,-612.3887 0,-337.7147 274.67368,-612.38866 612.38858,-612.38866 z m 0,44.11329 c -25.7173,0 -51.5551,15.25696 -75.7617,42.65625 -24.2066,27.39928 -46.978,67.12123 -66.6836,117.18553 -39.411,100.12869 -66.4961,241.67119 -66.4961,408.43359 0,69.057 4.8367,133.4919 13.125,192.7422 l 0.377,2.6973 2.6973,0.3769 c 59.2477,8.2883 123.6852,13.125 192.7421,13.125 166.7624,0 308.305,-27.085 408.4336,-66.4961 50.0644,-19.7055 89.7863,-42.477 117.1856,-66.6836 27.3993,-24.2066 42.6562,-50.0444 42.6562,-75.7617 0,-313.2942 -254.9811,-568.27537 -568.2754,-568.27537 z m 0,7.21875 c 309.3784,0 561.0567,251.67822 561.0567,561.05662 0,22.8443 -13.7323,46.9531 -40.2168,70.3516 -26.4845,23.3984 -65.5416,45.8899 -115.0508,65.3769 -99.0184,38.9741 -239.8092,65.9942 -405.7891,65.9942 -67.6765,0 -130.8214,-4.7066 -189,-12.7207 -8.0144,-58.1816 -12.7226,-121.3246 -12.7226,-189.002 0,-165.9798 27.0201,-306.7706 65.9941,-405.78909 19.4871,-49.5092 41.9786,-88.56623 65.377,-115.05074 23.3984,-26.4845 47.5072,-40.21679 70.3515,-40.21679 z m -104.6621,2.37695 -10.3339,2.13281 c -258.3711,53.31711 -453.2793,282.61446 -453.2793,556.54686 0,37.4947 32.1513,75.0193 88.0156,107.8379 55.8642,32.8185 135.9971,61.0981 234.125,79.3281 l 4.8594,0.9024 -0.6192,-4.9024 c -7.2709,-57.5917 -11.1621,-119.0944 -11.1621,-183.166 0,-245.5804 57.6183,-452.66519 141.5313,-550.666 z m -19.0898,11.54297 c -82.3252,103.38271 -136.5234,306.9425 -136.5234,547.1367 0,62.5512 3.7574,122.6089 10.6757,179.0977 -95.2727,-18.1388 -173.0987,-45.8168 -227.0039,-77.4844 -54.8235,-32.2072 -84.4531,-68.3186 -84.4531,-101.6133 0,-266.8687 187.3587,-490.62219 437.3047,-547.1367 z m 682.4316,651.7988 -8.0136,6.8633 c -98.0008,83.913 -305.0856,141.5312 -550.6661,141.5312 -64.0715,0 -125.574,-3.8934 -183.166,-11.1621 l -4.9023,-0.6191 0.9023,4.8594 c 18.2301,98.1289 46.5096,178.261 79.3282,234.125 32.8185,55.8639 70.3432,88.0156 107.8378,88.0156 273.9326,0 503.2298,-194.9082 556.5469,-453.2793 z m -1117.3593,0 2.1328,10.3301 c 45.6715,221.2241 220.3267,395.8793 441.5508,441.5508 l 10.33,2.1328 -6.8593,-8.0156 c -55.0329,-64.3062 -98.8913,-175.3582 -122.3829,-313.8008 l -0.4296,-2.5274 -2.5254,-0.4277 c -138.4411,-23.4406 -249.4936,-67.3493 -313.8008,-122.3828 z m 11.4804,18.9434 c 66.4154,52.9343 174.0186,94.2204 306.627,116.9629 22.7898,132.6085 64.0328,240.2108 116.9648,306.6269 -210.236,-47.4923 -376.0987,-213.354 -423.5918,-423.5898 z m 1094.336,0.1426 c -56.5145,249.946 -280.2679,437.3046 -547.1368,437.3046 -33.2947,0 -69.4061,-29.6299 -101.6132,-84.4531 -31.6679,-53.9052 -59.3456,-131.7293 -77.4844,-227.0039 56.4887,6.9163 116.5463,10.6758 179.0976,10.6758 240.1941,0 443.754,-54.1983 547.1368,-136.5234 z"
     id="path2-6-2"
     inkscape:connector-curvature="0"
     style="color:#000000;font-style:normal;font-variant:normal;font-weight:normal;font-stretch:normal;font-size:medium;line-height:normal;font-family:sans-serif;font-variant-ligatures:normal;font-variant-position:normal;font-variant-caps:normal;font-variant-numeric:normal;font-variant-alternates:normal;font-feature-settings:normal;text-indent:0;text-align:start;text-decoration:none;text-decoration-line:none;text-decoration-style:solid;text-decoration-color:#000000;letter-spacing:normal;word-spacing:normal;text-transform:none;writing-mode:lr-tb;direction:ltr;text-orientation:mixed;dominant-baseline:auto;baseline-shift:baseline;text-anchor:start;white-space:normal;shape-padding:0;clip-rule:nonzero;display:inline;overflow:visible;visibility:visible;opacity:0.5;isolation:auto;mix-blend-mode:normal;color-interpolation:sRGB;color-interpolation-filters:linearRGB;solid-color:#000000;solid-opacity:1;vector-effect:none;fill-opacity:1;fill-rule:nonzero;stroke:none;stroke-width:7.21872616;stroke-linecap:butt;stroke-linejoin:miter;stroke-miterlimit:4;stroke-dasharray:none;stroke-dashoffset:0;stroke-opacity:1;color-rendering:auto;image-rendering:auto;shape-rendering:auto;text-rendering:auto;enable-background:accumulate;fill:#6c5d53" />
  <text
     id="text878-6"
     style="font-style:normal;font-variant:normal;font-weight:normal;font-stretch:normal;font-size:75.00000763px;line-height:1.25;font-family:Carlito;-inkscape-font-specification:'Carlito, Normal';font-variant-ligatures:normal;font-variant-caps:normal;font-variant-numeric:normal;font-feature-settings:normal;text-align:center;letter-spacing:0px;word-spacing:0px;writing-mode:lr-tb;text-anchor:middle;fill:#000000;fill-opacity:1;stroke:none;stroke-width:0.75"
     x="222.8051"
     xml:space="preserve"
     y="462.58054"><tspan
       id="tspan945"
       sodipodi:role="line"
       x="222.8051"
       y="528.20557"
       style="font-style:normal;font-variant:normal;font-weight:normal;font-stretch:normal;font-size:75.00000763px;font-family:Carlito;-inkscape-font-specification:'Carlito, Normal';font-variant-ligatures:normal;font-variant-caps:normal;font-variant-numeric:normal;font-feature-settings:normal;text-align:center;writing-mode:lr-tb;text-anchor:middle;stroke-width:0.75" /></text>
  <text
     id="text933"
     style="font-style:normal;font-variant:normal;font-weight:normal;font-stretch:normal;font-size:75px;line-height:1.25;font-family:Carlito;-inkscape-font-specification:'Carlito, Normal';font-variant-ligatures:normal;font-variant-caps:normal;font-variant-numeric:normal;font-feature-settings:normal;text-align:center;letter-spacing:0px;word-spacing:0px;writing-mode:lr-tb;text-anchor:middle;fill:#000000;fill-opacity:1;stroke:none;stroke-width:0.75"
     x="1984.9606"
     xml:space="preserve"
     y="330.35748"><tspan
       id="tspan937"
       sodipodi:role="line"
       x="1984.9606"
       y="395.98248"
       style="stroke-width:0.75" /></text>
</svg>
