<?xml version="1.0" encoding="UTF-8" standalone="no"?>
<svg
   xmlns:dc="http://purl.org/dc/elements/1.1/"
   xmlns:cc="http://creativecommons.org/ns#"
   xmlns:rdf="http://www.w3.org/1999/02/22-rdf-syntax-ns#"
   xmlns:svg="http://www.w3.org/2000/svg"
   xmlns="http://www.w3.org/2000/svg"
   xmlns:sodipodi="http://sodipodi.sourceforge.net/DTD/sodipodi-0.dtd"
   xmlns:inkscape="http://www.inkscape.org/namespaces/inkscape"
   width="210mm"
   height="297mm"
   viewBox="0 0 210 297"
   version="1.1"
   id="svg8"
   sodipodi:docname="cards0508v.svg"
   inkscape:version="1.0.2 (e86c870879, 2021-01-15)">
  <defs
     id="defs2">
    <inkscape:path-effect
       effect="skeletal"
       id="path-effect1140"
       is_visible="true"
       pattern="M 0,5 C 0,2.24 2.24,0 5,0 7.76,0 10,2.24 10,5 10,7.76 7.76,10 5,10 2.24,10 0,7.76 0,5 Z"
       copytype="single_stretched"
       prop_scale="0.96784374"
       scale_y_rel="false"
       spacing="0"
       normal_offset="0"
       tang_offset="0"
       prop_units="false"
       vertical_pattern="false"
       fuse_tolerance="0" />
    <inkscape:path-effect
       effect="skeletal"
       id="path-effect1138"
       is_visible="true"
       pattern="M 0,5 C 0,2.24 2.24,0 5,0 7.76,0 10,2.24 10,5 10,7.76 7.76,10 5,10 2.24,10 0,7.76 0,5 Z"
       copytype="single_stretched"
       prop_scale="1.4801064"
       scale_y_rel="false"
       spacing="0"
       normal_offset="0"
       tang_offset="0"
       prop_units="false"
       vertical_pattern="false"
       fuse_tolerance="0" />
    <inkscape:path-effect
       effect="skeletal"
       id="path-effect1136"
       is_visible="true"
       pattern="M 0,5 C 0,2.24 2.24,0 5,0 7.76,0 10,2.24 10,5 10,7.76 7.76,10 5,10 2.24,10 0,7.76 0,5 Z"
       copytype="single_stretched"
       prop_scale="2"
       scale_y_rel="false"
       spacing="0"
       normal_offset="0"
       tang_offset="0"
       prop_units="false"
       vertical_pattern="false"
       fuse_tolerance="0" />
    <inkscape:path-effect
       effect="skeletal"
       id="path-effect1134"
       is_visible="true"
       pattern="M 0,5 C 0,2.24 2.24,0 5,0 7.76,0 10,2.24 10,5 10,7.76 7.76,10 5,10 2.24,10 0,7.76 0,5 Z"
       copytype="single_stretched"
       prop_scale="2"
       scale_y_rel="false"
       spacing="0"
       normal_offset="0"
       tang_offset="0"
       prop_units="false"
       vertical_pattern="false"
       fuse_tolerance="0" />
    <inkscape:path-effect
       effect="skeletal"
       id="path-effect1132"
       is_visible="true"
       pattern="m 0,297 c 0,-2.76 2.24,-5 5,-5 2.76,0 5,2.24 5,5 0,2.76 -2.24,5 -5,5 -2.76,0 -5,-2.24 -5,-5 z"
       copytype="single_stretched"
       prop_scale="2"
       scale_y_rel="false"
       spacing="0"
       normal_offset="0"
       tang_offset="0"
       prop_units="false"
       vertical_pattern="false"
       fuse_tolerance="0" />
    <inkscape:path-effect
       effect="skeletal"
       id="path-effect1130"
       is_visible="true"
       pattern="m 0,297 c 0,-2.76 2.24,-5 5,-5 2.76,0 5,2.24 5,5 0,2.76 -2.24,5 -5,5 -2.76,0 -5,-2.24 -5,-5 z"
       copytype="single_stretched"
       prop_scale="0.7712"
       scale_y_rel="false"
       spacing="0"
       normal_offset="0"
       tang_offset="0"
       prop_units="false"
       vertical_pattern="false"
       fuse_tolerance="0" />
    <inkscape:path-effect
       effect="skeletal"
       id="path-effect1128"
       is_visible="true"
       pattern="m 0,297 c 0,-2.76 2.24,-5 5,-5 2.76,0 5,2.24 5,5 0,2.76 -2.24,5 -5,5 -2.76,0 -5,-2.24 -5,-5 z"
       copytype="single_stretched"
       prop_scale="0.85957818"
       scale_y_rel="false"
       spacing="0"
       normal_offset="0"
       tang_offset="0"
       prop_units="false"
       vertical_pattern="false"
       fuse_tolerance="0" />
    <inkscape:path-effect
       effect="skeletal"
       id="path-effect1126"
       is_visible="true"
       pattern="m 721.626,383.1137 c 0,-2.76 2.24,-5 5,-5 2.76,0 5,2.24 5,5 0,2.76 -2.24,5 -5,5 -2.76,0 -5,-2.24 -5,-5 z"
       copytype="single_stretched"
       prop_scale="2"
       scale_y_rel="false"
       spacing="0"
       normal_offset="0"
       tang_offset="0"
       prop_units="false"
       vertical_pattern="false"
       fuse_tolerance="0" />
    <inkscape:path-effect
       effect="skeletal"
       id="path-effect1124"
       is_visible="true"
       pattern="m 721.626,383.1137 c 0,-2.76 2.24,-5 5,-5 2.76,0 5,2.24 5,5 0,2.76 -2.24,5 -5,5 -2.76,0 -5,-2.24 -5,-5 z"
       copytype="single_stretched"
       prop_scale="2"
       scale_y_rel="false"
       spacing="0"
       normal_offset="0"
       tang_offset="0"
       prop_units="false"
       vertical_pattern="false"
       fuse_tolerance="0" />
    <inkscape:path-effect
       effect="skeletal"
       id="path-effect1122"
       is_visible="true"
       pattern="m 721.626,383.1137 c 0,-2.76 2.24,-5 5,-5 2.76,0 5,2.24 5,5 0,2.76 -2.24,5 -5,5 -2.76,0 -5,-2.24 -5,-5 z"
       copytype="single_stretched"
       prop_scale="2"
       scale_y_rel="false"
       spacing="0"
       normal_offset="0"
       tang_offset="0"
       prop_units="false"
       vertical_pattern="false"
       fuse_tolerance="0" />
    <inkscape:path-effect
       effect="skeletal"
       id="path-effect1120"
       is_visible="true"
       pattern="m 407.13088,269.67947 c 0,-2.76 2.24,-5 5,-5 2.76,0 5,2.24 5,5 0,2.76 -2.24,5 -5,5 -2.76,0 -5,-2.24 -5,-5 z"
       copytype="single_stretched"
       prop_scale="0.34586333"
       scale_y_rel="false"
       spacing="0"
       normal_offset="0"
       tang_offset="0"
       prop_units="false"
       vertical_pattern="false"
       fuse_tolerance="0" />
    <rect
       x="38.435823"
       y="31.565418"
       width="41.177719"
       height="26.438528"
       id="rect26" />
    <rect
       x="91.492016"
       y="96.929057"
       width="0.37797619"
       height="42.716489"
       id="rect20" />
    <rect
       x="51.797134"
       y="86.308593"
       width="64.99353"
       height="64.285302"
       id="rect14" />
    <clipPath
       id="clip1">
      <path
         d="M 5 1.933594 L 20 1.933594 L 20 13.132813 L 5 13.132813 Z "
         id="path703" />
    </clipPath>
    <clipPath
       id="clip2">
      <path
         d="M 4 1.933594 L 21 1.933594 L 21 13.132813 L 4 13.132813 Z "
         id="path706" />
    </clipPath>
    <inkscape:path-effect
       effect="skeletal"
       id="path-effect4760-0-93-2-6"
       is_visible="true"
       pattern="m 721.626,383.1137 c 0,-2.76 2.24,-5 5,-5 2.76,0 5,2.24 5,5 0,2.76 -2.24,5 -5,5 -2.76,0 -5,-2.24 -5,-5 z"
       copytype="single_stretched"
       prop_scale="2"
       scale_y_rel="false"
       spacing="0"
       normal_offset="0"
       tang_offset="0"
       prop_units="false"
       vertical_pattern="false"
       fuse_tolerance="0" />
    <inkscape:path-effect
       effect="skeletal"
       id="path-effect4764-7-6-1-2"
       is_visible="true"
       pattern="m 721.626,383.1137 c 0,-2.76 2.24,-5 5,-5 2.76,0 5,2.24 5,5 0,2.76 -2.24,5 -5,5 -2.76,0 -5,-2.24 -5,-5 z"
       copytype="single_stretched"
       prop_scale="2"
       scale_y_rel="false"
       spacing="0"
       normal_offset="0"
       tang_offset="0"
       prop_units="false"
       vertical_pattern="false"
       fuse_tolerance="0" />
    <inkscape:path-effect
       effect="skeletal"
       id="path-effect4768-2-0-2-9"
       is_visible="true"
       pattern="m 721.626,383.1137 c 0,-2.76 2.24,-5 5,-5 2.76,0 5,2.24 5,5 0,2.76 -2.24,5 -5,5 -2.76,0 -5,-2.24 -5,-5 z"
       copytype="single_stretched"
       prop_scale="2"
       scale_y_rel="false"
       spacing="0"
       normal_offset="0"
       tang_offset="0"
       prop_units="false"
       vertical_pattern="false"
       fuse_tolerance="0" />
    <inkscape:path-effect
       effect="skeletal"
       id="path-effect4900-6-0-1"
       is_visible="true"
       pattern="m 0,297 c 0,-2.76 2.24,-5 5,-5 2.76,0 5,2.24 5,5 0,2.76 -2.24,5 -5,5 -2.76,0 -5,-2.24 -5,-5 z"
       copytype="single_stretched"
       prop_scale="0.85957818"
       scale_y_rel="false"
       spacing="0"
       normal_offset="0"
       tang_offset="0"
       prop_units="false"
       vertical_pattern="false"
       fuse_tolerance="0" />
    <inkscape:path-effect
       effect="skeletal"
       id="path-effect4904-2-7-2"
       is_visible="true"
       pattern="m 0,297 c 0,-2.76 2.24,-5 5,-5 2.76,0 5,2.24 5,5 0,2.76 -2.24,5 -5,5 -2.76,0 -5,-2.24 -5,-5 z"
       copytype="single_stretched"
       prop_scale="0.7712"
       scale_y_rel="false"
       spacing="0"
       normal_offset="0"
       tang_offset="0"
       prop_units="false"
       vertical_pattern="false"
       fuse_tolerance="0" />
    <inkscape:path-effect
       effect="skeletal"
       id="path-effect4908-6-3-7"
       is_visible="true"
       pattern="m 0,297 c 0,-2.76 2.24,-5 5,-5 2.76,0 5,2.24 5,5 0,2.76 -2.24,5 -5,5 -2.76,0 -5,-2.24 -5,-5 z"
       copytype="single_stretched"
       prop_scale="2"
       scale_y_rel="false"
       spacing="0"
       normal_offset="0"
       tang_offset="0"
       prop_units="false"
       vertical_pattern="false"
       fuse_tolerance="0" />
    <inkscape:path-effect
       effect="skeletal"
       id="path-effect4934-1-1-0"
       is_visible="true"
       pattern="M 0,5 C 0,2.24 2.24,0 5,0 7.76,0 10,2.24 10,5 10,7.76 7.76,10 5,10 2.24,10 0,7.76 0,5 Z"
       copytype="single_stretched"
       prop_scale="2"
       scale_y_rel="false"
       spacing="0"
       normal_offset="0"
       tang_offset="0"
       prop_units="false"
       vertical_pattern="false"
       fuse_tolerance="0" />
    <inkscape:path-effect
       effect="skeletal"
       id="path-effect4938-8-1-9"
       is_visible="true"
       pattern="M 0,5 C 0,2.24 2.24,0 5,0 7.76,0 10,2.24 10,5 10,7.76 7.76,10 5,10 2.24,10 0,7.76 0,5 Z"
       copytype="single_stretched"
       prop_scale="2"
       scale_y_rel="false"
       spacing="0"
       normal_offset="0"
       tang_offset="0"
       prop_units="false"
       vertical_pattern="false"
       fuse_tolerance="0" />
    <inkscape:path-effect
       effect="skeletal"
       id="path-effect5047-7-9-3"
       is_visible="true"
       pattern="M 0,5 C 0,2.24 2.24,0 5,0 7.76,0 10,2.24 10,5 10,7.76 7.76,10 5,10 2.24,10 0,7.76 0,5 Z"
       copytype="single_stretched"
       prop_scale="1.4801064"
       scale_y_rel="false"
       spacing="0"
       normal_offset="0"
       tang_offset="0"
       prop_units="false"
       vertical_pattern="false"
       fuse_tolerance="0" />
    <inkscape:path-effect
       effect="skeletal"
       id="path-effect5051-9-0-6"
       is_visible="true"
       pattern="M 0,5 C 0,2.24 2.24,0 5,0 7.76,0 10,2.24 10,5 10,7.76 7.76,10 5,10 2.24,10 0,7.76 0,5 Z"
       copytype="single_stretched"
       prop_scale="0.96784374"
       scale_y_rel="false"
       spacing="0"
       normal_offset="0"
       tang_offset="0"
       prop_units="false"
       vertical_pattern="false"
       fuse_tolerance="0" />
    <inkscape:path-effect
       effect="skeletal"
       id="path-effect81-7-0"
       is_visible="true"
       pattern="m 407.13088,269.67947 c 0,-2.76 2.24,-5 5,-5 2.76,0 5,2.24 5,5 0,2.76 -2.24,5 -5,5 -2.76,0 -5,-2.24 -5,-5 z"
       copytype="single_stretched"
       prop_scale="0.34586333"
       scale_y_rel="false"
       spacing="0"
       normal_offset="0"
       tang_offset="0"
       prop_units="false"
       vertical_pattern="false"
       fuse_tolerance="0" />
    <clipPath
       id="clip1-3">
      <path
         d="M 5,1.933594 H 20 V 13.132813 H 5 Z"
         id="path703-5" />
    </clipPath>
    <clipPath
       id="clip2-6">
      <path
         d="M 4,1.933594 H 21 V 13.132813 H 4 Z"
         id="path706-2" />
    </clipPath>
    <clipPath
       id="clip1-3-3-6-3">
      <path
         d="M 5,1.933594 H 20 V 13.132813 H 5 Z"
         id="path1549-6-7-6" />
    </clipPath>
    <clipPath
       id="clip2-7-5-7">
      <path
         d="M 4,1.933594 H 21 V 13.132813 H 4 Z"
         id="path1552-5-3-5" />
    </clipPath>
    <clipPath
       id="clip1-3-3-6-3-3">
      <path
         d="M 5,1.933594 H 20 V 13.132813 H 5 Z"
         id="path1549-6-7-6-6" />
    </clipPath>
    <clipPath
       id="clip2-7-5-7-7">
      <path
         d="M 4,1.933594 H 21 V 13.132813 H 4 Z"
         id="path1552-5-3-5-5" />
    </clipPath>
  </defs>
  <sodipodi:namedview
     id="base"
     pagecolor="#ffffff"
     bordercolor="#666666"
     borderopacity="1.0"
     inkscape:pageopacity="0.0"
     inkscape:pageshadow="2"
     inkscape:zoom="1.1964766"
     inkscape:cx="419.02843"
     inkscape:cy="751.74359"
     inkscape:document-units="mm"
     inkscape:current-layer="layer1"
     inkscape:document-rotation="0"
     showgrid="false"
     showguides="true"
     inkscape:guide-bbox="true"
     inkscape:window-width="1920"
     inkscape:window-height="1033"
     inkscape:window-x="0"
     inkscape:window-y="23"
     inkscape:window-maximized="1"
     inkscape:lockguides="false">
    <sodipodi:guide
       position="10,297"
       orientation="-1,0"
       id="guide30"
       inkscape:label=""
       inkscape:locked="false"
       inkscape:color="rgb(0,0,255)" />
    <sodipodi:guide
       position="0,287"
       orientation="0,1"
       id="guide32"
       inkscape:label=""
       inkscape:locked="false"
       inkscape:color="rgb(0,0,255)" />
    <sodipodi:guide
       position="200,297"
       orientation="-1,0"
       id="guide34"
       inkscape:label=""
       inkscape:locked="false"
       inkscape:color="rgb(0,0,255)" />
    <sodipodi:guide
       position="0,10"
       orientation="0,1"
       id="guide36"
       inkscape:label=""
       inkscape:locked="false"
       inkscape:color="rgb(0,0,255)" />
    <sodipodi:guide
       position="95,297"
       orientation="-1,0"
       id="guide38"
       inkscape:label=""
       inkscape:locked="false"
       inkscape:color="rgb(0,0,255)" />
    <sodipodi:guide
       position="0,158.5"
       orientation="0,1"
       id="guide40"
       inkscape:label=""
       inkscape:locked="false"
       inkscape:color="rgb(0,0,255)" />
    <inkscape:grid
       type="xygrid"
       id="grid78" />
    <sodipodi:guide
       position="115,297"
       orientation="-1,0"
       id="guide1206"
       inkscape:label=""
       inkscape:locked="false"
       inkscape:color="rgb(0,0,255)" />
    <sodipodi:guide
       position="0,138.5"
       orientation="0,1"
       id="guide1210"
       inkscape:label=""
       inkscape:locked="false"
       inkscape:color="rgb(0,0,255)" />
  </sodipodi:namedview>
  <metadata
     id="metadata5">
    <rdf:RDF>
      <cc:Work
         rdf:about="">
        <dc:format>image/svg+xml</dc:format>
        <dc:type
           rdf:resource="http://purl.org/dc/dcmitype/StillImage" />
        <dc:title />
      </cc:Work>
    </rdf:RDF>
  </metadata>
  <g
     inkscape:label="Calque 1"
     inkscape:groupmode="layer"
     id="layer1">
    <text
       xml:space="preserve"
       style="font-size:3.52778px;line-height:1.25;font-family:Carlito;-inkscape-font-specification:'Carlito, Normal';letter-spacing:0px;word-spacing:0px;white-space:pre;inline-size:92.8158;stroke-width:0.00018522;stroke-miterlimit:4;stroke-dasharray:0.00018522, 0.00018522;stroke-dashoffset:0"
       x="38.42152"
       y="138.57492"
       id="text106-3"
       transform="translate(-28.132899,-9.6167662)"><tspan
         x="38.42152"
         y="138.57492"><tspan
           style="font-style:italic;font-variant:normal;font-weight:normal;font-stretch:normal;font-size:3.52778px;font-family:Carlito;-inkscape-font-specification:'Carlito Italic';fill:#501644;stroke-width:0.00018522;stroke-miterlimit:4;stroke-dasharray:0.00018522, 0.00018522;stroke-dashoffset:0">♠</tspan><tspan
           style="font-style:italic;font-variant:normal;font-weight:normal;font-stretch:normal;font-size:3.52778px;font-family:Carlito;-inkscape-font-specification:'Carlito Italic';fill:#501644;stroke-width:0.00018522;stroke-miterlimit:4;stroke-dasharray:0.00018522, 0.00018522;stroke-dashoffset:0"> Le LifePhone ne dispose pas de certaines applications </tspan></tspan><tspan
         x="38.42152"
         y="142.98465"><tspan
           style="font-style:italic;font-variant:normal;font-weight:normal;font-stretch:normal;font-size:3.52778px;font-family:Carlito;-inkscape-font-specification:'Carlito Italic';fill:#501644;stroke-width:0.00018522;stroke-miterlimit:4;stroke-dasharray:0.00018522, 0.00018522;stroke-dashoffset:0">propriétaires comme Waze, TikTok ou Instagram... (mais il
</tspan></tspan><tspan
         x="38.42152"
         y="147.39438"><tspan
           style="font-style:italic;font-variant:normal;font-weight:normal;font-stretch:normal;font-size:3.52778px;font-family:Carlito;-inkscape-font-specification:'Carlito Italic';fill:#501644;stroke-width:0.00018522;stroke-miterlimit:4;stroke-dasharray:0.00018522, 0.00018522;stroke-dashoffset:0">y a des alternatives, même si elles sont moins connues). </tspan></tspan></text>
    <text
       xml:space="preserve"
       style="font-size:7.05556px;line-height:1.25;font-family:Carlito;-inkscape-font-specification:'Carlito, Normal';letter-spacing:0px;word-spacing:0px;stroke-width:0.00018522;stroke-miterlimit:4;stroke-dasharray:0.00018522, 0.00018522;stroke-dashoffset:0"
       x="21.726006"
       y="221.14368"
       id="text98-9"><tspan
         sodipodi:role="line"
         id="tspan96-3"
         x="21.726006"
         y="221.14368"
         style="font-size:7.05556px;fill:#501644;stroke-width:0.00018522;stroke-miterlimit:4;stroke-dasharray:0.00018522, 0.00018522;stroke-dashoffset:0">Ça pique  ♤  ♤  ♤  ♤</tspan></text>
    <text
       xml:space="preserve"
       style="font-size:7.05556px;line-height:1.25;font-family:Carlito;-inkscape-font-specification:'Carlito, Normal';letter-spacing:0px;word-spacing:0px;stroke-width:0.00018522;stroke-miterlimit:4;stroke-dasharray:0.00018522, 0.00018522;stroke-dashoffset:0"
       x="21.620377"
       y="213.51477"
       id="text86-1"><tspan
         sodipodi:role="line"
         id="tspan84-9"
         x="21.620377"
         y="213.51477"
         style="font-size:7.05556px;fill:#d40055;stroke-width:0.00018522;stroke-miterlimit:4;stroke-dasharray:0.00018522, 0.00018522;stroke-dashoffset:0">J'aime   ♡  ♡  ♡  ♡</tspan></text>
    <text
       xml:space="preserve"
       style="font-size:4.23333px;line-height:1.25;font-family:Carlito;-inkscape-font-specification:'Carlito, Normal';letter-spacing:0px;word-spacing:0px;white-space:pre;inline-size:85.0781;stroke-width:0.00018522;stroke-miterlimit:4;stroke-dasharray:0.00018522, 0.00018522;stroke-dashoffset:0"
       x="18.418589"
       y="31.895514"
       id="text76"
       transform="translate(-8.4967198,-18.862693)"><tspan
         x="18.418589"
         y="31.895514"><tspan
           style="font-style:normal;font-variant:normal;font-weight:bold;font-stretch:normal;font-family:Carlito;-inkscape-font-specification:'Carlito Bold';fill:#453748;stroke-width:0.00018522;stroke-miterlimit:4;stroke-dasharray:0.00018522, 0.00018522;stroke-dashoffset:0">Le LifePhone ne contient que des applications </tspan></tspan><tspan
         x="18.418589"
         y="37.187173"><tspan
           style="font-style:normal;font-variant:normal;font-weight:bold;font-stretch:normal;font-family:Carlito;-inkscape-font-specification:'Carlito Bold';fill:#453748;stroke-width:0.00018522;stroke-miterlimit:4;stroke-dasharray:0.00018522, 0.00018522;stroke-dashoffset:0">libres et décentralisées. Ça veut dire que tout le </tspan></tspan><tspan
         x="18.418589"
         y="42.478837"><tspan
           style="font-style:normal;font-variant:normal;font-weight:bold;font-stretch:normal;font-family:Carlito;-inkscape-font-specification:'Carlito Bold';fill:#453748;stroke-width:0.00018522;stroke-miterlimit:4;stroke-dasharray:0.00018522, 0.00018522;stroke-dashoffset:0">monde peut copier et modifier les logiciels et </tspan></tspan><tspan
         x="18.418589"
         y="47.770501"><tspan
           style="font-style:normal;font-variant:normal;font-weight:bold;font-stretch:normal;font-family:Carlito;-inkscape-font-specification:'Carlito Bold';fill:#453748;stroke-width:0.00018522;stroke-miterlimit:4;stroke-dasharray:0.00018522, 0.00018522;stroke-dashoffset:0">installer sa propre version, sans dépendre d'un </tspan></tspan><tspan
         x="18.418589"
         y="53.062165"><tspan
           style="font-style:normal;font-variant:normal;font-weight:bold;font-stretch:normal;font-family:Carlito;-inkscape-font-specification:'Carlito Bold';fill:#453748;stroke-width:0.00018522;stroke-miterlimit:4;stroke-dasharray:0.00018522, 0.00018522;stroke-dashoffset:0">opérateur central, comme Facebook ou Apple. </tspan></tspan><tspan
         x="18.418589"
         y="58.353829"><tspan
           style="font-style:normal;font-variant:normal;font-weight:bold;font-stretch:normal;font-family:Carlito;-inkscape-font-specification:'Carlito Bold';fill:#453748;stroke-width:0.00018522;stroke-miterlimit:4;stroke-dasharray:0.00018522, 0.00018522;stroke-dashoffset:0">Avec une appli propriétaire, par exemple Google </tspan></tspan><tspan
         x="18.418589"
         y="63.645494"><tspan
           style="font-style:normal;font-variant:normal;font-weight:bold;font-stretch:normal;font-family:Carlito;-inkscape-font-specification:'Carlito Bold';fill:#453748;stroke-width:0.00018522;stroke-miterlimit:4;stroke-dasharray:0.00018522, 0.00018522;stroke-dashoffset:0">Maps, seul Google a le droit de savoir </tspan></tspan><tspan
         x="18.418589"
         y="68.937158"><tspan
           style="font-style:normal;font-variant:normal;font-weight:bold;font-stretch:normal;font-family:Carlito;-inkscape-font-specification:'Carlito Bold';fill:#453748;stroke-width:0.00018522;stroke-miterlimit:4;stroke-dasharray:0.00018522, 0.00018522;stroke-dashoffset:0">exactement ce que fait l'appli, quelles données </tspan></tspan><tspan
         x="18.418589"
         y="74.228822"><tspan
           style="font-style:normal;font-variant:normal;font-weight:bold;font-stretch:normal;font-family:Carlito;-inkscape-font-specification:'Carlito Bold';fill:#453748;stroke-width:0.00018522;stroke-miterlimit:4;stroke-dasharray:0.00018522, 0.00018522;stroke-dashoffset:0">sont collectées, qui peut l'utiliser, comment...
</tspan></tspan></text>
    <text
       xml:space="preserve"
       style="font-size:3.52778px;line-height:1.25;font-family:Carlito;-inkscape-font-specification:'Carlito, Normal';letter-spacing:0px;word-spacing:0px;white-space:pre;inline-size:83.2104;stroke-width:0.00018522;stroke-miterlimit:4;stroke-dasharray:0.00018522, 0.00018522;stroke-dashoffset:0"
       x="18.446779"
       y="92.30014"
       id="text92"
       transform="translate(-6.6572258,-13.258592)"><tspan
         x="18.446779"
         y="92.30014"><tspan
           style="font-style:italic;font-variant:normal;font-weight:normal;font-stretch:normal;font-size:3.52778px;font-family:Carlito;-inkscape-font-specification:'Carlito Italic';fill:#d40055;stroke-width:0.00018522;stroke-miterlimit:4;stroke-dasharray:0.00018522, 0.00018522;stroke-dashoffset:0">♥</tspan><tspan
           style="font-style:italic;font-variant:normal;font-weight:normal;font-stretch:normal;font-size:3.52778px;font-family:Carlito;-inkscape-font-specification:'Carlito Italic';fill:#d40055;stroke-width:0.00018522;stroke-miterlimit:4;stroke-dasharray:0.00018522, 0.00018522;stroke-dashoffset:0"> Les applications libres peuvent être adaptées pour tous </tspan></tspan><tspan
         x="18.446779"
         y="96.709862"><tspan
           style="font-style:italic;font-variant:normal;font-weight:normal;font-stretch:normal;font-size:3.52778px;font-family:Carlito;-inkscape-font-specification:'Carlito Italic';fill:#d40055;stroke-width:0.00018522;stroke-miterlimit:4;stroke-dasharray:0.00018522, 0.00018522;stroke-dashoffset:0">les </tspan><tspan
           style="font-style:italic;font-variant:normal;font-weight:normal;font-stretch:normal;font-size:3.52778px;font-family:Carlito;-inkscape-font-specification:'Carlito Italic';fill:#d40055;stroke-width:0.00018522;stroke-miterlimit:4;stroke-dasharray:0.00018522, 0.00018522;stroke-dashoffset:0">matériels cela permet de lutter contre l'obsolescence.</tspan></tspan></text>
    <text
       xml:space="preserve"
       style="font-size:7.05556px;line-height:1.25;font-family:Carlito;-inkscape-font-specification:'Carlito, Normal';letter-spacing:0px;word-spacing:0px;stroke-width:0.00018522;stroke-miterlimit:4;stroke-dasharray:0.00018522, 0.00018522;stroke-dashoffset:0"
       x="19.706261"
       y="72.082764"
       id="text98"><tspan
         sodipodi:role="line"
         id="tspan142"
         x="19.706261"
         y="72.082764"
         style="font-size:7.05556px;fill:#501644;stroke-width:0.00018522;stroke-miterlimit:4;stroke-dasharray:0.00018522, 0.00018522;stroke-dashoffset:0">Ça pique  ♤  ♤  ♤  ♤</tspan></text>
    <text
       xml:space="preserve"
       style="font-size:3.52778px;line-height:1.25;font-family:Carlito;-inkscape-font-specification:'Carlito, Normal';letter-spacing:0px;word-spacing:0px;white-space:pre;inline-size:88.0622;stroke-width:0.00018522;stroke-miterlimit:4;stroke-dasharray:0.00018522, 0.00018522;stroke-dashoffset:0"
       x="38.42152"
       y="138.57492"
       id="text106"
       transform="translate(-0.84623043,-2.6871514)" />
    <text
       xml:space="preserve"
       style="font-size:4.23333px;line-height:1.25;font-family:Carlito;-inkscape-font-specification:'Carlito, Normal';letter-spacing:0px;word-spacing:0px;white-space:pre;inline-size:84.7428;stroke-width:0.00018522;stroke-miterlimit:4;stroke-dasharray:0.00018522, 0.00018522;stroke-dashoffset:0"
       x="18.418589"
       y="31.895514"
       id="text76-3"
       transform="translate(-8.1613435,129.7478)"><tspan
         x="18.418589"
         y="31.895514"><tspan
           style="font-style:normal;font-variant:normal;font-weight:bold;font-stretch:normal;font-family:Carlito;-inkscape-font-specification:'Carlito Bold';fill:#483737">Une nouvelle version du LifePhone sortira tous </tspan></tspan><tspan
         x="18.418589"
         y="37.187173"><tspan
           style="font-style:normal;font-variant:normal;font-weight:bold;font-stretch:normal;font-family:Carlito;-inkscape-font-specification:'Carlito Bold';fill:#483737">les... 50 ans ! Il assurera les fonctions connues </tspan></tspan><tspan
         x="18.418589"
         y="42.478837"><tspan
           style="font-style:normal;font-variant:normal;font-weight:bold;font-stretch:normal;font-family:Carlito;-inkscape-font-specification:'Carlito Bold';fill:#483737">en 2025, mais il n'accueillera plus rien de </tspan></tspan><tspan
         x="18.418589"
         y="47.770501"><tspan
           style="font-style:normal;font-variant:normal;font-weight:bold;font-stretch:normal;font-family:Carlito;-inkscape-font-specification:'Carlito Bold';fill:#483737">nouveau. C'est déjà pas mal tout ce qu'on peut </tspan></tspan><tspan
         x="18.418589"
         y="53.062165"><tspan
           style="font-style:normal;font-variant:normal;font-weight:bold;font-stretch:normal;font-family:Carlito;-inkscape-font-specification:'Carlito Bold';fill:#483737">faire aujourd'hui avec un smartphone, n'est-ce </tspan></tspan><tspan
         x="18.418589"
         y="58.353829"><tspan
           style="font-style:normal;font-variant:normal;font-weight:bold;font-stretch:normal;font-family:Carlito;-inkscape-font-specification:'Carlito Bold';fill:#483737">pas ? Et comme ça on va pouvoir sérieusement </tspan></tspan><tspan
         x="18.418589"
         y="63.645494"><tspan
           style="font-style:normal;font-variant:normal;font-weight:bold;font-stretch:normal;font-family:Carlito;-inkscape-font-specification:'Carlito Bold';fill:#483737">lutter contre l'obsolescence, il ne sera plus </tspan></tspan><tspan
         x="18.418589"
         y="68.937158"><tspan
           style="font-style:normal;font-variant:normal;font-weight:bold;font-stretch:normal;font-family:Carlito;-inkscape-font-specification:'Carlito Bold';fill:#483737">nécessaire de changer de smartphone parce </tspan></tspan><tspan
         x="18.418589"
         y="74.228822"><tspan
           style="font-style:normal;font-variant:normal;font-weight:bold;font-stretch:normal;font-family:Carlito;-inkscape-font-specification:'Carlito Bold';fill:#483737">qu'il n'est plus assez puissant.</tspan></tspan></text>
    <text
       xml:space="preserve"
       style="font-size:3.52778px;line-height:1.25;font-family:Carlito;-inkscape-font-specification:'Carlito, Normal';letter-spacing:0px;word-spacing:0px;white-space:pre;inline-size:83.7711;stroke-width:0.00018522;stroke-miterlimit:4;stroke-dasharray:0.00018522,0.00018522;stroke-dashoffset:0"
       x="38.42152"
       y="138.57492"
       id="text106-2"
       transform="translate(-20.673623,133.23077)" />
    <text
       xml:space="preserve"
       style="font-size:4.23333px;line-height:1.25;font-family:Carlito;-inkscape-font-specification:'Carlito, Normal';letter-spacing:0px;word-spacing:0px;stroke-width:0.00018522;stroke-miterlimit:4;stroke-dasharray:0.00018522,0.00018522;stroke-dashoffset:0"
       x="47.270638"
       y="61.495747"
       id="text1046"><tspan
         sodipodi:role="line"
         id="tspan1044"
         x="47.270638"
         y="61.495747"
         style="stroke-width:0.00018522;stroke-miterlimit:4;stroke-dasharray:0.00018522,0.00018522;stroke-dashoffset:0" /></text>
    <text
       xml:space="preserve"
       style="font-size:7.05556px;line-height:1.25;font-family:Carlito;-inkscape-font-specification:'Carlito, Normal';letter-spacing:0px;word-spacing:0px;stroke-width:0.00018522;stroke-miterlimit:4;stroke-dasharray:0.00018522, 0.00018522;stroke-dashoffset:0"
       x="19.600632"
       y="64.453857"
       id="text86"><tspan
         sodipodi:role="line"
         id="tspan259"
         x="19.600632"
         y="64.453857"
         style="font-size:7.05556px;fill:#d40055;stroke-width:0.00018522;stroke-miterlimit:4;stroke-dasharray:0.00018522, 0.00018522;stroke-dashoffset:0">J'aime   ♡  ♡  ♡  ♡</tspan></text>
    <rect
       style="fill:#ffdcc4;fill-opacity:0.224407;stroke:#e44d26;stroke-width:0.904943;stroke-miterlimit:4;stroke-dasharray:0.904943, 0.904943;stroke-dashoffset:0;stroke-opacity:0.863948"
       id="rect1282"
       width="53.805294"
       height="36.048355"
       x="41.23513"
       y="87.69294" />
    <rect
       style="fill:#ffdcc4;fill-opacity:0.224407;stroke:#e44d26;stroke-width:0.904648;stroke-miterlimit:4;stroke-dasharray:0.904648, 0.904648;stroke-dashoffset:0;stroke-opacity:0.863948"
       id="rect1282-3"
       width="85"
       height="22.803701"
       x="10"
       y="249.49413" />
    <text
       xml:space="preserve"
       style="font-size:3.52778px;line-height:1.25;font-family:Carlito;-inkscape-font-specification:'Carlito, Normal';letter-spacing:0px;word-spacing:0px;white-space:pre;inline-size:72.3473;stroke-width:0.00018522;stroke-miterlimit:4;stroke-dasharray:0.00018522, 0.00018522;stroke-dashoffset:0"
       x="38.42152"
       y="138.57492"
       id="text106-3-6"
       transform="translate(-28.293466,138.76496)"><tspan
         x="38.42152"
         y="138.57492"><tspan
           style="font-style:italic;font-variant:normal;font-weight:normal;font-stretch:normal;font-size:3.52778px;font-family:Carlito;-inkscape-font-specification:'Carlito Italic';fill:#501644;stroke-width:0.00018522;stroke-miterlimit:4;stroke-dasharray:0.00018522, 0.00018522;stroke-dashoffset:0">♠</tspan><tspan
           style="font-style:italic;font-variant:normal;font-weight:normal;font-stretch:normal;font-size:3.52778px;font-family:Carlito;-inkscape-font-specification:'Carlito Italic';fill:#501644;stroke-width:0.00018522;stroke-miterlimit:4;stroke-dasharray:0.00018522, 0.00018522;stroke-dashoffset:0"> L'évolution des standards de communication </tspan></tspan><tspan
         x="38.42152"
         y="142.98465"><tspan
           style="font-style:italic;font-variant:normal;font-weight:normal;font-stretch:normal;font-size:3.52778px;font-family:Carlito;-inkscape-font-specification:'Carlito Italic';fill:#501644;stroke-width:0.00018522;stroke-miterlimit:4;stroke-dasharray:0.00018522, 0.00018522;stroke-dashoffset:0">(XG) ou multimédia (formats vidéos) devront </tspan></tspan><tspan
         x="38.42152"
         y="147.39438"><tspan
           style="font-style:italic;font-variant:normal;font-weight:normal;font-stretch:normal;font-size:3.52778px;font-family:Carlito;-inkscape-font-specification:'Carlito Italic';fill:#501644;stroke-width:0.00018522;stroke-miterlimit:4;stroke-dasharray:0.00018522, 0.00018522;stroke-dashoffset:0">respecter la posture long-termiste du LifePhone...</tspan></tspan></text>
    <text
       xml:space="preserve"
       style="font-size:3.52778px;line-height:1.25;font-family:Carlito;-inkscape-font-specification:'Carlito, Normal';letter-spacing:0px;word-spacing:0px;white-space:pre;inline-size:84.8036;stroke-width:0.00018522;stroke-miterlimit:4;stroke-dasharray:0.00018522, 0.00018522;stroke-dashoffset:0"
       x="18.446779"
       y="92.30014"
       id="text92-7"
       transform="translate(-8.2504003,136.14053)"><tspan
         x="18.446779"
         y="92.30014"><tspan
           style="font-style:italic;font-variant:normal;font-weight:normal;font-stretch:normal;font-size:3.52778px;font-family:Carlito;-inkscape-font-specification:'Carlito Italic';fill:#d40055;stroke-width:0.00018522;stroke-miterlimit:4;stroke-dasharray:0.00018522, 0.00018522;stroke-dashoffset:0">♥</tspan><tspan
           style="font-style:italic;font-variant:normal;font-weight:normal;font-stretch:normal;font-size:3.52778px;font-family:Carlito;-inkscape-font-specification:'Carlito Italic';fill:#d40055;stroke-width:0.00018522;stroke-miterlimit:4;stroke-dasharray:0.00018522, 0.00018522;stroke-dashoffset:0"> La durée de vie d'un smartphone est très faible, alors </tspan></tspan><tspan
         x="18.446779"
         y="96.709862"><tspan
           style="font-style:italic;font-variant:normal;font-weight:normal;font-stretch:normal;font-size:3.52778px;font-family:Carlito;-inkscape-font-specification:'Carlito Italic';fill:#d40055;stroke-width:0.00018522;stroke-miterlimit:4;stroke-dasharray:0.00018522, 0.00018522;stroke-dashoffset:0">qu'on pourrait le faire durer plusieurs dizaines d'année. Ce </tspan></tspan><tspan
         x="18.446779"
         y="101.11958"><tspan
           style="font-style:italic;font-variant:normal;font-weight:normal;font-stretch:normal;font-size:3.52778px;font-family:Carlito;-inkscape-font-specification:'Carlito Italic';fill:#d40055;stroke-width:0.00018522;stroke-miterlimit:4;stroke-dasharray:0.00018522, 0.00018522;stroke-dashoffset:0">sont les logiciels qui sont la cause indirecte de cette </tspan></tspan><tspan
         x="18.446779"
         y="105.52931"><tspan
           style="font-style:italic;font-variant:normal;font-weight:normal;font-stretch:normal;font-size:3.52778px;font-family:Carlito;-inkscape-font-specification:'Carlito Italic';fill:#d40055;stroke-width:0.00018522;stroke-miterlimit:4;stroke-dasharray:0.00018522, 0.00018522;stroke-dashoffset:0">obsolescence. Un LifePhone qui dure 50 ans c'est plein de </tspan></tspan><tspan
         x="18.446779"
         y="109.93904"><tspan
           style="font-style:italic;font-variant:normal;font-weight:normal;font-stretch:normal;font-size:3.52778px;font-family:Carlito;-inkscape-font-specification:'Carlito Italic';fill:#d40055;stroke-width:0.00018522;stroke-miterlimit:4;stroke-dasharray:0.00018522, 0.00018522;stroke-dashoffset:0">ressources économisées.</tspan></tspan></text>
    <text
       xml:space="preserve"
       style="font-size:3.52778px;line-height:1.25;font-family:Carlito;-inkscape-font-specification:'Carlito, Normal';letter-spacing:0px;word-spacing:0px;white-space:pre;inline-size:27.2599;stroke-width:0.00018522;stroke-miterlimit:4;stroke-dasharray:0.00018522, 0.00018522;stroke-dashoffset:0"
       x="18.446779"
       y="92.30014"
       id="text92-3"
       transform="translate(-6.8988373,-2.5124502)"><tspan
         x="18.446779"
         y="92.30014"><tspan
           style="font-style:italic;font-variant:normal;font-weight:normal;font-stretch:normal;font-size:3.52778px;font-family:Carlito;-inkscape-font-specification:'Carlito Italic';fill:#d40055;stroke-width:0.00018522;stroke-miterlimit:4;stroke-dasharray:0.00018522, 0.00018522;stroke-dashoffset:0">♥</tspan><tspan
           style="font-style:italic;font-variant:normal;font-weight:normal;font-stretch:normal;font-size:3.52778px;font-family:Carlito;-inkscape-font-specification:'Carlito Italic';fill:#d40055;stroke-width:0.00018522;stroke-miterlimit:4;stroke-dasharray:0.00018522, 0.00018522;stroke-dashoffset:0"> Les applications </tspan></tspan><tspan
         x="18.446779"
         y="96.709862"><tspan
           style="font-style:italic;font-variant:normal;font-weight:normal;font-stretch:normal;font-size:3.52778px;font-family:Carlito;-inkscape-font-specification:'Carlito Italic';fill:#d40055;stroke-width:0.00018522;stroke-miterlimit:4;stroke-dasharray:0.00018522, 0.00018522;stroke-dashoffset:0">libres peuvent être </tspan></tspan><tspan
         x="18.446779"
         y="101.11958"><tspan
           style="font-style:italic;font-variant:normal;font-weight:normal;font-stretch:normal;font-size:3.52778px;font-family:Carlito;-inkscape-font-specification:'Carlito Italic';fill:#d40055;stroke-width:0.00018522;stroke-miterlimit:4;stroke-dasharray:0.00018522, 0.00018522;stroke-dashoffset:0">débarassées des </tspan></tspan><tspan
         x="18.446779"
         y="105.52931"><tspan
           style="font-style:italic;font-variant:normal;font-weight:normal;font-stretch:normal;font-size:3.52778px;font-family:Carlito;-inkscape-font-specification:'Carlito Italic';fill:#d40055;stroke-width:0.00018522;stroke-miterlimit:4;stroke-dasharray:0.00018522, 0.00018522;stroke-dashoffset:0">pisteurs </tspan><tspan
           style="font-style:italic;font-variant:normal;font-weight:normal;font-stretch:normal;font-size:3.52778px;font-family:Carlito;-inkscape-font-specification:'Carlito Italic';fill:#d40055;stroke-width:0.00018522;stroke-miterlimit:4;stroke-dasharray:0.00018522, 0.00018522;stroke-dashoffset:0">de </tspan></tspan><tspan
         x="18.446779"
         y="109.93904"><tspan
           style="font-style:italic;font-variant:normal;font-weight:normal;font-stretch:normal;font-size:3.52778px;font-family:Carlito;-inkscape-font-specification:'Carlito Italic';fill:#d40055;stroke-width:0.00018522;stroke-miterlimit:4;stroke-dasharray:0.00018522, 0.00018522;stroke-dashoffset:0">données, ce qui </tspan></tspan><tspan
         x="18.446779"
         y="114.34877"><tspan
           style="font-style:italic;font-variant:normal;font-weight:normal;font-stretch:normal;font-size:3.52778px;font-family:Carlito;-inkscape-font-specification:'Carlito Italic';fill:#d40055;stroke-width:0.00018522;stroke-miterlimit:4;stroke-dasharray:0.00018522, 0.00018522;stroke-dashoffset:0">protège la vie </tspan></tspan><tspan
         x="18.446779"
         y="118.7585"><tspan
           style="font-style:italic;font-variant:normal;font-weight:normal;font-stretch:normal;font-size:3.52778px;font-family:Carlito;-inkscape-font-specification:'Carlito Italic';fill:#d40055;stroke-width:0.00018522;stroke-miterlimit:4;stroke-dasharray:0.00018522, 0.00018522;stroke-dashoffset:0">privée et lutte </tspan></tspan><tspan
         x="18.446779"
         y="123.16823"><tspan
           style="font-style:italic;font-variant:normal;font-weight:normal;font-stretch:normal;font-size:3.52778px;font-family:Carlito;-inkscape-font-specification:'Carlito Italic';fill:#d40055;stroke-width:0.00018522;stroke-miterlimit:4;stroke-dasharray:0.00018522, 0.00018522;stroke-dashoffset:0">contre la pub.</tspan></tspan></text>
    <text
       xml:space="preserve"
       style="font-size:3.52778px;line-height:1.25;font-family:Carlito;-inkscape-font-specification:'Carlito, Normal';letter-spacing:0px;word-spacing:0px;white-space:pre;inline-size:58.5193;stroke-width:0.00018522;stroke-miterlimit:4;stroke-dasharray:0.00018522, 0.00018522;stroke-dashoffset:0"
       x="18.446779"
       y="92.30014"
       id="text92-7-6"
       transform="translate(19.629963,153.35292)" />
    <text
       xml:space="preserve"
       style="font-size:3.52778px;line-height:1.25;font-family:Carlito;-inkscape-font-specification:'Carlito, Normal';letter-spacing:0px;word-spacing:0px;white-space:pre;inline-size:19.0023;stroke-width:0.00018522;stroke-miterlimit:4;stroke-dasharray:0.00018522, 0.00018522;stroke-dashoffset:0"
       x="38.42152"
       y="138.57492"
       id="text106-3-3"
       transform="translate(76.778219,-44.892978)"><tspan
         x="38.42152"
         y="138.57492"><tspan
           style="font-style:italic;font-variant:normal;font-weight:normal;font-stretch:normal;font-size:3.52778px;font-family:Carlito;-inkscape-font-specification:'Carlito Italic';fill:#501644;stroke-width:0.00018522;stroke-miterlimit:4;stroke-dasharray:0.00018522, 0.00018522;stroke-dashoffset:0">♠</tspan><tspan
           style="font-style:italic;font-variant:normal;font-weight:normal;font-stretch:normal;font-size:3.52778px;font-family:Carlito;-inkscape-font-specification:'Carlito Italic';fill:#501644;stroke-width:0.00018522;stroke-miterlimit:4;stroke-dasharray:0.00018522, 0.00018522;stroke-dashoffset:0"> Le </tspan></tspan><tspan
         x="38.42152"
         y="142.98465"><tspan
           style="font-style:italic;font-variant:normal;font-weight:normal;font-stretch:normal;font-size:3.52778px;font-family:Carlito;-inkscape-font-specification:'Carlito Italic';fill:#501644;stroke-width:0.00018522;stroke-miterlimit:4;stroke-dasharray:0.00018522, 0.00018522;stroke-dashoffset:0">LifePhone a </tspan></tspan><tspan
         x="38.42152"
         y="147.39438"><tspan
           style="font-style:italic;font-variant:normal;font-weight:normal;font-stretch:normal;font-size:3.52778px;font-family:Carlito;-inkscape-font-specification:'Carlito Italic';fill:#501644;stroke-width:0.00018522;stroke-miterlimit:4;stroke-dasharray:0.00018522, 0.00018522;stroke-dashoffset:0">des </tspan></tspan><tspan
         x="38.42152"
         y="151.80411"><tspan
           style="font-style:italic;font-variant:normal;font-weight:normal;font-stretch:normal;font-size:3.52778px;font-family:Carlito;-inkscape-font-specification:'Carlito Italic';fill:#501644;stroke-width:0.00018522;stroke-miterlimit:4;stroke-dasharray:0.00018522, 0.00018522;stroke-dashoffset:0">composants </tspan></tspan><tspan
         x="38.42152"
         y="156.21384"><tspan
           style="font-style:italic;font-variant:normal;font-weight:normal;font-stretch:normal;font-size:3.52778px;font-family:Carlito;-inkscape-font-specification:'Carlito Italic';fill:#501644;stroke-width:0.00018522;stroke-miterlimit:4;stroke-dasharray:0.00018522, 0.00018522;stroke-dashoffset:0">peu </tspan></tspan><tspan
         x="38.42152"
         y="160.62357"><tspan
           style="font-style:italic;font-variant:normal;font-weight:normal;font-stretch:normal;font-size:3.52778px;font-family:Carlito;-inkscape-font-specification:'Carlito Italic';fill:#501644;stroke-width:0.00018522;stroke-miterlimit:4;stroke-dasharray:0.00018522, 0.00018522;stroke-dashoffset:0">performants </tspan></tspan><tspan
         x="38.42152"
         y="165.03329"><tspan
           style="font-style:italic;font-variant:normal;font-weight:normal;font-stretch:normal;font-size:3.52778px;font-family:Carlito;-inkscape-font-specification:'Carlito Italic';fill:#501644;stroke-width:0.00018522;stroke-miterlimit:4;stroke-dasharray:0.00018522, 0.00018522;stroke-dashoffset:0">(résolution </tspan></tspan><tspan
         x="38.42152"
         y="169.44302"><tspan
           style="font-style:italic;font-variant:normal;font-weight:normal;font-stretch:normal;font-size:3.52778px;font-family:Carlito;-inkscape-font-specification:'Carlito Italic';fill:#501644;stroke-width:0.00018522;stroke-miterlimit:4;stroke-dasharray:0.00018522, 0.00018522;stroke-dashoffset:0">de l'écran ou </tspan></tspan><tspan
         x="38.42152"
         y="173.85275"><tspan
           style="font-style:italic;font-variant:normal;font-weight:normal;font-stretch:normal;font-size:3.52778px;font-family:Carlito;-inkscape-font-specification:'Carlito Italic';fill:#501644;stroke-width:0.00018522;stroke-miterlimit:4;stroke-dasharray:0.00018522, 0.00018522;stroke-dashoffset:0">de l'appareil </tspan></tspan><tspan
         x="38.42152"
         y="178.26248"><tspan
           style="font-style:italic;font-variant:normal;font-weight:normal;font-stretch:normal;font-size:3.52778px;font-family:Carlito;-inkscape-font-specification:'Carlito Italic';fill:#501644;stroke-width:0.00018522;stroke-miterlimit:4;stroke-dasharray:0.00018522, 0.00018522;stroke-dashoffset:0">photo par </tspan></tspan><tspan
         x="38.42152"
         y="182.67221"><tspan
           style="font-style:italic;font-variant:normal;font-weight:normal;font-stretch:normal;font-size:3.52778px;font-family:Carlito;-inkscape-font-specification:'Carlito Italic';fill:#501644;stroke-width:0.00018522;stroke-miterlimit:4;stroke-dasharray:0.00018522, 0.00018522;stroke-dashoffset:0">exemple).</tspan></tspan></text>
    <text
       xml:space="preserve"
       style="font-size:7.05556px;line-height:1.25;font-family:Carlito;-inkscape-font-specification:'Carlito, Normal';letter-spacing:0px;word-spacing:0px;stroke-width:0.00018522;stroke-miterlimit:4;stroke-dasharray:0.00018522, 0.00018522;stroke-dashoffset:0"
       x="126.78017"
       y="221.14368"
       id="text98-9-6"><tspan
         sodipodi:role="line"
         id="tspan96-3-7"
         x="126.78017"
         y="221.14368"
         style="font-size:7.05556px;fill:#501644;stroke-width:0.00018522;stroke-miterlimit:4;stroke-dasharray:0.00018522, 0.00018522;stroke-dashoffset:0">Ça pique  ♤  ♤  ♤  ♤</tspan></text>
    <text
       xml:space="preserve"
       style="font-size:7.05556px;line-height:1.25;font-family:Carlito;-inkscape-font-specification:'Carlito, Normal';letter-spacing:0px;word-spacing:0px;stroke-width:0.00018522;stroke-miterlimit:4;stroke-dasharray:0.00018522, 0.00018522;stroke-dashoffset:0"
       x="126.67451"
       y="213.51477"
       id="text86-1-5"><tspan
         sodipodi:role="line"
         id="tspan84-9-3"
         x="126.67451"
         y="213.51477"
         style="font-size:7.05556px;fill:#d40055;stroke-width:0.00018522;stroke-miterlimit:4;stroke-dasharray:0.00018522, 0.00018522;stroke-dashoffset:0">J'aime   ♡  ♡  ♡  ♡</tspan></text>
    <text
       xml:space="preserve"
       style="font-size:4.23333px;line-height:1.25;font-family:Carlito;-inkscape-font-specification:'Carlito, Normal';letter-spacing:0px;word-spacing:0px;white-space:pre;inline-size:84.6116;stroke-width:0.00018522;stroke-miterlimit:4;stroke-dasharray:0.00018522, 0.00018522;stroke-dashoffset:0"
       x="18.418589"
       y="31.895514"
       id="text76-5"
       transform="translate(96.9698,-18.481471)"><tspan
         x="18.418589"
         y="31.895514"><tspan
           style="font-style:normal;font-variant:normal;font-weight:bold;font-stretch:normal;font-family:Carlito;-inkscape-font-specification:'Carlito Bold';fill:#453748;stroke-width:0.00018522;stroke-miterlimit:4;stroke-dasharray:0.00018522, 0.00018522;stroke-dashoffset:0">Le LifePhone est conçu de façon à être le plus </tspan></tspan><tspan
         x="18.418589"
         y="37.187173"><tspan
           style="font-style:normal;font-variant:normal;font-weight:bold;font-stretch:normal;font-family:Carlito;-inkscape-font-specification:'Carlito Bold';fill:#453748;stroke-width:0.00018522;stroke-miterlimit:4;stroke-dasharray:0.00018522, 0.00018522;stroke-dashoffset:0">facilement réparable possible. Ses composants </tspan></tspan><tspan
         x="18.418589"
         y="42.478837"><tspan
           style="font-style:normal;font-variant:normal;font-weight:bold;font-stretch:normal;font-family:Carlito;-inkscape-font-specification:'Carlito Bold';fill:#453748;stroke-width:0.00018522;stroke-miterlimit:4;stroke-dasharray:0.00018522, 0.00018522;stroke-dashoffset:0">sont </tspan><tspan
           style="font-style:normal;font-variant:normal;font-weight:bold;font-stretch:normal;font-family:Carlito;-inkscape-font-specification:'Carlito Bold';fill:#453748;stroke-width:0.00018522;stroke-miterlimit:4;stroke-dasharray:0.00018522, 0.00018522;stroke-dashoffset:0">en nombre limité (un seul micro, un seul </tspan></tspan><tspan
         x="18.418589"
         y="47.770501"><tspan
           style="font-style:normal;font-variant:normal;font-weight:bold;font-stretch:normal;font-family:Carlito;-inkscape-font-specification:'Carlito Bold';fill:#453748;stroke-width:0.00018522;stroke-miterlimit:4;stroke-dasharray:0.00018522, 0.00018522;stroke-dashoffset:0">appareil </tspan><tspan
           style="font-style:normal;font-variant:normal;font-weight:bold;font-stretch:normal;font-family:Carlito;-inkscape-font-specification:'Carlito Bold';fill:#453748;stroke-width:0.00018522;stroke-miterlimit:4;stroke-dasharray:0.00018522, 0.00018522;stroke-dashoffset:0">photo...), ils sont modulaires, assez </tspan></tspan><tspan
         x="18.418589"
         y="53.062165"><tspan
           style="font-style:normal;font-variant:normal;font-weight:bold;font-stretch:normal;font-family:Carlito;-inkscape-font-specification:'Carlito Bold';fill:#453748;stroke-width:0.00018522;stroke-miterlimit:4;stroke-dasharray:0.00018522, 0.00018522;stroke-dashoffset:0">faiblement </tspan><tspan
           style="font-style:normal;font-variant:normal;font-weight:bold;font-stretch:normal;font-family:Carlito;-inkscape-font-specification:'Carlito Bold';fill:#453748;stroke-width:0.00018522;stroke-miterlimit:4;stroke-dasharray:0.00018522, 0.00018522;stroke-dashoffset:0">miniaturisés, et faciles d'accès.
</tspan></tspan><tspan
         x="18.418589"
         y="58.353829"><tspan
           style="font-style:normal;font-variant:normal;font-weight:bold;font-stretch:normal;font-family:Carlito;-inkscape-font-specification:'Carlito Bold';fill:#453748;stroke-width:0.00018522;stroke-miterlimit:4;stroke-dasharray:0.00018522, 0.00018522;stroke-dashoffset:0">Les composants sont choisis pour leur </tspan></tspan><tspan
         x="18.418589"
         y="63.645494"><tspan
           style="font-style:normal;font-variant:normal;font-weight:bold;font-stretch:normal;font-family:Carlito;-inkscape-font-specification:'Carlito Bold';fill:#453748;stroke-width:0.00018522;stroke-miterlimit:4;stroke-dasharray:0.00018522, 0.00018522;stroke-dashoffset:0">robustesse </tspan><tspan
           style="font-style:normal;font-variant:normal;font-weight:bold;font-stretch:normal;font-family:Carlito;-inkscape-font-specification:'Carlito Bold';fill:#453748;stroke-width:0.00018522;stroke-miterlimit:4;stroke-dasharray:0.00018522, 0.00018522;stroke-dashoffset:0">plus que pour leur performance. Ce </tspan></tspan><tspan
         x="18.418589"
         y="68.937158"><tspan
           style="font-style:normal;font-variant:normal;font-weight:bold;font-stretch:normal;font-family:Carlito;-inkscape-font-specification:'Carlito Bold';fill:#453748;stroke-width:0.00018522;stroke-miterlimit:4;stroke-dasharray:0.00018522, 0.00018522;stroke-dashoffset:0">sont donc des </tspan><tspan
           style="font-style:normal;font-variant:normal;font-weight:bold;font-stretch:normal;font-family:Carlito;-inkscape-font-specification:'Carlito Bold';fill:#453748;stroke-width:0.00018522;stroke-miterlimit:4;stroke-dasharray:0.00018522, 0.00018522;stroke-dashoffset:0">technologies anciennes, bien </tspan></tspan><tspan
         x="18.418589"
         y="74.228822"><tspan
           style="font-style:normal;font-variant:normal;font-weight:bold;font-stretch:normal;font-family:Carlito;-inkscape-font-specification:'Carlito Bold';fill:#453748;stroke-width:0.00018522;stroke-miterlimit:4;stroke-dasharray:0.00018522, 0.00018522;stroke-dashoffset:0">éprouvées qui sont </tspan><tspan
           style="font-style:normal;font-variant:normal;font-weight:bold;font-stretch:normal;font-family:Carlito;-inkscape-font-specification:'Carlito Bold';fill:#453748;stroke-width:0.00018522;stroke-miterlimit:4;stroke-dasharray:0.00018522, 0.00018522;stroke-dashoffset:0">privilégiées.</tspan></tspan></text>
    <text
       xml:space="preserve"
       style="font-size:3.52778px;line-height:1.25;font-family:Carlito;-inkscape-font-specification:'Carlito, Normal';letter-spacing:0px;word-spacing:0px;white-space:pre;inline-size:63.5666;stroke-width:0.00018522;stroke-miterlimit:4;stroke-dasharray:0.00018522, 0.00018522;stroke-dashoffset:0"
       x="18.446779"
       y="92.30014"
       id="text92-6"
       transform="translate(118.10781,-12.642653)"><tspan
         x="18.446779"
         y="92.30014"><tspan
           style="font-style:italic;font-variant:normal;font-weight:normal;font-stretch:normal;font-size:3.52778px;font-family:Carlito;-inkscape-font-specification:'Carlito Italic';fill:#d40055;stroke-width:0.00018522;stroke-miterlimit:4;stroke-dasharray:0.00018522, 0.00018522;stroke-dashoffset:0">♥</tspan><tspan
           style="font-style:italic;font-variant:normal;font-weight:normal;font-stretch:normal;font-size:3.52778px;font-family:Carlito;-inkscape-font-specification:'Carlito Italic';fill:#d40055;stroke-width:0.00018522;stroke-miterlimit:4;stroke-dasharray:0.00018522, 0.00018522;stroke-dashoffset:0"> Un téléphone réparable c'est la possibilité </tspan></tspan><tspan
         x="18.446779"
         y="96.709862"><tspan
           style="font-style:italic;font-variant:normal;font-weight:normal;font-stretch:normal;font-size:3.52778px;font-family:Carlito;-inkscape-font-specification:'Carlito Italic';fill:#d40055;stroke-width:0.00018522;stroke-miterlimit:4;stroke-dasharray:0.00018522, 0.00018522;stroke-dashoffset:0">d'économiser des </tspan><tspan
           style="font-style:italic;font-variant:normal;font-weight:normal;font-stretch:normal;font-size:3.52778px;font-family:Carlito;-inkscape-font-specification:'Carlito Italic';fill:#d40055;stroke-width:0.00018522;stroke-miterlimit:4;stroke-dasharray:0.00018522, 0.00018522;stroke-dashoffset:0">métaux dont l'extraction </tspan></tspan><tspan
         x="18.446779"
         y="101.11958"><tspan
           style="font-style:italic;font-variant:normal;font-weight:normal;font-stretch:normal;font-size:3.52778px;font-family:Carlito;-inkscape-font-specification:'Carlito Italic';fill:#d40055;stroke-width:0.00018522;stroke-miterlimit:4;stroke-dasharray:0.00018522, 0.00018522;stroke-dashoffset:0">est coûteuse pour l'environnement.</tspan></tspan></text>
    <text
       xml:space="preserve"
       style="font-size:7.05556px;line-height:1.25;font-family:Carlito;-inkscape-font-specification:'Carlito, Normal';letter-spacing:0px;word-spacing:0px;stroke-width:0.00018522;stroke-miterlimit:4;stroke-dasharray:0.00018522, 0.00018522;stroke-dashoffset:0"
       x="124.23127"
       y="73.14109"
       id="text98-2"><tspan
         sodipodi:role="line"
         id="tspan142-9"
         x="124.23127"
         y="73.14109"
         style="font-size:7.05556px;fill:#501644;stroke-width:0.00018522;stroke-miterlimit:4;stroke-dasharray:0.00018522, 0.00018522;stroke-dashoffset:0">Ça pique  ♤  ♤  ♤  ♤</tspan></text>
    <text
       xml:space="preserve"
       style="font-size:3.52778px;line-height:1.25;font-family:Carlito;-inkscape-font-specification:'Carlito, Normal';letter-spacing:0px;word-spacing:0px;white-space:pre;inline-size:88.0622;stroke-width:0.00018522;stroke-miterlimit:4;stroke-dasharray:0.00018522, 0.00018522;stroke-dashoffset:0"
       x="38.42152"
       y="138.57492"
       id="text106-1"
       transform="translate(96.31448,-0.76305963)"><tspan
         x="38.42152"
         y="138.57492"><tspan
           style="font-style:italic;font-variant:normal;font-weight:normal;font-stretch:normal;font-size:3.52778px;font-family:Carlito;-inkscape-font-specification:'Carlito Italic';fill:#501644;stroke-width:0.00018522;stroke-miterlimit:4;stroke-dasharray:0.00018522, 0.00018522;stroke-dashoffset:0">♠</tspan><tspan
           style="font-style:italic;font-variant:normal;font-weight:normal;font-stretch:normal;font-size:3.52778px;font-family:Carlito;-inkscape-font-specification:'Carlito Italic';fill:#501644;stroke-width:0.00018522;stroke-miterlimit:4;stroke-dasharray:0.00018522, 0.00018522;stroke-dashoffset:0"> Le LifePhone est assez gros et un peu lourd.</tspan></tspan></text>
    <text
       xml:space="preserve"
       style="font-size:4.23333px;line-height:1.25;font-family:Carlito;-inkscape-font-specification:'Carlito, Normal';letter-spacing:0px;word-spacing:0px;white-space:pre;inline-size:84.7893;stroke-width:0.00018522;stroke-miterlimit:4;stroke-dasharray:0.00018522, 0.00018522;stroke-dashoffset:0"
       x="18.418589"
       y="31.895514"
       id="text76-3-2"
       transform="translate(96.792121,129.55482)"><tspan
         x="18.418589"
         y="31.895514"><tspan
           style="font-style:normal;font-variant:normal;font-weight:bold;font-stretch:normal;font-family:Carlito;-inkscape-font-specification:'Carlito Bold';fill:#453748;stroke-width:0.00018522;stroke-miterlimit:4;stroke-dasharray:0.00018522, 0.00018522;stroke-dashoffset:0">Le LifePhone dispose d'une coque résistante aux </tspan></tspan><tspan
         x="18.418589"
         y="37.187173"><tspan
           style="font-style:normal;font-variant:normal;font-weight:bold;font-stretch:normal;font-family:Carlito;-inkscape-font-specification:'Carlito Bold';fill:#453748;stroke-width:0.00018522;stroke-miterlimit:4;stroke-dasharray:0.00018522, 0.00018522;stroke-dashoffset:0">chocs, aux chutes, à la chaleur et à l'eau. Elle est </tspan></tspan><tspan
         x="18.418589"
         y="42.478837"><tspan
           style="font-style:normal;font-variant:normal;font-weight:bold;font-stretch:normal;font-family:Carlito;-inkscape-font-specification:'Carlito Bold';fill:#453748;stroke-width:0.00018522;stroke-miterlimit:4;stroke-dasharray:0.00018522, 0.00018522;stroke-dashoffset:0">obligatoire pour allumer le téléphone, mais elle </tspan></tspan><tspan
         x="18.418589"
         y="47.770501"><tspan
           style="font-style:normal;font-variant:normal;font-weight:bold;font-stretch:normal;font-family:Carlito;-inkscape-font-specification:'Carlito Bold';fill:#453748;stroke-width:0.00018522;stroke-miterlimit:4;stroke-dasharray:0.00018522, 0.00018522;stroke-dashoffset:0">peut être changée comme tous les autres </tspan></tspan><tspan
         x="18.418589"
         y="53.062165"><tspan
           style="font-style:normal;font-variant:normal;font-weight:bold;font-stretch:normal;font-family:Carlito;-inkscape-font-specification:'Carlito Bold';fill:#453748;stroke-width:0.00018522;stroke-miterlimit:4;stroke-dasharray:0.00018522, 0.00018522;stroke-dashoffset:0">composants, bien entendu.
</tspan></tspan><tspan
         x="18.418589"
         y="58.353829"><tspan
           style="font-style:normal;font-variant:normal;font-weight:bold;font-stretch:normal;font-family:Carlito;-inkscape-font-specification:'Carlito Bold';fill:#453748;stroke-width:0.00018522;stroke-miterlimit:4;stroke-dasharray:0.00018522, 0.00018522;stroke-dashoffset:0">Elle est fabriquée à 100% à partir de matière </tspan></tspan><tspan
         x="18.418589"
         y="63.645494"><tspan
           style="font-style:normal;font-variant:normal;font-weight:bold;font-stretch:normal;font-family:Carlito;-inkscape-font-specification:'Carlito Bold';fill:#453748;stroke-width:0.00018522;stroke-miterlimit:4;stroke-dasharray:0.00018522, 0.00018522;stroke-dashoffset:0">végétale, et quand elle est trop abîmée, </tspan></tspan><tspan
         x="18.418589"
         y="68.937158"><tspan
           style="font-style:normal;font-variant:normal;font-weight:bold;font-stretch:normal;font-family:Carlito;-inkscape-font-specification:'Carlito Bold';fill:#453748;stroke-width:0.00018522;stroke-miterlimit:4;stroke-dasharray:0.00018522, 0.00018522;stroke-dashoffset:0">lorsqu'elle </tspan><tspan
           style="font-style:normal;font-variant:normal;font-weight:bold;font-stretch:normal;font-family:Carlito;-inkscape-font-specification:'Carlito Bold';fill:#453748;stroke-width:0.00018522;stroke-miterlimit:4;stroke-dasharray:0.00018522, 0.00018522;stroke-dashoffset:0">n'est plus étanche par exemple, elle </tspan></tspan><tspan
         x="18.418589"
         y="74.228822"><tspan
           style="font-style:normal;font-variant:normal;font-weight:bold;font-stretch:normal;font-family:Carlito;-inkscape-font-specification:'Carlito Bold';fill:#453748;stroke-width:0.00018522;stroke-miterlimit:4;stroke-dasharray:0.00018522, 0.00018522;stroke-dashoffset:0">peut être </tspan><tspan
           style="font-style:normal;font-variant:normal;font-weight:bold;font-stretch:normal;font-family:Carlito;-inkscape-font-specification:'Carlito Bold';fill:#453748;stroke-width:0.00018522;stroke-miterlimit:4;stroke-dasharray:0.00018522, 0.00018522;stroke-dashoffset:0">compostée.</tspan></tspan></text>
    <text
       xml:space="preserve"
       style="font-size:7.05556px;line-height:1.25;font-family:Carlito;-inkscape-font-specification:'Carlito, Normal';letter-spacing:0px;word-spacing:0px;stroke-width:0.00018522;stroke-miterlimit:4;stroke-dasharray:0.00018522, 0.00018522;stroke-dashoffset:0"
       x="124.1256"
       y="65.512192"
       id="text86-7"><tspan
         sodipodi:role="line"
         id="tspan259-0"
         x="124.1256"
         y="65.512192"
         style="font-size:7.05556px;fill:#d40055;stroke-width:0.00018522;stroke-miterlimit:4;stroke-dasharray:0.00018522, 0.00018522;stroke-dashoffset:0">J'aime   ♡  ♡  ♡  ♡</tspan></text>
    <rect
       style="fill:#ffdcc4;fill-opacity:0.224407;stroke:#e44d26;stroke-width:1.04485;stroke-miterlimit:4;stroke-dasharray:1.04485, 1.04485;stroke-dashoffset:0;stroke-opacity:0.863948"
       id="rect1282-9"
       width="64.113327"
       height="40.329708"
       x="135.88667"
       y="91.772446" />
    <rect
       style="fill:#ffdcc4;fill-opacity:0.224407;stroke:#e44d26;stroke-width:0.89792;stroke-miterlimit:4;stroke-dasharray:0.89792, 0.89792;stroke-dashoffset:0;stroke-opacity:0.863948"
       id="rect1282-3-3"
       width="42.049397"
       height="45.413074"
       x="138.42717"
       y="241.13" />
    <text
       xml:space="preserve"
       style="font-size:3.52778px;line-height:1.25;font-family:Carlito;-inkscape-font-specification:'Carlito, Normal';letter-spacing:0px;word-spacing:0px;white-space:pre;inline-size:22.7729;stroke-width:0.00018522;stroke-miterlimit:4;stroke-dasharray:0.00018522, 0.00018522;stroke-dashoffset:0"
       x="38.42152"
       y="138.57492"
       id="text106-3-6-6"
       transform="translate(76.660747,121.81023)"><tspan
         x="38.42152"
         y="138.57492"><tspan
           style="font-style:italic;font-variant:normal;font-weight:normal;font-stretch:normal;font-size:3.52778px;font-family:Carlito;-inkscape-font-specification:'Carlito Italic';fill:#501644;stroke-width:0.00018522;stroke-miterlimit:4;stroke-dasharray:0.00018522, 0.00018522;stroke-dashoffset:0">♠</tspan><tspan
           style="font-style:italic;font-variant:normal;font-weight:normal;font-stretch:normal;font-size:3.52778px;font-family:Carlito;-inkscape-font-specification:'Carlito Italic';fill:#501644;stroke-width:0.00018522;stroke-miterlimit:4;stroke-dasharray:0.00018522, 0.00018522;stroke-dashoffset:0"> Toutes les </tspan></tspan><tspan
         x="38.42152"
         y="142.98465"><tspan
           style="font-style:italic;font-variant:normal;font-weight:normal;font-stretch:normal;font-size:3.52778px;font-family:Carlito;-inkscape-font-specification:'Carlito Italic';fill:#501644;stroke-width:0.00018522;stroke-miterlimit:4;stroke-dasharray:0.00018522, 0.00018522;stroke-dashoffset:0">coques sont </tspan></tspan><tspan
         x="38.42152"
         y="147.39438"><tspan
           style="font-style:italic;font-variant:normal;font-weight:normal;font-stretch:normal;font-size:3.52778px;font-family:Carlito;-inkscape-font-specification:'Carlito Italic';fill:#501644;stroke-width:0.00018522;stroke-miterlimit:4;stroke-dasharray:0.00018522, 0.00018522;stroke-dashoffset:0">uniformément </tspan></tspan><tspan
         x="38.42152"
         y="151.80411"><tspan
           style="font-style:italic;font-variant:normal;font-weight:normal;font-stretch:normal;font-size:3.52778px;font-family:Carlito;-inkscape-font-specification:'Carlito Italic';fill:#501644;stroke-width:0.00018522;stroke-miterlimit:4;stroke-dasharray:0.00018522, 0.00018522;stroke-dashoffset:0">noires parce </tspan></tspan><tspan
         x="38.42152"
         y="156.21384"><tspan
           style="font-style:italic;font-variant:normal;font-weight:normal;font-stretch:normal;font-size:3.52778px;font-family:Carlito;-inkscape-font-specification:'Carlito Italic';fill:#501644;stroke-width:0.00018522;stroke-miterlimit:4;stroke-dasharray:0.00018522, 0.00018522;stroke-dashoffset:0">qu'aucun </tspan></tspan><tspan
         x="38.42152"
         y="160.62357"><tspan
           style="font-style:italic;font-variant:normal;font-weight:normal;font-stretch:normal;font-size:3.52778px;font-family:Carlito;-inkscape-font-specification:'Carlito Italic';fill:#501644;stroke-width:0.00018522;stroke-miterlimit:4;stroke-dasharray:0.00018522, 0.00018522;stroke-dashoffset:0">colorant n'est </tspan></tspan><tspan
         x="38.42152"
         y="165.03329"><tspan
           style="font-style:italic;font-variant:normal;font-weight:normal;font-stretch:normal;font-size:3.52778px;font-family:Carlito;-inkscape-font-specification:'Carlito Italic';fill:#501644;stroke-width:0.00018522;stroke-miterlimit:4;stroke-dasharray:0.00018522, 0.00018522;stroke-dashoffset:0">utilisé.</tspan></tspan></text>
    <text
       xml:space="preserve"
       style="font-size:3.52778px;line-height:1.25;font-family:Carlito;-inkscape-font-specification:'Carlito, Normal';letter-spacing:0px;word-spacing:0px;white-space:pre;inline-size:79.2977;stroke-width:0.00018522;stroke-miterlimit:4;stroke-dasharray:0.00018522, 0.00018522;stroke-dashoffset:0"
       x="18.446779"
       y="92.30014"
       id="text92-7-0"
       transform="translate(104.7413,136.14053)"><tspan
         x="18.446779"
         y="92.30014"><tspan
           style="font-style:italic;font-variant:normal;font-weight:normal;font-stretch:normal;font-size:3.52778px;font-family:Carlito;-inkscape-font-specification:'Carlito Italic';fill:#d40055;stroke-width:0.00018522;stroke-miterlimit:4;stroke-dasharray:0.00018522, 0.00018522;stroke-dashoffset:0">♥</tspan><tspan
           style="font-style:italic;font-variant:normal;font-weight:normal;font-stretch:normal;font-size:3.52778px;font-family:Carlito;-inkscape-font-specification:'Carlito Italic';fill:#d40055;stroke-width:0.00018522;stroke-miterlimit:4;stroke-dasharray:0.00018522, 0.00018522;stroke-dashoffset:0"> Protégé par sa coque le LifePhone est presque </tspan></tspan><tspan
         x="18.446779"
         y="96.709862"><tspan
           style="font-style:italic;font-variant:normal;font-weight:normal;font-stretch:normal;font-size:3.52778px;font-family:Carlito;-inkscape-font-specification:'Carlito Italic';fill:#d40055;stroke-width:0.00018522;stroke-miterlimit:4;stroke-dasharray:0.00018522, 0.00018522;stroke-dashoffset:0">incassable, ça </tspan><tspan
           style="font-style:italic;font-variant:normal;font-weight:normal;font-stretch:normal;font-size:3.52778px;font-family:Carlito;-inkscape-font-specification:'Carlito Italic';fill:#d40055;stroke-width:0.00018522;stroke-miterlimit:4;stroke-dasharray:0.00018522, 0.00018522;stroke-dashoffset:0">évite les mauvaises surprises et ça </tspan></tspan><tspan
         x="18.446779"
         y="101.11958"><tspan
           style="font-style:italic;font-variant:normal;font-weight:normal;font-stretch:normal;font-size:3.52778px;font-family:Carlito;-inkscape-font-specification:'Carlito Italic';fill:#d40055;stroke-width:0.00018522;stroke-miterlimit:4;stroke-dasharray:0.00018522, 0.00018522;stroke-dashoffset:0">augmente la durée de vie.</tspan></tspan></text>
    <text
       xml:space="preserve"
       style="font-size:3.52778px;line-height:1.25;font-family:Carlito;-inkscape-font-specification:'Carlito, Normal';letter-spacing:0px;word-spacing:0px;white-space:pre;inline-size:17.4148;stroke-width:0.00018522;stroke-miterlimit:4;stroke-dasharray:0.00018522, 0.00018522;stroke-dashoffset:0"
       x="38.42152"
       y="138.57492"
       id="text106-3-6-5"
       transform="translate(144.69226,121.20255)"><tspan
         x="38.42152"
         y="138.57492"><tspan
           style="font-style:italic;font-variant:normal;font-weight:normal;font-stretch:normal;font-size:3.52778px;font-family:Carlito;-inkscape-font-specification:'Carlito Italic';fill:#501644;stroke-width:0.00018522;stroke-miterlimit:4;stroke-dasharray:0.00018522, 0.00018522;stroke-dashoffset:0">♠</tspan><tspan
           style="font-style:italic;font-variant:normal;font-weight:normal;font-stretch:normal;font-size:3.52778px;font-family:Carlito;-inkscape-font-specification:'Carlito Italic';fill:#501644;stroke-width:0.00018522;stroke-miterlimit:4;stroke-dasharray:0.00018522, 0.00018522;stroke-dashoffset:0"> La coque </tspan></tspan><tspan
         x="38.42152"
         y="142.98465"><tspan
           style="font-style:italic;font-variant:normal;font-weight:normal;font-stretch:normal;font-size:3.52778px;font-family:Carlito;-inkscape-font-specification:'Carlito Italic';fill:#501644;stroke-width:0.00018522;stroke-miterlimit:4;stroke-dasharray:0.00018522, 0.00018522;stroke-dashoffset:0">est un </tspan></tspan><tspan
         x="38.42152"
         y="147.39438"><tspan
           style="font-style:italic;font-variant:normal;font-weight:normal;font-stretch:normal;font-size:3.52778px;font-family:Carlito;-inkscape-font-specification:'Carlito Italic';fill:#501644;stroke-width:0.00018522;stroke-miterlimit:4;stroke-dasharray:0.00018522, 0.00018522;stroke-dashoffset:0">composant </tspan></tspan><tspan
         x="38.42152"
         y="151.80411"><tspan
           style="font-style:italic;font-variant:normal;font-weight:normal;font-stretch:normal;font-size:3.52778px;font-family:Carlito;-inkscape-font-specification:'Carlito Italic';fill:#501644;stroke-width:0.00018522;stroke-miterlimit:4;stroke-dasharray:0.00018522, 0.00018522;stroke-dashoffset:0">assez </tspan><tspan
           style="font-style:italic;font-variant:normal;font-weight:normal;font-stretch:normal;font-size:3.52778px;font-family:Carlito;-inkscape-font-specification:'Carlito Italic';fill:#501644;stroke-width:0.00018522;stroke-miterlimit:4;stroke-dasharray:0.00018522, 0.00018522;stroke-dashoffset:0">cher </tspan></tspan><tspan
         x="38.42152"
         y="156.21384"><tspan
           style="font-style:italic;font-variant:normal;font-weight:normal;font-stretch:normal;font-size:3.52778px;font-family:Carlito;-inkscape-font-specification:'Carlito Italic';fill:#501644;stroke-width:0.00018522;stroke-miterlimit:4;stroke-dasharray:0.00018522, 0.00018522;stroke-dashoffset:0">par rapport </tspan></tspan><tspan
         x="38.42152"
         y="160.62357"><tspan
           style="font-style:italic;font-variant:normal;font-weight:normal;font-stretch:normal;font-size:3.52778px;font-family:Carlito;-inkscape-font-specification:'Carlito Italic';fill:#501644;stroke-width:0.00018522;stroke-miterlimit:4;stroke-dasharray:0.00018522, 0.00018522;stroke-dashoffset:0">au reste du </tspan></tspan><tspan
         x="38.42152"
         y="165.03329"><tspan
           style="font-style:italic;font-variant:normal;font-weight:normal;font-stretch:normal;font-size:3.52778px;font-family:Carlito;-inkscape-font-specification:'Carlito Italic';fill:#501644;stroke-width:0.00018522;stroke-miterlimit:4;stroke-dasharray:0.00018522, 0.00018522;stroke-dashoffset:0">LifePhone.</tspan></tspan></text>
  </g>
</svg>
