MariaDB [librecs]> SELECT * FROM v_anonymous_answers;
+----------+----------+----------------------------------+------------------------+--------------------------------------------------------------+--------+-----------------------------------------------------------+
| session  | exercice | MD5(participant_id)              | question_id            | question                                                     | answer | data                                                      |
+----------+----------+----------------------------------+------------------------+--------------------------------------------------------------+--------+-----------------------------------------------------------+
| aa23-18p | mod2     | 7694f4a66316e53c8cdd9d9954bd611d | FBtHlB1pmPd1GXhYrQVPre | Auto-évaluez votre degré de réussite au devoir               | 4      | {"st":"attempt","mi":0,"sc":1,"ma":1,"r":{"field":"4"}}   |
| aa23-18p | mod2     | 7694f4a66316e53c8cdd9d9954bd611d | YRHZCzwAHOjzFTRfl2mddf | Auto-évaluez votre rapidité au devoir                        | 4      | {"st":"attempt","mi":0,"sc":1,"ma":1,"r":{"field":"4"}}   |
| aa23-18p | mod2     | 7694f4a66316e53c8cdd9d9954bd611d | oZOjlmTvYGbl4WydLvYXYe | Auto-évaluez votre capacité à résoudre ce type de devoir     | 4      | {"st":"attempt","mi":0,"sc":1,"ma":1,"r":{"field":"4"}}   |
| aa23-18p | mod2     | 7694f4a66316e53c8cdd9d9954bd611d | V8Rpiqat0Ai8Ztgi4zvM0e | Combien de temps avez-vous passé                             | 300    | {"st":"attempt","mi":0,"sc":1,"ma":1,"r":{"field":"300"}} |
| aa23-18p | mod2     | 7694f4a66316e53c8cdd9d9954bd611d | gp682sh37kj7LJXhYTPkkh | Évaluez la difficulté générale du contenu de ce module       | 4      | {"st":"attempt","mi":0,"sc":1,"ma":1,"r":{"field":"4"}}   |
| aa23-18p | mod2     | 7694f4a66316e53c8cdd9d9954bd611d | PbumaXhnkMeRhZRQ6fmSpe | Évaluez l'intérêt général du contenu de ce module            | 4      | {"st":"attempt","mi":0,"sc":1,"ma":1,"r":{"field":"4"}}   |
| aa23-18p | mod2     | 03c7c0ace395d80182db07ae2c30f034 | FBtHlB1pmPd1GXhYrQVPre | Auto-évaluez votre degré de réussite au devoir               | NULL   | {"st":"attempt","mi":0,"sc":0,"ma":1}                     |
| aa23-18p | mod2     | 03c7c0ace395d80182db07ae2c30f034 | YRHZCzwAHOjzFTRfl2mddf | Auto-évaluez votre rapidité au devoir                        | NULL   | {"st":"attempt","mi":0,"sc":0,"ma":1}                     |
| aa23-18p | mod2     | 03c7c0ace395d80182db07ae2c30f034 | oZOjlmTvYGbl4WydLvYXYe | Auto-évaluez votre capacité à résoudre ce type de devoir     | NULL   | {"st":"attempt","mi":0,"sc":0,"ma":1}                     |
| aa23-18p | mod2     | 03c7c0ace395d80182db07ae2c30f034 | V8Rpiqat0Ai8Ztgi4zvM0e | Combien de temps avez-vous passé                             | NULL   | {"st":"attempt","mi":0,"sc":0,"ma":1}                     |
| aa23-18p | mod2     | 03c7c0ace395d80182db07ae2c30f034 | gp682sh37kj7LJXhYTPkkh | Évaluez la difficulté générale du contenu de ce module       | NULL   | {"st":"attempt","mi":0,"sc":0,"ma":1}                     |
| aa23-18p | mod2     | 03c7c0ace395d80182db07ae2c30f034 | PbumaXhnkMeRhZRQ6fmSpe | Évaluez l'intérêt général du contenu de ce module            | NULL   | {"st":"attempt","mi":0,"sc":0,"ma":1}                     |
| aa23-18p | mod2     | 9bf31c7ff062936a96d3c8bd1f8f2ff3 | FBtHlB1pmPd1GXhYrQVPre | Auto-évaluez votre degré de réussite au devoir               | NULL   | {"st":"attempt","mi":0,"sc":0,"ma":1}                     |
| aa23-18p | mod2     | 9bf31c7ff062936a96d3c8bd1f8f2ff3 | YRHZCzwAHOjzFTRfl2mddf | Auto-évaluez votre rapidité au devoir                        | NULL   | {"st":"attempt","mi":0,"sc":0,"ma":1}                     |
| aa23-18p | mod2     | 9bf31c7ff062936a96d3c8bd1f8f2ff3 | oZOjlmTvYGbl4WydLvYXYe | Auto-évaluez votre capacité à résoudre ce type de devoir     | NULL   | {"st":"attempt","mi":0,"sc":0,"ma":1}                     |
| aa23-18p | mod2     | 8e296a067a37563370ded05f5a3bf3ec | FBtHlB1pmPd1GXhYrQVPre | Auto-évaluez votre degré de réussite au devoir               | 3      | {"st":"attempt","mi":0,"sc":1,"ma":1,"r":{"field":"3"}}   |
| aa23-18p | mod2     | 8e296a067a37563370ded05f5a3bf3ec | YRHZCzwAHOjzFTRfl2mddf | Auto-évaluez votre rapidité au devoir                        | 3      | {"st":"attempt","mi":0,"sc":1,"ma":1,"r":{"field":"3"}}   |
| aa23-18p | mod2     | 8e296a067a37563370ded05f5a3bf3ec | oZOjlmTvYGbl4WydLvYXYe | Auto-évaluez votre capacité à résoudre ce type de devoir     | 3      | {"st":"attempt","mi":0,"sc":1,"ma":1,"r":{"field":"3"}}   |
| na18-18p | gen1     | c309f0daf5910cf7ac2038ce9520448a | V8Rpiqat0Ai8Ztgi4zvM0e | Combien de temps avez-vous passé                             | NULL   | {"st":"attempt","mi":0,"sc":0,"ma":1}                     |
| na18-18p | gen1     | c309f0daf5910cf7ac2038ce9520448a | gp682sh37kj7LJXhYTPkkh | Évaluez la difficulté générale du contenu de ce module       | NULL   | {"st":"attempt","mi":0,"sc":0,"ma":1}                     |
| na18-18p | gen1     | c309f0daf5910cf7ac2038ce9520448a | PbumaXhnkMeRhZRQ6fmSpe | Évaluez l'intérêt général du contenu de ce module            | NULL   | {"st":"attempt","mi":0,"sc":0,"ma":1}                     |
| na18-18p | gen1     | c309f0daf5910cf7ac2038ce9520448a | FBtHlB1pmPd1GXhYrQVPre | Auto-évaluez votre degré de réussite au devoir               | NULL   | {"st":"attempt","mi":0,"sc":0,"ma":1}                     |
| na18-18p | gen1     | c309f0daf5910cf7ac2038ce9520448a | YRHZCzwAHOjzFTRfl2mddf | Auto-évaluez votre rapidité au devoir                        | NULL   | {"st":"attempt","mi":0,"sc":0,"ma":1}                     |
| na18-18p | gen1     | c309f0daf5910cf7ac2038ce9520448a | oZOjlmTvYGbl4WydLvYXYe | Auto-évaluez votre capacité à résoudre ce type de devoir     | NULL   | {"st":"attempt","mi":0,"sc":0,"ma":1}                     |
| aa23-18p | mod2     | c74d97b01eae257e44aa9d5bade97baf | FBtHlB1pmPd1GXhYrQVPre | Auto-évaluez votre degré de réussite au devoir               | 3      | {"st":"attempt","mi":0,"sc":1,"ma":1,"r":{"field":"3"}}   |
| aa23-18p | mod2     | c74d97b01eae257e44aa9d5bade97baf | YRHZCzwAHOjzFTRfl2mddf | Auto-évaluez votre rapidité au devoir                        | 4      | {"st":"attempt","mi":0,"sc":1,"ma":1,"r":{"field":"4"}}   |
| aa23-18p | mod2     | c74d97b01eae257e44aa9d5bade97baf | oZOjlmTvYGbl4WydLvYXYe | Auto-évaluez votre capacité à résoudre ce type de devoir     | 3      | {"st":"attempt","mi":0,"sc":1,"ma":1,"r":{"field":"3"}}   |
| aa23-18p | mod2     | c74d97b01eae257e44aa9d5bade97baf | V8Rpiqat0Ai8Ztgi4zvM0e | Combien de temps avez-vous passé                             | 60     | {"st":"attempt","mi":0,"sc":1,"ma":1,"r":{"field":"60"}}  |
| aa23-18p | mod2     | c74d97b01eae257e44aa9d5bade97baf | gp682sh37kj7LJXhYTPkkh | Évaluez la difficulté générale du contenu de ce module       | 3      | {"st":"attempt","mi":0,"sc":1,"ma":1,"r":{"field":"3"}}   |
| aa23-18p | mod2     | c74d97b01eae257e44aa9d5bade97baf | PbumaXhnkMeRhZRQ6fmSpe | Évaluez l'intérêt général du contenu de ce module            | 4      | {"st":"attempt","mi":0,"sc":1,"ma":1,"r":{"field":"4"}}   |
| aa23-18p | mod4     | 8e296a067a37563370ded05f5a3bf3ec | FBtHlB1pmPd1GXhYrQVPre | Auto-évaluez votre degré de réussite au devoir               | NULL   | {"st":"attempt","mi":0,"sc":0,"ma":1}                     |
| aa23-18p | mod4     | 8e296a067a37563370ded05f5a3bf3ec | YRHZCzwAHOjzFTRfl2mddf | Auto-évaluez votre rapidité au devoir                        | NULL   | {"st":"attempt","mi":0,"sc":0,"ma":1}                     |
| aa23-18p | mod4     | 8e296a067a37563370ded05f5a3bf3ec | oZOjlmTvYGbl4WydLvYXYe | Auto-évaluez votre capacité à résoudre ce type de devoir     | NULL   | {"st":"attempt","mi":0,"sc":0,"ma":1}                     |
| aa23-18p | mod4     | 8e296a067a37563370ded05f5a3bf3ec | V8Rpiqat0Ai8Ztgi4zvM0e | Combien de temps avez-vous passé                             | NULL   | {"st":"attempt","mi":0,"sc":0,"ma":1}                     |
| aa23-18p | mod4     | 8e296a067a37563370ded05f5a3bf3ec | gp682sh37kj7LJXhYTPkkh | Évaluez la difficulté générale du contenu de ce module       | NULL   | {"st":"attempt","mi":0,"sc":0,"ma":1}                     |
| aa23-18p | mod4     | 8e296a067a37563370ded05f5a3bf3ec | PbumaXhnkMeRhZRQ6fmSpe | Évaluez l'intérêt général du contenu de ce module            | NULL   | {"st":"attempt","mi":0,"sc":0,"ma":1}                     |
| aa23-18p | mod2     | 8e296a067a37563370ded05f5a3bf3ec | V8Rpiqat0Ai8Ztgi4zvM0e | Combien de temps avez-vous passé                             | NULL   | {"st":"attempt","mi":0,"sc":0,"ma":1}                     |
| aa23-18p | mod2     | 8e296a067a37563370ded05f5a3bf3ec | gp682sh37kj7LJXhYTPkkh | Évaluez la difficulté générale du contenu de ce module       | NULL   | {"st":"attempt","mi":0,"sc":0,"ma":1}                     |
| aa23-18p | mod2     | 8e296a067a37563370ded05f5a3bf3ec | PbumaXhnkMeRhZRQ6fmSpe | Évaluez l'intérêt général du contenu de ce module            | NULL   | {"st":"attempt","mi":0,"sc":0,"ma":1}                     |
| aa23-18p | rel3     | c74d97b01eae257e44aa9d5bade97baf | FBtHlB1pmPd1GXhYrQVPre | Auto-évaluez votre degré de réussite au devoir               | 3      | {"st":"attempt","mi":0,"sc":1,"ma":1,"r":{"field":"3"}}   |
| aa23-18p | rel3     | c74d97b01eae257e44aa9d5bade97baf | YRHZCzwAHOjzFTRfl2mddf | Auto-évaluez votre rapidité au devoir                        | 4      | {"st":"attempt","mi":0,"sc":1,"ma":1,"r":{"field":"4"}}   |
| aa23-18p | rel3     | c74d97b01eae257e44aa9d5bade97baf | oZOjlmTvYGbl4WydLvYXYe | Auto-évaluez votre capacité à résoudre ce type de devoir     | 3      | {"st":"attempt","mi":0,"sc":1,"ma":1,"r":{"field":"3"}}   |
| aa23-18p | rel3     | c74d97b01eae257e44aa9d5bade97baf | V8Rpiqat0Ai8Ztgi4zvM0e | Combien de temps avez-vous passé                             | NULL   | {"st":"attempt","mi":0,"sc":0,"ma":1}                     |
| aa23-18p | rel3     | c74d97b01eae257e44aa9d5bade97baf | gp682sh37kj7LJXhYTPkkh | Évaluez la difficulté générale du contenu de ce module       | NULL   | {"st":"attempt","mi":0,"sc":0,"ma":1}                     |
| aa23-18p | rel3     | c74d97b01eae257e44aa9d5bade97baf | PbumaXhnkMeRhZRQ6fmSpe | Évaluez l'intérêt général du contenu de ce module            | NULL   | {"st":"attempt","mi":0,"sc":0,"ma":1}                     |
+----------+----------+----------------------------------+------------------------+--------------------------------------------------------------+--------+-----------------------------------------------------------+
