62.47.42.200 - - [07/Apr/2010:07:19:04 +0200] "GET /radio/index.html HTTP/1.0" 404 106 "-" "Mozilla/4.0 (compatible; MSIE 5.01; Windows NT 5.0)" 0
94.216.65.219 - - [07/Apr/2010:07:19:04 +0200] "GET /radio/index.html HTTP/1.0" 404 106 "-" "Mozilla/4.0 (compatible; MSIE 5.01; Windows NT 5.0)" 0
89.245.60.177 - - [07/Apr/2010:07:19:04 +0200] "GET /radio/index.html HTTP/1.0" 404 106 "-" "Mozilla/4.0 (compatible; MSIE 5.01; Windows NT 5.0)" 0
91.32.252.250 - - [07/Apr/2010:07:19:06 +0200] "GET /radio/index.html HTTP/1.0" 404 106 "-" "Mozilla/4.0 (compatible; MSIE 5.01; Windows NT 5.0)" 1
79.217.85.181 - - [07/Apr/2010:07:19:06 +0200] "GET /radio/index.html HTTP/1.0" 404 106 "-" "Mozilla/4.0 (compatible; MSIE 5.01; Windows NT 5.0)" 1
62.47.42.200 - - [07/Apr/2010:07:19:06 +0200] "GET /radio/index.html HTTP/1.0" 404 106 "-" "Mozilla/4.0 (compatible; MSIE 5.01; Windows NT 5.0)" 0
77.186.83.51 - - [07/Apr/2010:07:19:07 +0200] "GET /radio/index.html HTTP/1.0" 404 106 "-" "Mozilla/4.0 (compatible; MSIE 5.01; Windows NT 5.0)" 1
77.23.172.112 - - [07/Apr/2010:07:19:07 +0200] "GET /radio/index.html HTTP/1.0" 404 106 "-" "Mozilla/4.0 (compatible; MSIE 5.01; Windows NT 5.0)" 1
79.79.114.85 - - [07/Apr/2010:07:19:07 +0200] "GET /radio/index.html HTTP/1.0" 404 106 "-" "Mozilla/4.0 (compatible; MSIE 5.01; Windows NT 5.0)" 1
