<?xml version="1.0" encoding="UTF-8" standalone="no"?>
<svg
   xmlns:dc="http://purl.org/dc/elements/1.1/"
   xmlns:cc="http://creativecommons.org/ns#"
   xmlns:rdf="http://www.w3.org/1999/02/22-rdf-syntax-ns#"
   xmlns:svg="http://www.w3.org/2000/svg"
   xmlns="http://www.w3.org/2000/svg"
   xmlns:sodipodi="http://sodipodi.sourceforge.net/DTD/sodipodi-0.dtd"
   xmlns:inkscape="http://www.inkscape.org/namespaces/inkscape"
   viewBox="0 0 64 80"
   x="0px"
   y="0px"
   version="1.1"
   id="svg30"
   sodipodi:docname="git.svg"
   inkscape:version="0.92.3 (2405546, 2018-03-11)">
  <metadata
     id="metadata36">
    <rdf:RDF>
      <cc:Work
         rdf:about="">
        <dc:format>image/svg+xml</dc:format>
        <dc:type
           rdf:resource="http://purl.org/dc/dcmitype/StillImage" />
      </cc:Work>
    </rdf:RDF>
  </metadata>
  <defs
     id="defs34" />
  <sodipodi:namedview
     pagecolor="#ffffff"
     bordercolor="#666666"
     borderopacity="1"
     objecttolerance="10"
     gridtolerance="10"
     guidetolerance="10"
     inkscape:pageopacity="0"
     inkscape:pageshadow="2"
     inkscape:window-width="640"
     inkscape:window-height="480"
     id="namedview32"
     showgrid="false"
     inkscape:zoom="2.95"
     inkscape:cx="32"
     inkscape:cy="40"
     inkscape:window-x="0"
     inkscape:window-y="0"
     inkscape:window-maximized="0"
     inkscape:current-layer="svg30" />
  <g
     id="g24">
    <path
       d="M10,52H6v5a5.006,5.006,0,0,0,5,5H49a5.006,5.006,0,0,0,5-5V24h4V6H54V3a1,1,0,0,0-1-1H21a.994.994,0,0,0-.708.294l-10,10A.994.994,0,0,0,10,13ZM8,57V54H44v3a4.948,4.948,0,0,0,1.026,3H11A3,3,0,0,1,8,57ZM56,22H26V8H56ZM52,6H24V24H52V57a3,3,0,0,1-6,0V53a1,1,0,0,0-1-1H12V14h9a1,1,0,0,0,1-1V4H52ZM13.414,12,20,5.414V12Z"
       id="path2" />
    <rect
       x="14"
       y="16"
       width="2"
       height="2"
       id="rect4" />
    <rect
       x="18"
       y="19"
       width="2"
       height="2"
       id="rect6" />
    <path
       d="M29,20h6a1,1,0,0,0,1-1V15a1,1,0,0,0-1-1H32v2h2v2H30V12h6V10H29a1,1,0,0,0-1,1v8A1,1,0,0,0,29,20Z"
       id="path8" />
    <rect
       x="38"
       y="10"
       width="2"
       height="10"
       id="rect10" />
    <polygon
       points="45 20 47 20 47 12 50 12 50 10 42 10 42 12 45 12 45 20"
       id="polygon12" />
    <path
       d="M14,50H50V26H14Zm2-22H48V48H16Z"
       id="path14" />
    <path
       d="M42.707,40.293l-3.51-3.51L34.553,39.1l.894,1.79,2.291-1.146A6.008,6.008,0,0,1,32,44a6.436,6.436,0,0,1-5.18-2.572l-1.64,1.144A8.489,8.489,0,0,0,32,46a8.009,8.009,0,0,0,7.706-5.88l1.587,1.587Z"
       id="path16" />
    <path
       d="M28.553,35.1l-2.291,1.146A6.008,6.008,0,0,1,32,32a5.684,5.684,0,0,1,5.144,2.516l1.712-1.032A7.6,7.6,0,0,0,32,30a8.009,8.009,0,0,0-7.706,5.88l-1.587-1.587-1.414,1.414,3.51,3.51L29.447,36.9Z"
       id="path18" />
    <rect
       x="18"
       y="30"
       width="2"
       height="2"
       id="rect20" />
    <rect
       x="42"
       y="44"
       width="4"
       height="2"
       id="rect22" />
  </g>
</svg>
