<?xml version="1.0" encoding="UTF-8" standalone="no"?>
<!-- Created with Inkscape (http://www.inkscape.org/) -->

<svg
   xmlns:dc="http://purl.org/dc/elements/1.1/"
   xmlns:cc="http://creativecommons.org/ns#"
   xmlns:rdf="http://www.w3.org/1999/02/22-rdf-syntax-ns#"
   xmlns:svg="http://www.w3.org/2000/svg"
   xmlns="http://www.w3.org/2000/svg"
   xmlns:sodipodi="http://sodipodi.sourceforge.net/DTD/sodipodi-0.dtd"
   xmlns:inkscape="http://www.inkscape.org/namespaces/inkscape"
   width="10cm"
   height="5cm"
   viewBox="0 0 354.33071 177.16533"
   id="svg2"
   version="1.1"
   inkscape:version="0.91 r13725"
   sodipodi:docname="configthunderbird2.svg"
   inkscape:export-filename="/media/h4ck3r/GrosDisque/Fichiersdetravail/Projets_Libres/LIVRESENCOURS/manueldumo/images/configthunderbird2NEW.png"
   inkscape:export-xdpi="300"
   inkscape:export-ydpi="300">
  <defs
     id="defs4" />
  <sodipodi:namedview
     id="base"
     pagecolor="#ffffff"
     bordercolor="#666666"
     borderopacity="1.0"
     inkscape:pageopacity="0.0"
     inkscape:pageshadow="2"
     inkscape:zoom="1.979899"
     inkscape:cx="7.2891582"
     inkscape:cy="175.78974"
     inkscape:document-units="px"
     inkscape:current-layer="layer1"
     showgrid="false"
     units="cm"
     inkscape:window-width="1920"
     inkscape:window-height="1026"
     inkscape:window-x="0"
     inkscape:window-y="0"
     inkscape:window-maximized="1"
     fit-margin-top="0.1"
     fit-margin-left="0.1"
     fit-margin-bottom="0.1"
     fit-margin-right="0.1"
     borderlayer="true" />
  <metadata
     id="metadata7">
    <rdf:RDF>
      <cc:Work
         rdf:about="">
        <dc:format>image/svg+xml</dc:format>
        <dc:type
           rdf:resource="http://purl.org/dc/dcmitype/StillImage" />
        <dc:title></dc:title>
      </cc:Work>
    </rdf:RDF>
  </metadata>
  <g
     inkscape:label="Calque 1"
     inkscape:groupmode="layer"
     id="layer1"
     transform="translate(-2.3897126,-875.47312)">
    <flowRoot
       xml:space="preserve"
       id="flowRoot4532"
       style="font-style:normal;font-weight:normal;font-size:40px;line-height:125%;font-family:sans-serif;letter-spacing:0px;word-spacing:0px;fill:#000000;fill-opacity:1;stroke:none;stroke-width:1px;stroke-linecap:butt;stroke-linejoin:miter;stroke-opacity:1"
       transform="translate(2.3897126,875.4731)"><flowRegion
         id="flowRegion4534"><rect
           id="rect4536"
           width="387.39349"
           height="176.77669"
           x="-249.50768"
           y="76.655182" /></flowRegion><flowPara
         id="flowPara4560" /></flowRoot>    <rect
       style="opacity:1;fill:#ffffff;fill-opacity:1;stroke:none;stroke-width:1.5;stroke-linejoin:round;stroke-miterlimit:4;stroke-dasharray:none;stroke-dashoffset:0;stroke-opacity:1"
       id="rect4217"
       width="396.98996"
       height="204.05081"
       x="-11.752423"
       y="868.28564" />
    <rect
       style="opacity:1;fill:#ffffff;fill-opacity:1;stroke:#000000;stroke-width:1.5;stroke-linejoin:round;stroke-miterlimit:4;stroke-dasharray:none;stroke-dashoffset:0;stroke-opacity:1"
       id="rect4136"
       width="349.01358"
       height="169.56335"
       x="6.1748466"
       y="880.9837"
       ry="8.924387" />
    <g
       id="g4189"
       transform="matrix(0.50209234,-0.51084925,0.51379304,0.4992156,159.95668,754.10859)">
      <path
         id="rect4148-3"
         d="m 37.079917,306.64048 c -0.95342,0 -1.72193,0.76699 -1.72193,1.72041 l 0,4.42652 -4.37632,0 c -0.95343,0 -1.72042,0.76699 -1.72042,1.72041 0,0.95342 0.76699,1.72041 1.72042,1.72041 l 4.37632,0 0,4.62275 c 0,0.95341 0.76851,1.72041 1.72193,1.72041 0.95341,0 1.72041,-0.767 1.72041,-1.72041 l 0,-4.62275 4.67142,0 c 0.95342,0 1.72041,-0.76699 1.72041,-1.72041 0,-0.95342 -0.76699,-1.72041 -1.72041,-1.72041 l -4.67142,0 0,-4.42652 c 0,-0.95342 -0.767,-1.72041 -1.72041,-1.72041 z"
         style="opacity:1;fill:#000000;fill-opacity:1;stroke:none;stroke-width:3.54330707;stroke-linejoin:round;stroke-miterlimit:4;stroke-dasharray:none;stroke-dashoffset:0;stroke-opacity:1"
         inkscape:connector-curvature="0" />
      <flowRoot
         xml:space="preserve"
         id="flowRoot4194"
         style="font-style:normal;font-weight:normal;font-size:40px;line-height:125%;font-family:sans-serif;letter-spacing:0px;word-spacing:0px;fill:#000000;fill-opacity:1;stroke:none;stroke-width:1px;stroke-linecap:butt;stroke-linejoin:miter;stroke-opacity:1"
         transform="matrix(0.69891616,0.71520361,-0.71520361,0.69891616,118.99393,338.67144)"><flowRegion
           id="flowRegion4196"><rect
             id="rect4198"
             width="145.46196"
             height="150.00766"
             x="43.941635"
             y="98.140587" /></flowRegion><flowPara
           id="flowPara4200" /></flowRoot>      <text
         xml:space="preserve"
         style="font-style:normal;font-weight:normal;font-size:40px;line-height:125%;font-family:sans-serif;letter-spacing:0px;word-spacing:0px;fill:#000000;fill-opacity:1;stroke:none;stroke-width:1px;stroke-linecap:butt;stroke-linejoin:miter;stroke-opacity:1"
         x="252.14975"
         y="141.14725"
         id="text4218"
         sodipodi:linespacing="125%"
         transform="matrix(0.69891616,0.71520361,-0.71520361,0.69891616,0,0)"><tspan
           sodipodi:role="line"
           id="tspan4220"
           x="252.14975"
           y="141.14725" /></text>
    </g>
    <text
       xml:space="preserve"
       style="font-style:normal;font-weight:normal;font-size:9.1354351px;line-height:125%;font-family:sans-serif;letter-spacing:0px;word-spacing:0px;fill:#000000;fill-opacity:1;stroke:none;stroke-width:1px;stroke-linecap:butt;stroke-linejoin:miter;stroke-opacity:1"
       x="75.596771"
       y="891.02753"
       id="text4620"
       sodipodi:linespacing="125%"><tspan
         sodipodi:role="line"
         id="tspan4622"
         x="75.596771"
         y="891.02753"
         style="font-style:italic;font-variant:normal;font-weight:normal;font-stretch:normal;font-family:sans-serif;-inkscape-font-specification:'sans-serif Italic'">Paramètres des comptes Courrier et Groupes</tspan></text>
    <rect
       style="opacity:1;fill:#e6e6e6;fill-opacity:1;stroke:#000000;stroke-width:0.57237583;stroke-linejoin:round;stroke-miterlimit:4;stroke-dasharray:none;stroke-dashoffset:0;stroke-opacity:1"
       id="rect4689"
       width="69.79187"
       height="7.754652"
       x="10.935192"
       y="909.46411"
       ry="3.877326" />
    <flowRoot
       xml:space="preserve"
       id="flowRoot4639"
       style="font-style:normal;font-weight:normal;font-size:24.565485px;line-height:125%;font-family:sans-serif;letter-spacing:0px;word-spacing:0px;fill:#000000;fill-opacity:1;stroke:none;stroke-width:1px;stroke-linecap:butt;stroke-linejoin:miter;stroke-opacity:1"
       transform="translate(5.4248453,880.23368)"><flowRegion
         id="flowRegion4641"><rect
           id="rect4643"
           width="122.52351"
           height="107.3244"
           x="3.6492319"
           y="21.475721" /></flowRegion><flowPara
         id="flowPara4645"
         style="font-style:normal;font-variant:normal;font-weight:bold;font-stretch:normal;font-size:6.14137125px;font-family:sans-serif;-inkscape-font-specification:'sans-serif Bold'">Jean.dupont@youkoulele.fr</flowPara><flowPara
         id="flowPara4647"
         style="font-size:6.14137125px">   Paramètre serveur</flowPara><flowPara
         id="flowPara4649"
         style="font-size:6.14137125px">   Copies et dossiers</flowPara><flowPara
         style="font-size:6.14137125px"
         id="flowPara4671">   Rédaction et adressage</flowPara><flowPara
         style="font-size:6.14137125px"
         id="flowPara4673">   Paramètres des indésirables</flowPara><flowPara
         style="font-size:6.14137125px"
         id="flowPara4675">   Synchronisation et espace disque</flowPara><flowPara
         style="font-size:6.14137125px"
         id="flowPara4677">   Accusés de réceptions</flowPara><flowPara
         style="font-size:6.14137125px"
         id="flowPara4679">   Sécurité</flowPara><flowPara
         style="font-size:6.14137125px"
         id="flowPara4681">Dossiers locaux</flowPara><flowPara
         style="font-size:6.14137125px"
         id="flowPara4683">   Paramètres des indésirables</flowPara><flowPara
         style="font-size:6.14137125px"
         id="flowPara4685">   Espace disque</flowPara><flowPara
         style="font-size:6.14137125px"
         id="flowPara4687">Serveur sortant (SMTP)</flowPara><flowPara
         id="flowPara4651"
         style="font-size:6.14137125px" /><flowPara
         id="flowPara4653"
         style="font-size:6.14137125px" /><flowPara
         id="flowPara4655"
         style="font-size:6.14137125px" /><flowPara
         id="flowPara4657"
         style="font-size:6.14137125px" /><flowPara
         id="flowPara4659"
         style="font-size:6.14137125px" /><flowPara
         id="flowPara4661"
         style="font-size:6.14137125px" /><flowPara
         id="flowPara4663"
         style="font-size:6.14137125px" /><flowPara
         id="flowPara4665"
         style="font-size:6.14137125px" /><flowPara
         id="flowPara4667"
         style="font-size:6.14137125px" /><flowPara
         id="flowPara4669"
         style="font-size:6.14137125px" /></flowRoot>    <rect
       style="opacity:1;fill:#e6e6e6;fill-opacity:1;stroke:#000000;stroke-width:0.77057517;stroke-linejoin:round;stroke-miterlimit:4;stroke-dasharray:none;stroke-dashoffset:0;stroke-opacity:1"
       id="rect4689-2"
       width="105.20155"
       height="9.3242197"
       x="122.4809"
       y="900.80481"
       ry="4.6621099" />
    <flowRoot
       xml:space="preserve"
       id="flowRoot4691"
       style="font-style:normal;font-weight:normal;font-size:40px;line-height:125%;font-family:sans-serif;letter-spacing:0px;word-spacing:0px;fill:#000000;fill-opacity:1;stroke:none;stroke-width:1px;stroke-linecap:butt;stroke-linejoin:miter;stroke-opacity:1"
       transform="translate(484.92055,688.71012)"><flowRegion
         id="flowRegion4693"><rect
           id="rect4695"
           width="249.81497"
           height="162.1044"
           x="-359.28571"
           y="211.45108" /></flowRegion><flowPara
         id="flowPara4697"
         style="font-style:normal;font-variant:normal;font-weight:bold;font-stretch:normal;font-size:7.5px;font-family:sans-serif;-inkscape-font-specification:'sans-serif Bold'">Paramètres du serveur</flowPara><flowPara
         id="flowPara4699"
         style="font-size:7.5px" /><flowPara
         id="flowPara4701"
         style="font-size:7.5px">  Type de serveur :   Serveur de courrier IMAP</flowPara><flowPara
         style="font-size:7.5px"
         id="flowPara4727">  Nom du serveur  :   mail.youkoulele.fr        Port :   993</flowPara><flowPara
         style="font-size:7.5px"
         id="flowPara4751">  Nom d'utilisateur :   jean.dupont</flowPara><flowPara
         style="font-size:7.5px"
         id="flowPara4729" /><flowPara
         style="font-style:normal;font-variant:normal;font-weight:bold;font-stretch:normal;font-size:7.5px;font-family:sans-serif;-inkscape-font-specification:'sans-serif Bold'"
         id="flowPara4741">Paramètres de sécurité</flowPara><flowPara
         style="font-size:7.5px"
         id="flowPara4731" /><flowPara
         style="font-size:7.5px"
         id="flowPara4747">Sécurité de la connexion :    SSL/TLS</flowPara><flowPara
         style="font-size:7.5px"
         id="flowPara4733">Méthode d'authentification :    Mot de passe normal</flowPara><flowPara
         style="font-size:7.5px"
         id="flowPara4735" /><flowPara
         style="font-style:normal;font-variant:normal;font-weight:bold;font-stretch:normal;font-size:7.5px;font-family:sans-serif;-inkscape-font-specification:'sans-serif Bold'"
         id="flowPara4743">Paramètres du serveur</flowPara><flowPara
         style="font-size:7.5px"
         id="flowPara4737" /><flowPara
         style="font-size:7.5px"
         id="flowPara4745">   Vérifier le courrier au lancement</flowPara><flowPara
         style="font-size:7.5px"
         id="flowPara4739">   Vérifier les nouveaux messages toutes les   10   minutes</flowPara><flowPara
         id="flowPara4705"
         style="font-size:7.5px" /><flowPara
         id="flowPara4707"
         style="font-size:7.5px" /><flowPara
         id="flowPara4709"
         style="font-size:7.5px" /><flowPara
         id="flowPara4711"
         style="font-size:7.5px" /><flowPara
         id="flowPara4713"
         style="font-size:7.5px" /><flowPara
         id="flowPara4715"
         style="font-size:7.5px" /><flowPara
         id="flowPara4717"
         style="font-size:7.5px" /><flowPara
         id="flowPara4719"
         style="font-size:7.5px" /><flowPara
         id="flowPara4721"
         style="font-size:7.5px" /><flowPara
         id="flowPara4723"
         style="font-size:7.5px" /><flowPara
         id="flowPara4725"
         style="font-size:7.5px" /></flowRoot>    <rect
       style="opacity:1;fill:none;fill-opacity:1;stroke:#000000;stroke-width:0.89999998;stroke-linejoin:round;stroke-miterlimit:4;stroke-dasharray:none;stroke-dashoffset:0;stroke-opacity:1"
       id="rect4301-9-5"
       width="78.932953"
       height="9.0857515"
       x="204.12012"
       y="928.70636" />
    <rect
       style="opacity:1;fill:none;fill-opacity:1;stroke:#000000;stroke-width:0.89999998;stroke-linejoin:round;stroke-miterlimit:4;stroke-dasharray:none;stroke-dashoffset:0;stroke-opacity:1"
       id="rect4301-9-5-9"
       width="17.132753"
       height="9.4284086"
       x="317.16312"
       y="928.98151" />
    <rect
       style="opacity:1;fill:none;fill-opacity:1;stroke:#000000;stroke-width:0.89999998;stroke-linejoin:round;stroke-miterlimit:4;stroke-dasharray:none;stroke-dashoffset:0;stroke-opacity:1"
       id="rect4301-9-5-2"
       width="78.932953"
       height="9.0857515"
       x="204.05301"
       y="938.80481" />
    <rect
       style="opacity:1;fill:none;fill-opacity:1;stroke:#000000;stroke-width:0.89999998;stroke-linejoin:round;stroke-miterlimit:4;stroke-dasharray:none;stroke-dashoffset:0;stroke-opacity:1"
       id="rect4280-27-6-2-8"
       width="35.815739"
       height="10.417069"
       x="230.47678"
       y="973.8443"
       ry="0" />
    <rect
       style="opacity:1;fill:none;fill-opacity:1;stroke:#000000;stroke-width:0.46203154;stroke-linejoin:round;stroke-miterlimit:4;stroke-dasharray:none;stroke-dashoffset:0;stroke-opacity:1"
       id="rect4280-2-9-6-9"
       width="5.2842669"
       height="10.552917"
       x="266.53952"
       y="973.76508"
       ry="0" />
    <path
       style="opacity:1;fill:#000000;fill-opacity:1;stroke:#000000;stroke-width:0.12893084;stroke-linejoin:round;stroke-miterlimit:4;stroke-dasharray:none;stroke-dashoffset:0;stroke-opacity:1"
       d="m 268.4458,979.54225 -0.8207,-1.6511 1.49707,0.042 c 0.82338,0.022 1.50603,0.047 1.51696,0.054 0.0109,0.012 -0.29342,0.7307 -0.67636,1.609 l -0.69626,1.597 -0.82071,-1.651 z"
       id="path4299-3-1-7"
       inkscape:connector-curvature="0" />
    <rect
       style="opacity:1;fill:none;fill-opacity:1;stroke:#000000;stroke-width:0.89999998;stroke-linejoin:round;stroke-miterlimit:4;stroke-dasharray:none;stroke-dashoffset:0;stroke-opacity:1"
       id="rect4280-27-6-2-3"
       width="80.475761"
       height="10.077096"
       x="239.75391"
       y="985.44281"
       ry="0" />
    <rect
       style="opacity:1;fill:none;fill-opacity:1;stroke:#000000;stroke-width:0.46203154;stroke-linejoin:round;stroke-miterlimit:4;stroke-dasharray:none;stroke-dashoffset:0;stroke-opacity:1"
       id="rect4280-2-9-6-6"
       width="5.2842669"
       height="10.552917"
       x="320.82526"
       y="985.21527"
       ry="0" />
    <path
       style="opacity:1;fill:#000000;fill-opacity:1;stroke:#000000;stroke-width:0.12893084;stroke-linejoin:round;stroke-miterlimit:4;stroke-dasharray:none;stroke-dashoffset:0;stroke-opacity:1"
       d="m 322.73152,990.61368 -0.8207,-1.6511 1.49707,0.042 c 0.82338,0.022 1.50603,0.047 1.51696,0.054 0.0109,0.012 -0.29342,0.7307 -0.67636,1.609 l -0.69626,1.597 -0.82071,-1.651 z"
       id="path4299-3-1-1"
       inkscape:connector-curvature="0" />
    <rect
       style="opacity:1;fill:none;fill-opacity:1;stroke:#000000;stroke-width:0.54467136;stroke-linejoin:round;stroke-miterlimit:4;stroke-dasharray:none;stroke-dashoffset:0;stroke-opacity:1"
       id="rect4280-27-6-2-8-2"
       width="12.68502"
       height="10.772398"
       x="296.3927"
       y="1030.5167"
       ry="0" />
    <rect
       style="opacity:1;fill:none;fill-opacity:1;stroke:#000000;stroke-width:0.46203154;stroke-linejoin:round;stroke-miterlimit:4;stroke-dasharray:none;stroke-dashoffset:0;stroke-opacity:1"
       id="rect4280-2-9-6-9-9"
       width="5.2842669"
       height="10.552917"
       x="309.14703"
       y="1030.6151"
       ry="0" />
    <path
       style="opacity:1;fill:#000000;fill-opacity:1;stroke:#000000;stroke-width:0.12893084;stroke-linejoin:round;stroke-miterlimit:4;stroke-dasharray:none;stroke-dashoffset:0;stroke-opacity:1"
       d="m 311.05332,1036.3924 -0.8207,-1.6511 1.49707,0.042 c 0.82338,0.022 1.50603,0.047 1.51696,0.054 0.0109,0.012 -0.29342,0.7307 -0.67636,1.609 l -0.69626,1.597 -0.82071,-1.651 z"
       id="path4299-3-1-7-3"
       inkscape:connector-curvature="0" />
    <path
       style="fill:none;fill-rule:evenodd;stroke:#000000;stroke-width:1px;stroke-linecap:butt;stroke-linejoin:miter;stroke-opacity:1"
       d="m 119.39699,899.02721 0,149.50269"
       id="path4867"
       inkscape:connector-curvature="0" />
  </g>
</svg>
