<?xml version="1.0" encoding="UTF-8" standalone="no"?>
<!-- Created with Inkscape (http://www.inkscape.org/) -->

<svg
   xmlns:dc="http://purl.org/dc/elements/1.1/"
   xmlns:cc="http://creativecommons.org/ns#"
   xmlns:rdf="http://www.w3.org/1999/02/22-rdf-syntax-ns#"
   xmlns:svg="http://www.w3.org/2000/svg"
   xmlns="http://www.w3.org/2000/svg"
   xmlns:sodipodi="http://sodipodi.sourceforge.net/DTD/sodipodi-0.dtd"
   xmlns:inkscape="http://www.inkscape.org/namespaces/inkscape"
   width="10cm"
   height="5.5999999cm"
   viewBox="0 0 354.33071 198.42517"
   id="svg2"
   version="1.1"
   inkscape:version="0.91 r13725"
   sodipodi:docname="configthunderbird5.svg"
   inkscape:export-filename="/media/h4ck3r/GrosDisque/Fichiersdetravail/Projets_Libres/LIVRESENCOURS/manueldumo/images/configthunderbird5NEW.png"
   inkscape:export-xdpi="300"
   inkscape:export-ydpi="300">
  <defs
     id="defs4" />
  <sodipodi:namedview
     id="base"
     pagecolor="#ffffff"
     bordercolor="#666666"
     borderopacity="1.0"
     inkscape:pageopacity="0.0"
     inkscape:pageshadow="2"
     inkscape:zoom="1.4"
     inkscape:cx="-63.017535"
     inkscape:cy="102.68053"
     inkscape:document-units="px"
     inkscape:current-layer="layer1"
     showgrid="false"
     units="cm"
     inkscape:window-width="1920"
     inkscape:window-height="1026"
     inkscape:window-x="0"
     inkscape:window-y="0"
     inkscape:window-maximized="1"
     fit-margin-top="0.1"
     fit-margin-left="0.1"
     fit-margin-bottom="0.1"
     fit-margin-right="0.1"
     borderlayer="true" />
  <metadata
     id="metadata7">
    <rdf:RDF>
      <cc:Work
         rdf:about="">
        <dc:format>image/svg+xml</dc:format>
        <dc:type
           rdf:resource="http://purl.org/dc/dcmitype/StillImage" />
        <dc:title></dc:title>
      </cc:Work>
    </rdf:RDF>
  </metadata>
  <g
     inkscape:label="Calque 1"
     inkscape:groupmode="layer"
     id="layer1"
     transform="translate(-2.3897126,-854.21333)">
    <rect
       style="opacity:1;fill:#ffffff;fill-opacity:1;stroke:none;stroke-width:1.5;stroke-linejoin:round;stroke-miterlimit:4;stroke-dasharray:none;stroke-dashoffset:0;stroke-opacity:1"
       id="rect4215"
       width="383.57141"
       height="233.57143"
       x="-12.610288"
       y="840.49567" />
    <rect
       style="opacity:1;fill:#ffffff;fill-opacity:1;stroke:#000000;stroke-width:1.5;stroke-linejoin:round;stroke-miterlimit:4;stroke-dasharray:none;stroke-dashoffset:0;stroke-opacity:1"
       id="rect4136"
       width="348.92725"
       height="189.69313"
       x="4.8732028"
       y="858.9649"
       ry="9.9838486" />
    <g
       id="g4189"
       transform="matrix(0.50209234,-0.51084925,0.51379304,0.4992156,158.61186,732.04667)">
      <path
         id="rect4148-3"
         d="m 37.079917,306.64048 c -0.95342,0 -1.72193,0.76699 -1.72193,1.72041 l 0,4.42652 -4.37632,0 c -0.95343,0 -1.72042,0.76699 -1.72042,1.72041 0,0.95342 0.76699,1.72041 1.72042,1.72041 l 4.37632,0 0,4.62275 c 0,0.95341 0.76851,1.72041 1.72193,1.72041 0.95341,0 1.72041,-0.767 1.72041,-1.72041 l 0,-4.62275 4.67142,0 c 0.95342,0 1.72041,-0.76699 1.72041,-1.72041 0,-0.95342 -0.76699,-1.72041 -1.72041,-1.72041 l -4.67142,0 0,-4.42652 c 0,-0.95342 -0.767,-1.72041 -1.72041,-1.72041 z"
         style="opacity:1;fill:#000000;fill-opacity:1;stroke:none;stroke-width:3.54330707;stroke-linejoin:round;stroke-miterlimit:4;stroke-dasharray:none;stroke-dashoffset:0;stroke-opacity:1"
         inkscape:connector-curvature="0" />
      <flowRoot
         xml:space="preserve"
         id="flowRoot4194"
         style="font-style:normal;font-weight:normal;font-size:40px;line-height:125%;font-family:sans-serif;letter-spacing:0px;word-spacing:0px;fill:#000000;fill-opacity:1;stroke:none;stroke-width:1px;stroke-linecap:butt;stroke-linejoin:miter;stroke-opacity:1"
         transform="matrix(0.69891616,0.71520361,-0.71520361,0.69891616,118.99393,338.67144)"><flowRegion
           id="flowRegion4196"><rect
             id="rect4198"
             width="145.46196"
             height="150.00766"
             x="43.941635"
             y="98.140587" /></flowRegion><flowPara
           id="flowPara4200" /></flowRoot>      <text
         xml:space="preserve"
         style="font-style:normal;font-weight:normal;font-size:40px;line-height:125%;font-family:sans-serif;letter-spacing:0px;word-spacing:0px;fill:#000000;fill-opacity:1;stroke:none;stroke-width:1px;stroke-linecap:butt;stroke-linejoin:miter;stroke-opacity:1"
         x="252.14975"
         y="141.14725"
         id="text4218"
         sodipodi:linespacing="125%"
         transform="matrix(0.69891616,0.71520361,-0.71520361,0.69891616,0,0)"><tspan
           sodipodi:role="line"
           id="tspan4220"
           x="252.14975"
           y="141.14725" /></text>
    </g>
    <text
       xml:space="preserve"
       style="font-style:normal;font-weight:normal;font-size:9.1354351px;line-height:125%;font-family:sans-serif;letter-spacing:0px;word-spacing:0px;fill:#000000;fill-opacity:1;stroke:none;stroke-width:1px;stroke-linecap:butt;stroke-linejoin:miter;stroke-opacity:1"
       x="74.251953"
       y="868.96558"
       id="text4620"
       sodipodi:linespacing="125%"><tspan
         sodipodi:role="line"
         id="tspan4622"
         x="74.251953"
         y="868.96558"
         style="font-style:italic;font-variant:normal;font-weight:normal;font-stretch:normal;font-family:sans-serif;-inkscape-font-specification:'sans-serif Italic'">Paramètres des comptes Courrier et Groupes</tspan></text>
    <flowRoot
       xml:space="preserve"
       id="flowRoot4532"
       style="font-style:normal;font-weight:normal;font-size:40px;line-height:125%;font-family:sans-serif;letter-spacing:0px;word-spacing:0px;fill:#000000;fill-opacity:1;stroke:none;stroke-width:1px;stroke-linecap:butt;stroke-linejoin:miter;stroke-opacity:1"
       transform="translate(2.3897126,875.4731)"><flowRegion
         id="flowRegion4534"><rect
           id="rect4536"
           width="387.39349"
           height="176.77669"
           x="-249.50768"
           y="76.655182" /></flowRegion><flowPara
         id="flowPara4560" /></flowRoot>    <rect
       style="opacity:1;fill:#e6e6e6;fill-opacity:1;stroke:#000000;stroke-width:0.61451316;stroke-linejoin:round;stroke-miterlimit:4;stroke-dasharray:none;stroke-dashoffset:0;stroke-opacity:1"
       id="rect4689"
       width="77.305748"
       height="8.0696573"
       x="10.659669"
       y="902.51575"
       ry="4.0348287" />
    <flowRoot
       xml:space="preserve"
       id="flowRoot4639"
       style="font-style:normal;font-weight:normal;font-size:40px;line-height:125%;font-family:sans-serif;letter-spacing:0px;word-spacing:0px;fill:#000000;fill-opacity:1;stroke:none;stroke-width:1px;stroke-linecap:butt;stroke-linejoin:miter;stroke-opacity:1"
       transform="matrix(0.61413713,0,0,0.61413713,170.57696,821.40399)"><flowRegion
         id="flowRegion4641"><rect
           id="rect4643"
           width="199.50513"
           height="174.75641"
           x="-265.16504"
           y="94.837929" /></flowRegion><flowPara
         id="flowPara4645"
         style="font-style:normal;font-variant:normal;font-weight:bold;font-stretch:normal;font-size:10px;font-family:sans-serif;-inkscape-font-specification:'sans-serif Bold'">Jean.dupont@youkoulele.fr</flowPara><flowPara
         id="flowPara4647"
         style="font-size:10px">   Paramètre serveur</flowPara><flowPara
         id="flowPara4649"
         style="font-size:10px">   Copies et dossiers</flowPara><flowPara
         style="font-size:10px"
         id="flowPara4671">   Rédaction et adressage</flowPara><flowPara
         style="font-size:10px"
         id="flowPara4673">   Paramètres des indésirables</flowPara><flowPara
         style="font-size:10px"
         id="flowPara4675">   Synchronisation et espace disque</flowPara><flowPara
         style="font-size:10px"
         id="flowPara4677">   Accusés de réceptions</flowPara><flowPara
         style="font-size:10px"
         id="flowPara4679">   Sécurité</flowPara><flowPara
         style="font-size:10px"
         id="flowPara4681">Dossiers locaux</flowPara><flowPara
         style="font-size:10px"
         id="flowPara4683">   Paramètres des indésirables</flowPara><flowPara
         style="font-size:10px"
         id="flowPara4685">   Espace disque</flowPara><flowPara
         style="font-size:10px"
         id="flowPara4687">Serveur sortant (SMTP)</flowPara><flowPara
         id="flowPara4651"
         style="font-size:10px" /><flowPara
         id="flowPara4653"
         style="font-size:10px" /><flowPara
         id="flowPara4655"
         style="font-size:10px" /><flowPara
         id="flowPara4657"
         style="font-size:10px" /><flowPara
         id="flowPara4659"
         style="font-size:10px" /><flowPara
         id="flowPara4661"
         style="font-size:10px" /><flowPara
         id="flowPara4663"
         style="font-size:10px" /><flowPara
         id="flowPara4665"
         style="font-size:10px" /><flowPara
         id="flowPara4667"
         style="font-size:10px" /><flowPara
         id="flowPara4669"
         style="font-size:10px" /></flowRoot>    <rect
       style="opacity:1;fill:#e6e6e6;fill-opacity:1;stroke:#000000;stroke-width:1;stroke-linejoin:round;stroke-miterlimit:4;stroke-dasharray:none;stroke-dashoffset:0;stroke-opacity:1"
       id="rect4689-2"
       width="208.37062"
       height="12.016664"
       x="121.36634"
       y="877.54449"
       ry="6.0083318" />
    <path
       style="fill:none;fill-rule:evenodd;stroke:#000000;stroke-width:1.06724453px;stroke-linecap:butt;stroke-linejoin:miter;stroke-opacity:1"
       d="m 118.05217,876.96529 0,170.28511"
       id="path4867"
       inkscape:connector-curvature="0" />
    <flowRoot
       xml:space="preserve"
       id="flowRoot5148"
       style="font-style:normal;font-weight:normal;font-size:12.20619011px;line-height:125%;font-family:sans-serif;letter-spacing:0px;word-spacing:0px;fill:#000000;fill-opacity:1;stroke:none;stroke-width:1px;stroke-linecap:butt;stroke-linejoin:miter;stroke-opacity:1"
       transform="matrix(0.52915822,0,0,0.52915822,196.95433,382.91963)"><flowRegion
         id="flowRegion5150"><rect
           id="rect5152"
           width="392.97797"
           height="27.208654"
           x="-134.00603"
           y="936.98004" /></flowRegion><flowPara
         id="flowPara5154"
         style="font-style:normal;font-variant:normal;font-weight:bold;font-stretch:normal;font-family:sans-serif;-inkscape-font-specification:'sans-serif Bold'">Paramètres du compte - &lt;jean.dupont@youkoulele.fr&gt;</flowPara></flowRoot>    <flowRoot
       xml:space="preserve"
       id="flowRoot5516"
       style="font-style:normal;font-weight:normal;font-size:40px;line-height:125%;font-family:sans-serif;letter-spacing:0px;word-spacing:0px;fill:#000000;fill-opacity:1;stroke:none;stroke-width:1px;stroke-linecap:butt;stroke-linejoin:miter;stroke-opacity:1"
       transform="matrix(0.75648533,0,0,0.75648533,145.64505,747.64406)"><flowRegion
         id="flowRegion5518"><rect
           id="rect5520"
           width="299.63556"
           height="246.38649"
           x="-29.285715"
           y="198.93138" /></flowRegion><flowPara
         id="flowPara5526"
         style="font-size:10px;line-height:160.00000238%">Nom du compte : Mon compte Youkoulele</flowPara><flowPara
         style="font-style:normal;font-variant:normal;font-weight:bold;font-stretch:normal;font-size:10px;line-height:160.00000238%;font-family:sans-serif;-inkscape-font-specification:'sans-serif Bold'"
         id="flowPara5562">Identité par défaut</flowPara><flowPara
         style="font-size:7.5px;line-height:100%"
         id="flowPara5564">Chaque compte dispose d'informations sur l'expéditeur qui sont systématiquement transmises avec les messages. Elles vous identifient auprès de vos correspondants.</flowPara><flowPara
         style="font-size:10px;line-height:160.00000238%"
         id="flowPara5566">Nom :                                 Jean Dupont</flowPara><flowPara
         style="font-size:10px;line-height:160.00000238%"
         id="flowPara5568">Adresse électronique :       jean.dupont@youkoulele.fr</flowPara><flowPara
         style="font-size:10px;line-height:160.00000238%"
         id="flowPara5570">Adresse pour la réponse :  jean.dupont@youkoulele.fr</flowPara><flowPara
         style="font-size:10px;line-height:160.00000238%"
         id="flowPara5584">Organisation :                    Chez moi</flowPara><flowPara
         style="font-size:10px;line-height:160.00000238%"
         id="flowPara5576">Texte de signature :</flowPara><flowPara
         style="font-style:normal;font-variant:normal;font-weight:bold;font-stretch:normal;font-size:10px;line-height:160.00000238%;font-family:Courier;-inkscape-font-specification:'Courier Bold'"
         id="flowPara5578">    Jean Dupont</flowPara><flowPara
         style="font-style:normal;font-variant:normal;font-weight:bold;font-stretch:normal;font-size:10px;line-height:160.00000238%;font-family:Courier;-inkscape-font-specification:'Courier Bold'"
         id="flowPara5580">    4 rue Danlé Brancar</flowPara><flowPara
         style="font-style:normal;font-variant:normal;font-weight:bold;font-stretch:normal;font-size:10px;line-height:160.00000238%;font-family:Courier;-inkscape-font-specification:'Courier Bold'"
         id="flowPara5582">    75000 Paris</flowPara><flowPara
         id="flowPara5528"
         style="font-size:10px;line-height:160.00000238%" /><flowPara
         id="flowPara5530"
         style="font-size:10px;line-height:160.00000238%" /><flowPara
         id="flowPara5532"
         style="font-size:10px;line-height:160.00000238%" /><flowPara
         id="flowPara5534"
         style="font-size:10px;line-height:160.00000238%" /><flowPara
         id="flowPara5536"
         style="font-size:10px;line-height:160.00000238%" /><flowPara
         id="flowPara5538"
         style="font-size:10px;line-height:160.00000238%" /><flowPara
         id="flowPara5540"
         style="font-size:10px;line-height:160.00000238%" /><flowPara
         id="flowPara5542"
         style="font-size:10px;line-height:160.00000238%" /><flowPara
         id="flowPara5544"
         style="font-size:10px;line-height:160.00000238%" /><flowPara
         id="flowPara5546"
         style="font-size:10px;line-height:160.00000238%" /><flowPara
         id="flowPara5548"
         style="font-size:10px;line-height:160.00000238%" /><flowPara
         id="flowPara5550"
         style="font-size:10px;line-height:160.00000238%" /><flowPara
         id="flowPara5552"
         style="font-size:10px;line-height:160.00000238%" /><flowPara
         id="flowPara5554"
         style="font-size:10px;line-height:160.00000238%" /><flowPara
         id="flowPara5556"
         style="font-size:10px;line-height:160.00000238%" /></flowRoot>    <rect
       style="opacity:1;fill:none;fill-opacity:1;stroke:#000000;stroke-width:0.679892;stroke-linejoin:round;stroke-miterlimit:4;stroke-dasharray:none;stroke-dashoffset:0;stroke-opacity:1"
       id="rect5590"
       width="110.8201"
       height="8.7744226"
       x="222.42346"
       y="942.32898"
       ry="0" />
    <rect
       style="opacity:1;fill:none;fill-opacity:1;stroke:#000000;stroke-width:0.679892;stroke-linejoin:round;stroke-miterlimit:4;stroke-dasharray:none;stroke-dashoffset:0;stroke-opacity:1"
       id="rect5590-8"
       width="110.8201"
       height="8.7744226"
       x="222.37251"
       y="954.34589"
       ry="0" />
    <rect
       style="opacity:1;fill:none;fill-opacity:1;stroke:#000000;stroke-width:0.679892;stroke-linejoin:round;stroke-miterlimit:4;stroke-dasharray:none;stroke-dashoffset:0;stroke-opacity:1"
       id="rect5590-5"
       width="110.8201"
       height="8.7744226"
       x="222.3725"
       y="966.59387"
       ry="0" />
    <rect
       style="opacity:1;fill:none;fill-opacity:1;stroke:#000000;stroke-width:0.679892;stroke-linejoin:round;stroke-miterlimit:4;stroke-dasharray:none;stroke-dashoffset:0;stroke-opacity:1"
       id="rect5590-0"
       width="110.8201"
       height="8.7744226"
       x="222.3725"
       y="977.95813"
       ry="0" />
    <rect
       style="opacity:1;fill:none;fill-opacity:1;stroke:#000000;stroke-width:1;stroke-linejoin:round;stroke-miterlimit:4;stroke-dasharray:none;stroke-dashoffset:0;stroke-opacity:1"
       id="rect5590-9"
       width="162.03587"
       height="39.282082"
       x="129.842"
       y="1000.7112"
       ry="0" />
    <rect
       style="opacity:1;fill:none;fill-opacity:1;stroke:#000000;stroke-width:0.679892;stroke-linejoin:round;stroke-miterlimit:4;stroke-dasharray:none;stroke-dashoffset:0;stroke-opacity:1"
       id="rect5590-4"
       width="110.8201"
       height="8.7744226"
       x="190.5511"
       y="900.46558"
       ry="0" />
  </g>
</svg>
