{
    "database":
    {
        "hostname": "hostname default",
        "user": "user default",
        "password": "password default",
        "schema": "schema default",
        "name": "name default"
    }
    "playlist":
    {
        "duration": 0,
        "genre": "genre default",
        "type": "type default",
        "title": "title default",
        "name": "Name playlist"
    }
        
}
