{
"all" :["pwk_nbVisits_today"],
"degooglisonsInternet" :[],
"framabag" :[],
"framabee" :[],
"framabin" :["logs_visits_today","logs_docCreated_today","logs_sharedDocs_today"],
"framablog" :["mySQL_nbPosts_today","mySQL_nbPosts_1lastWeek","mySQL_nbComments_today","mySQL_nbComments_1lastWeek"],
"framabook" :["mySQL_nbDwnlds_today"],
"framacalc" :[],
"framacloud" :[],
"framacolibri" :[],
"framadate" :["mySQL_nbPulls_today_living","mySQL_nbPulls_today_created","mySQL_nbPulls_today_removed"],
"framadvd" :["logs_downloads_today_ecole","logs_downloads_today_classic"],
"framagames" :[],
"framagit" :[],
"framakey" :[],
"framalab" :[],
"framalibre" :["mySQL_nbVisits_today","mySQL_nbComments_today","mySQL_nbComments_1lastWeek"], 
"framalink" :[],
"framanews" :[],
"framapack" :[],
"framapad" :["rest_json_pluginFramapad_quotidien_blankPads","rest_json_pluginFramapad_hebdo_blankPads","rest_json_pluginFramapad_mensuel_blankPads","rest_json_pluginFramapad_bimestriel_blankPads","rest_json_pluginFramapad_semestriel_blankPads","rest_json_pluginFramapad_annuel_blankPads","rest_json_pluginFramapad_eternal_blankPads","rest_json_totalBlankPads_living","rest_json_totalBlankPads_living_percent"],
"framapic" :[],
"framasphere" :[],
"framasphereStat" :[],
"framastart" :[],
"framastats" :[],
"framatube" :[],
"framavectoriel" :[],
"framazic" :[],
"framindmap" :[],
"reseauxSociaux" :[]
}
