"Centroid.Distance"	"Jaccard.Index"	"Anisotropy.Difference"	"EigenVector.Angle"	"Intensities.Distance"	"Database.ID"	"Neighbourhood.Difference"	"Database.ID.Source"	"Database.ID.Target"
3.75498968697839	0.092946189048446	0.149115803621288	62.3969397634629	96.1509821037913	4755	4	2715	317
3.70498312752667	0.09795617749954	0.142278081142126	88.8446969213285	55.5407597041356	4756	2	2722	317
3.33918850291358	0.114357101672112	-0.293210910272223	87.5941832149821	24.9679112481764	4757	0	2727	317
3.14727728516614	0.076979338087402	-0.335478040653171	76.776349611747	68.757556925092	4758	0	2729	317
0.192420309626699	0.695723414714075	-0.05156129610975	27.1105758074977	11.2378234253004	4764	-2	2711	311
0.671118798336533	0.668518518518519	-0.192443889971667	10.802259722182	38.3369215869595	4766	0	2710	309
0.359050314685885	0.503181189488243	-0.154524698836795	15.6223187785113	18.4770195535375	4768	3	2720	315
3.70850088265586	0.029683377308707	-0.377973035995622	63.2267420469771	32.6033963486559	4769	0	2726	315
0.20726179476825	0.71578947368421	-0.079127195356367	17.6608835176326	7.894813287496	4770	2	2713	314
0.244576964591648	0.654850746268656	0.002874268528369	59.1470679342722	37.690177057531	4777	-1	2681	286
0.374012531886475	0.658560311284047	-0.048941356583241	41.3216834951136	42.7450421113856	4782	-1	2689	292
7.1466860277893	0.007893438579181	-0.32060795551158	68.0393626945942	229.739274437098	4783	1	2677	291
0.306875812273264	0.733692275833506	-0.053271328417461	0.859879010720973	37.3677862558206	4784	0	2688	291
0.17210926118151	0.722018042098229	-0.145818112169368	1.6951681657924	11.9616323148089	4785	0	2678	278
0.318199779982494	0.705813040062844	-0.103180339733625	40.4882225549075	24.6701202138436	4786	0	2670	277
1.52168510608944	0.6094	-0.096198788151405	6.72906807793638	30.8116315338928	4787	0	2672	279
3.74297236913215	0.022222222222222	-0.250370907331474	71.9007466921152	3.06333688180006	4788	-4	2712	279
7.55301462588239	0.00804109895019	-0.705956697312907	46.2351855648937	242.56793075561	4789	-4	2718	279
0.373889677600194	0.734577665295793	-0.076736655460032	2.392219168802	15.6436047855655	4790	2	2680	282
0.197958721553919	0.733128834355828	-0.06936956612043	1.59944483092282	20.12779722133	4792	-1	2686	284
0.375208543950729	0.644836272040302	-0.052651849965289	16.992444711391	67.555967325442	4793	0	2692	301
0.279744446700695	0.705958132045089	0.063906928314385	4.2938268840619	19.9578158622333	4795	1	2697	303
0.436727565413484	0.713212549712771	-0.070524932208652	11.9141806049	18.7396440362169	4796	0	2702	304
0.291736049411787	0.777074097530082	-0.075261507133626	1.0894818542352	25.7798466002867	4800	0	2707	308
0.254748085376441	0.626310083122515	0.020451491362796	82.6787284179479	29.7784533533499	4801	-2	2687	293
0.497295159462122	0.566906005221932	-0.10944412411665	10.2686816717924	17.4240965643777	4802	1	2690	294
1.23296744761605	0.369499417927823	0.114015835754428	5.77772617989493	49.3443395471239	4803	-5	2682	295
1.12781285460775	0.584359935725763	-0.11888391247805	7.3036302391599	17.9503199042308	4804	-1	2699	296
2.65023643090721	0.396251931993817	-0.383283576550126	16.0250464212334	43.6308371268283	4805	-1	2695	297
4.77232184421184	0.209677419354839	-0.240213567656537	40.3445896093325	126.192370142903	4806	-2	2716	297
1.85302287869743	0.46781561461794	-0.230232326410916	35.8017944430866	41.2871143331259	4807	2	2685	298
5.58488037994201	0.088368580060423	-0.370652620547653	33.3723241140432	61.5445035410542	4808	1	2717	298
0.114363639014216	0.725329981143935	-0.082858807375305	2.07039048875749	15.8995139067398	4809	3	2693	299
0.59230845387278	0.689263973436635	-0.109173585704778	2.87948137663253	46.6196276651891	4810	0	2691	300
0.222467984389953	0.717968548594999	-0.029669561829075	0.674971789869648	13.8632761752377	4814	-2	2651	256
0.452393204703373	0.731802426343154	-0.054093847683522	5.72469829705221	12.407236243239	4817	-1	2643	254
0.72044113021006	0.626414027149321	-0.059662648002824	2.76816411442733	51.4937053500331	4818	-2	2648	253
0.399685348067361	0.666666666666667	-0.026387947644209	7.2486915948185	15.0714439449625	4821	1	2644	250
0.179965213773643	0.675222278141251	0.062885088580753	22.1312649695027	21.0974933030422	4822	3	2634	249
2.14508187371486	0.441365853658537	-0.023501746108001	81.9518511656668	40.1806484868175	4823	2	2642	248
3.06450495888076	0.286584085660298	-0.058768175501119	27.8917145329232	20.8005448899667	4824	-4	2660	248
0.852513387202116	0.655972045743329	-0.089183249596958	3.15327608468599	11.1384084325374	4825	1	2640	246
0.718149984667293	0.656152001475742	0.038138243554224	4.42605618522479	13.7751158841226	4826	2	2630	245
0.857429539107566	0.5166096235152	-0.058383017567217	38.4528404080685	4.61693911553786	4827	2	2675	275
4.44528735243442	0.18569735282497	-0.167974820674417	23.7596099907533	46.5213130546561	4828	-3	2703	275
0.663957969625625	0.724181360201511	-0.071008873365394	0.515985969375381	17.1058968145187	4830	1	2684	273
0.271069783087809	0.686033089649865	0.001620813011467	28.5211197958952	23.1836448880025	4831	2	2661	274
0.376635206021026	0.618181818181818	-0.077216781719767	22.8343805075325	58.1564431893533	4835	0	2669	270
0.461690348899567	0.72169696969697	-0.03485553451616	1.3983965654292	36.8488860768626	4836	2	2662	267
0.276528019115681	0.644355909694555	-0.104636776140346	2.23912047538776	25.8394880727776	4837	0	2674	268
0.361325990848947	0.722845648951938	-0.046816676039202	1.23101125611089	14.0644248989238	4838	0	2658	265
0.456202022062549	0.249434389140271	-0.377576064199292	85.0177546205369	49.1148997814334	4839	-4	2667	263
0.555968589429992	0.747955546236108	-0.008842561653452	1.64248283751811	13.3933700749452	4843	-1	2617	228
0.67473668515096	0.450375939849624	-0.109412205734997	14.5934847294063	6.81848843246673	4844	-1	2645	227
0.297856348849322	0.692264573991031	-0.138974616770786	2.06923707881659	22.9148034042254	4845	0	2611	221
0.75750110763432	0.617408298256164	-0.085756771598649	0.691539875138659	37.921854015062	4848	1	2612	223
0.703657976578827	0.641706573791902	-0.042633346697039	1.34617633592589	43.8518076714009	4849	-3	2600	217
2.8070567429403	0.207570509648689	-0.46391898226192	61.8374665130591	7.97105115792594	4852	-3	2619	214
1.28851469768892	0.436642268984447	-0.486406051280641	13.5577010737026	7.06080140536403	4853	-3	2646	214
4.01162323794965	0.220236939211497	-0.060976056400769	20.4600226893687	66.1168994736393	4854	-8	2585	213
2.98658501884163	0.345196681830345	-0.321290714602902	15.654520035047	17.3788404547273	4855	-1	2657	213
0.618879720806069	0.628277382994364	0.028244017477737	12.3953650331306	36.5298718783111	4857	-1	2584	215
0.086114269670211	0.694958116010748	-0.080798941235683	7.76860173417149	3.9119351506177	4859	-3	2647	242
0.995864831462338	0.595756256800871	-0.044591614381989	7.14635093992884	27.5301823077436	4861	0	2641	244
0.29171287766434	0.61090775988287	-0.050339539070477	11.1275909520403	4.33635936808384	4866	-2	2637	233
1.24072602622035	0.543938161106591	-0.045374146036391	10.5240743979973	7.26765274671033	4867	-2	2639	236
1.76128577899427	0.510475217169136	-0.102176383971097	13.0389320562405	41.9662540270653	4869	-1	2620	232
0.56210869545975	0.523084170854271	-0.056961141229581	1.97300179338342	63.2234056491649	4870	1	2588	198
0.556168461492939	0.244536940686785	-0.213891185887373	9.4181612514561	16.2074433425078	4873	0	2631	199
5.51555749496636	0.166034555415086	-0.303760903603645	36.2928715316212	15.91946284318	4874	-5	2664	199
0.877486967462878	0.534995425434584	-0.140710400874923	14.0566215741302	8.9655807295935	4876	-1	2616	206
0.558064863523351	0.52312282446544	-0.057788919137668	1.96456554125579	4.06511187444746	4878	-2	2628	208
1.3502785797872	0.601235415236788	-0.080137343116961	2.36105183899313	23.1769790805144	4879	-3	2586	207
0.846124662493646	0.627152988855116	-0.132988181807963	4.6497191152411	13.2171671937552	4880	-2	2625	210
0.885214577885106	0.3521421107628	-0.030027000709776	7.73454980696566	3.14082628711876	4881	-2	2594	209
0.351651200528841	0.63768115942029	-0.200931413734503	6.00398734700671	14.9536371139454	4882	0	2624	212
0.451889243046242	0.292041219030914	-0.202873187494427	17.7153433816364	23.8075974984833	4886	-2	2599	183
4.44002045958802	0.2648790058862	0.037040624537413	46.1267448865303	60.8243521464358	4887	-4	2485	184
4.22817586429032	0.050972364380758	-0.413254859417795	59.1245882798789	10.6331790393691	4888	-3	2578	184
1.56070300601212	0.577560975609756	-0.042039827858867	5.79592958505506	16.0368721622495	4889	-1	2571	185
1.04438832272215	0.341890315052509	-0.196069903675177	6.34803728163414	27.6454168718032	4890	2	2579	186
1.47225914894481	0.395772967445031	-0.154129897325368	4.50767764353108	44.8652941558917	4891	3	2580	187
0.465831479465581	0.634453781512605	-0.033988181680917	3.64508601677977	6.36333322675937	4892	-2	2569	188
4.46400646952512	0.094136632598171	-0.319382679689404	36.2850131327987	2.0445467719183	4894	-4	2576	191
2.08680740525642	0.408082223779491	-0.125891318951773	5.04648440365186	26.9619863265531	4896	-5	2604	193
1.81787345930107	0.344939510179994	-0.17757524207098	13.6456004661383	12.5201262002727	4897	-1	2583	194
0.981638166978004	0.462303380943771	-0.167882562060926	3.88735148983287	15.7885872330459	4898	2	2590	195
0.489844641678668	0.525470514429109	-0.109819345837019	2.41046965552641	29.6337779454041	4899	-4	2589	196
1.00110138035819	0.506009898656611	-0.070929443448385	12.2675568483079	12.0671919198622	4900	1	2543	168
2.89571221998743	0.314466783216783	-0.248691241061828	32.4831086970179	33.2809680890081	4901	0	2559	167
0.940300672244867	0.315083084789092	-0.279502376810178	31.4429523781832	43.4249226056954	4902	-1	2581	167
3.49990572089045	0.119617224880383	-0.292613776113784	17.6624804240845	36.8460005786632	4903	-2	2577	166
0.762365524617114	0.627007464374576	-0.055932160052734	4.54924180364573	16.1156064712384	4906	0	2550	172
2.0077174818604	0.387600937744204	-0.319794793230685	18.7043349618332	5.78478797449847	4907	2	2558	171
0.851723159274219	0.088782924613987	-0.596154284092309	67.7739708380975	25.7148858647739	4908	-5	2593	170
0.833849818710045	0.688915375446961	-0.027952037056045	2.31590011647777	54.628869578806	4914	-1	2549	180
4.42283587017463	0.29641162514828	-0.400219238620319	3.24435029412592	79.989849056653	4915	-5	2563	179
3.15581796223855	0.420399515738499	-0.163629176488383	12.3611339707595	56.8490944136908	4916	0	2597	179
3.27630541436627	0.09328968903437	-0.294930313463765	45.8728367632142	28.0421239243024	4917	-3	2575	178
1.93028255096236	0.008829300196207	-0.708657195798883	89.560956817638	15.3388138205025	4918	-5	2596	178
2.59922369813465	0.40659793814433	-0.368988484826883	15.9264284826978	15.5683722405302	4919	-6	2554	177
1.20784965229531	0.028010033444816	-0.252609544470476	78.5726040243832	35.5849939642021	4920	-1	2610	177
1.32551979842316	0.544652908067542	-0.164030273490504	2.19314283152969	25.8484477148011	4924	2	2541	149
0.520758349180902	0.639755766621438	-0.074750105014245	0.905267368790288	28.6092356335524	4925	-6	2529	150
0.581506334217279	0.718457943925234	-0.036812916217038	2.80669516254093	18.6033067632832	4926	0	2527	155
1.42196905815746	0.432174986770154	0.029462009271579	16.821057500519	5.91974710162965	4927	-2	2528	156
2.9887095027946	0.246624662466247	-0.079842281782561	24.31933353989	4.19169784027146	4928	-3	2582	156
0.25780892448443	0.658849804578448	-0.123079079607438	6.96816398877615	7.63823625399868	4929	0	2553	153
0.677361186667831	0.396793587174349	-0.16919865762979	18.3522357033984	4.47872697201547	4931	-1	2556	159
0.591487839930015	0.426089354660783	-0.158517504203495	4.30683498126078	15.5690265768941	4932	2	2544	160
1.26746867536552	0.511760144740243	-0.34850338323756	13.2851690834659	5.14911685865641	4933	-3	2547	157
3.10917468197118	0.002686727565825	-0.054865768212052	87.3119546319392	8.31908957555641	4934	-7	2615	157
6.01593979344655	0.214720426017497	-0.257864717325545	11.6180522882491	10.2021036794984	4936	0	2548	164
1.1927114295698	0.088636800615266	-0.055618151857284	15.2850052970255	19.2106196048193	4937	1	2591	164
0.167462717623676	0.751799300843101	-0.028433695266114	1.82595566528505	26.5263218289886	4938	2	2534	161
0.128829912723054	0.67348329925017	-0.130085419675186	12.4480209993294	1.67817775665592	4939	1	2566	162
1.45438814823814	0.400467289719626	-0.229548552327227	32.2458468518951	9.51498046859713	4940	-3	2523	138
1.40574022051596	0.555271331993422	-0.296583550828552	3.17103604066313	10.4359494989675	4941	0	2561	137
2.43941007357391	0.159222120935886	-0.213828883389901	30.5508288280739	94.4496605234797	4942	-8	2516	140
0.707677074357619	0.632673465306939	-0.106886759644361	15.817122361734	1.26828734961229	4943	1	2508	139
0.105402695672743	0.605524079320113	-0.191729467810234	5.83492257312327	13.0613413217749	4944	1	2525	134
0.967406839052883	0.58387641805455	-0.118538196793559	3.75425228198934	28.31727299546	4945	-1	2513	133
1.19134782737005	0.190964013659049	-0.195757118728326	17.1175521730243	24.7153384027525	4946	-1	2545	136
1.35602866025028	0.428953527248412	-0.438749194790064	41.8475169468178	2.57433620247888	4947	2	2510	135
2.87996939164536	0.187845303867403	-0.4617210918793	23.9510834991629	14.4537112821657	4948	-3	2552	135
0.245168410420691	0.569874631268437	-0.09230277876106	4.14537129799322	1.2404606427612	4950	-1	2539	145
1.50025558448738	0.06535552193646	-0.449666861679438	88.4460168762241	21.5933967394686	4951	-1	2567	148
0.796484395489226	0.689767086674303	-0.050406459063574	0.494941471153262	37.8357813153356	4952	0	2531	147
0.868804630549784	0.53923744200121	-0.066950785613754	1.84128756071039	9.39207788350946	4953	-2	2524	142
2.73902922892911	0.491830517862088	-0.135727598760119	13.0325630427149	15.1287584630478	4954	-4	2540	141
2.5726550290143	0.201535508637236	-0.287863802865368	27.0905650939393	45.0493061354503	4955	-4	2602	141
0.432539692270094	0.627538297114357	-0.083466722567274	4.10323988955975	27.4221147752854	4956	-1	2565	144
1.98310311978072	0.011632415664987	-0.586587402855162	73.8984830441577	40.5491637155009	4957	-9	2592	143
1.01446349519193	0.665512649800266	-0.078563636652968	2.90175463003687	17.1695410570134	4958	-3	2488	121
3.87975549707625	0.143711579996677	-0.409279691253563	64.5900868050421	9.4943763553426	4959	0	2507	122
2.34155058114021	0.267439165701043	-0.250219296815589	19.2769561429075	35.5740369358697	4960	2	2526	122
2.38959178108775	0.320787900105522	-0.212149710510059	18.4404616235261	10.3341748600381	4961	3	2519	124
1.03219828274357	0.469850458273034	-0.1338398396497	7.98104469085865	7.60972867293446	4962	1	2500	117
0.246329341079185	0.566311229590136	-0.129816455514902	6.15590253327103	17.3698897607288	4964	0	2496	119
3.11499789224556	0.365795010519988	-0.359569014695074	6.14417893559608	41.1535898804325	4965	-4	2499	120
2.04076310286462	0.255565192252096	-0.073059876536747	6.45017133167201	24.8775618000911	4967	0	2502	130
1.74568806550289	0.264502554854223	-0.274170988273342	13.3218730250657	9.80820070339036	4968	-6	2511	131
2.19927647169561	0.290389764950907	-0.169656003578153	28.4869726948477	1.86848146237133	4969	-4	2560	131
1.36339179017619	0.591147786946737	-0.251369347259833	3.79377298856771	14.3720295514598	4970	-1	2504	132
4.65377850456918	0.170789163722026	-0.124769619676656	17.8916057969754	92.3577786179022	4971	-5	2572	132
1.33632412141969	0.561679790026247	-0.22950569238162	5.27404095180697	7.78497341080527	4972	2	2535	125
0.296615728053259	0.653077975376197	-0.08632492310552	2.65089116321449	7.3086840745775	4974	-2	2505	127
4.87469902016151	0.070999793003519	-0.164018992430868	24.7160849814342	28.1432455285264	4975	-1	2506	128
3.38805951848864	0.294520547945205	-0.334318201865284	16.1039796769341	10.3550771754095	4978	-4	2536	106
3.16533971339655	0.423694439749873	0.024077167388561	17.9825922421616	26.418980254636	4980	-3	2474	104
0.274541723246749	0.670857781503213	-0.158622829033194	4.68473828169047	21.883918447854	4981	-1	2484	103
1.64752428944927	0.611543669600542	-0.086451489457365	1.8392797348082	44.7868682794577	4983	0	2473	101
5.70231184186232	0.085214089854461	-0.555328320356907	17.9144441882059	20.4170573570552	4984	-3	2501	116
2.64311691363572	0.014587737843552	-0.22769800871217	85.6527157123894	10.1596865662011	4985	-1	2542	116
5.32197958363371	0.006549757025143	-0.633518995749928	88.8462672863322	49.8391656199387	4986	-10	2627	116
4.24595429072349	0.21024208566108	-0.433938177911665	36.5200827430949	7.82910868215799	4988	-6	2491	114
2.46111857938417	0.17020210455988	-0.252456571980672	16.5858163483398	87.0366924388138	4989	-2	2533	114
3.89875358708343	0.24183653275282	-0.286653717367276	22.6219682488224	2.23825264736183	4990	-1	2483	113
1.37464092010737	0.373566357181868	-0.007748226860187	21.7359800619094	6.12476265027797	4991	2	2503	113
2.18296290342759	0.464001552493693	-0.099707748128076	2.24879868418016	5.65599050779573	4992	-1	2520	110
0.615132564585756	0.51384451544196	0.310726757589386	74.052745478679	6.13263518744764	4993	0	2476	109
1.65675841294068	0.34408945686901	-0.325837134043385	9.99722841211889	5.85693128591251	4994	1	2480	91
0.920755034715458	0.522794117647059	-0.047061794866747	11.3372260435727	16.7621868592793	5001	1	2475	85
1.07831646654657	0.204289732770745	-0.400385849725474	21.0193285551114	36.8879873553912	5002	-2	2495	86
0.759068338299789	0.193935119887165	-0.276181214840553	57.9562907307955	25.3512528406124	5003	1	2490	99
1.60339373815881	0.489742366412214	-0.243392493852704	16.6105835174684	4.53338070072893	5004	1	2482	100
3.75143805162052	0.369107551487414	-0.209549409549809	8.17708581989227	7.90809961898571	5005	-3	2551	97
1.73403601270075	0.069160641307765	-0.363948815801302	18.6972497764858	23.6694637578601	5007	-2	2518	95
3.09778725361845	0.02359693877551	-0.468585544707372	70.3195986270054	88.6836174976572	5008	-4	2564	95
2.20865007214909	0.054085155350978	-0.435638986837887	12.5614983374523	40.1362320830899	5009	0	2509	96
1.95002470070627	0.353308823529412	-0.150932884374222	20.7870697960226	13.4957350086211	5010	-2	2515	96
0.334133937679408	0.724340998317442	0.035137759653945	2.5417073269459	10.7521075049926	5013	0	2452	77
0.224098442441575	0.56319919853064	-0.0120027788947	7.81166434655005	13.2912710589834	5014	3	2464	78
1.15425518593877	0.247638498851162	-0.184303742443179	18.2574604504643	9.05369869721075	5015	-1	2486	79
1.81250082517888	0.047073791348601	-0.565987929552219	32.5528395625835	110.801919216268	5016	1	2494	79
1.14799994344386	0.466985887096774	0.043015034297474	17.9050330104472	5.15366460074077	5020	1	2450	81
0.738508071321254	0.524606545091182	-0.093941291776135	8.00364908941033	27.0307314345261	5021	2	2469	82
2.12724790783682	0.409102213379756	-0.310740734666439	9.01641382675605	5.31910730087237	5022	-2	2471	83
0.829650799312388	0.754870940882598	-0.058197504053595	1.09839163432753	11.7603413658038	5023	4	2456	84
2.28319343173704	0.435196435803969	0.216675500641574	42.1778759485646	92.791836671335	5024	2	2460	69
1.55308133916256	0.618485342019544	-0.157150479565445	2.82785623344614	10.2685264332336	5025	-9	2461	70
3.16064704048112	0.338675465472543	-0.494236707120581	22.0964181884298	4.84035558387716	5028	-6	2457	73
1.70659468843444	0.188216775354171	-0.348143675674743	57.8877770929838	29.805790504066	5029	-6	2493	73
3.41000002498778	0.000488997555012	-0.336361478935111	20.7183843306063	250.730910263497	5030	-12	2514	73
1.25965061070713	0.644034039471302	0.030636730255022	4.5327669409248	37.7936534152509	5031	1	2465	74
3.78676417330146	0.200377232885832	-0.058917872002418	46.9129416913063	24.9503132995735	5032	-2	2435	75
4.19986329856486	0.086397500600817	-0.453167282344539	51.1453937084923	11.9502607335795	5033	-4	2468	75
0.074882793623864	0.720830070477682	-0.06929450994925	3.18477723881481	14.0900398070841	5034	3	2472	76
0.310768109375528	0.700371878873738	-0.060911071901165	4.5876372016198	16.7057931116972	5035	2	2442	62
1.70243700832067	0.41313269493844	-0.160710588863647	8.13076573513536	5.22787424627571	5036	-7	2447	61
2.95584766570821	0.126574860826253	-0.465849901169243	36.9306353199644	29.1720902876418	5039	-5	2459	65
1.84109897834542	0.270915411355736	-0.484986468465609	38.4752156214696	29.368948251313	5040	-2	2455	68
0.131256357098352	0.785532994923858	0.093110702830607	7.58430425755807	28.7118705087022	5042	-4	2432	54
0.427881246169202	0.50929193131028	-0.086915124475655	6.01101062577688	71.0839084235217	5043	-8	2438	53
0.271165082928611	0.658888126286891	-0.068848640367888	4.63117428889651	7.26435778685337	5046	1	2444	55
0.931508008689691	0.591168569509738	0.037810404131407	13.3682772763833	9.56921616536661	5049	-5	2431	59
1.12498500153017	0.479267635971998	-0.148872023023291	0.770030643025666	14.2954502310983	5050	0	2446	47
1.47979589402688	0.406776522866136	-0.123136093582344	4.36155494987868	6.3491937677001	5051	1	2443	48
1.16443002235966	0.476379910492292	-0.115638045409597	5.79589301211394	94.4271287170677	5052	-1	2433	45
1.32975713904649	0.454423292273236	0.075587720517183	28.3079801400835	5.67926439224351	5053	-1	2424	46
2.28014701880138	0.335205267234702	-0.260891390239596	80.2756984296299	118.590353436324	5056	0	2385	2
2.86655920724036	0.096526332639667	-0.275944841358309	79.9207048547487	24.3865590329479	5057	-5	2387	2
1.28606932145649	0.574929624109952	0.125285796617255	79.2640754991756	57.5710820661056	5060	1	2390	6
0.909676558550104	0.564298488050724	0.006241716812661	5.71100023319054	11.7087823270014	5061	-3	2391	5
3.27731790665498	0.33337647211078	-0.047719888689258	46.6897441023694	59.755911751695	5065	1	2389	9
2.61776177528117	0.352083333333333	-0.296392426614693	67.3495351725907	4.77622397921801	5066	1	2397	9
0.727029862685732	0.606327683615819	-0.086495699055437	9.67825211948133	16.4286391562567	5067	0	2398	16
1.71351366393764	0.185631629701061	-0.022928575282502	18.8866464132008	9.31594417444853	5068	-3	2400	15
0.534006389744237	0.683958274598252	-0.131475765291461	18.9311352452438	3.99567008619012	5069	3	2393	14
2.24699813989189	0.32009790590155	0.135573702323254	84.9583855745618	30.30770398698	5072	2	2399	18
3.78911652195558	0.094667318982388	-0.15556642197079	74.5058941367526	28.0289444383092	5073	-5	2410	18
0.709885790686972	0.639372488999426	-0.056332724499206	17.6308862543929	1.29249861305031	5078	0	2412	27
0.609493320587618	0.641547049441786	-0.135328579384457	76.8195136775733	4.48371874662492	5079	3	2409	28
1.18234014377312	0.254865956665442	-0.323627359766109	87.762941371068	7.11780196455635	5082	1	2407	23
1.6516221749199	0.531783362451283	0.19744755955194	35.4260205848344	4.95933608358394	5087	0	2413	30
1.53479230195908	0.496558843771507	0.272512421213098	80.9451982691315	17.4386780918138	5088	-4	2408	31
0.38772970177973	0.747317795042545	-0.104172289785074	1.30225934864981	6.929661806216	5089	2	2411	32
0.31738605112481	0.661098398169336	0.053238807205949	58.9860886511192	5.9804766816828	5090	-2	2425	42
0.890003764380442	0.550521069324875	0.192709020508829	27.5357607167532	17.3526271481646	5091	3	2419	41
3.22886296628499	0.247617853560682	0.014243703001949	86.5975887766743	36.338849172073	5096	-2	2414	52
3.73272223795648	0.111805555555556	-0.245579843939316	67.971214374998	18.3492283087487	5097	-6	2429	52
3.1856021328398	0.048627995831886	0.134842807118307	84.5962687705492	33.570161322723	5098	-5	2437	52
0.685871377497269	0.6239907727797	0.154334334481276	10.2409115842125	9.76458794259684	5103	1	3377	918
2.54504024901098	0.427883608959598	-0.119478580970987	28.4262949136596	116.777021192644	5107	-2	3325	855
1.42354021080713	0.527269618738246	-0.154350272284033	18.8645208839366	59.593253296341	5108	-8	3324	857
1.16091877008632	0.406201891356939	-0.263420822591797	20.5554577681624	7.8560281632992	5109	-3	3334	858
1.54465882063841	0.544350758853288	-0.014917440322347	7.15789835203815	0.543008628307998	5110	-1	3323	859
0.422091633121633	0.688748685594111	0.13021252117896	7.1260025729417	18.6921972412033	5113	-2	3333	863
0.190761896837329	0.721061093247588	-0.187921198624268	16.641976356466	0.806951220293396	5114	-4	3327	864
4.31391233189067	0.219622510220057	0.118833290527655	75.5311168882919	85.203098224707	5119	-11	3332	868
0.662928823254197	0.49343691401018	-0.256152182825209	27.8030316048584	4.59574182948619	5121	-3	3335	869
0.58112021499333	0.626262626262626	-0.152003032380692	0.978705625934531	6.14357137052453	5122	-11	3344	871
1.55516118272368	0.399737015121631	-0.02401597833438	47.2308473143958	8.97298928248859	5123	-4	3339	873
1.65132904381712	0.32492263746727	-0.081962614737768	16.8723478791905	11.9505495275671	5124	-2	3345	876
7.02992330432318	0.04904214559387	-0.362027047493514	31.6952313955718	58.042245191162	5125	-9	3342	875
0.8551377007508	0.358682266009852	-0.237723180014447	20.9338818334107	3.07078874793717	5126	-2	3348	877
3.32345363852066	0.197049024274155	0.018428676323639	44.8652207444226	95.8077750933017	5127	2	3343	880
1.55549848642313	0.300955414012739	-0.318389389064131	46.2119555996261	2.20225833133029	5128	0	3350	880
2.46899255561157	0.074629562703289	0.165911074885002	45.1134441453206	73.953308732343	5129	-4	3352	880
1.4836113771007	0.215152877697842	-0.346235314514104	43.8857164239178	14.2558406533881	5132	0	3362	887
1.22720665538518	0.346266166040884	-0.265050126695759	21.4039463251823	11.1123347021599	5134	1	3353	886
1.98914560159901	0.041760215536596	-0.196731401477526	67.8700835569039	0.812982953210316	5135	-3	3364	886
1.79236291537928	0.193769470404984	-0.032170168957395	19.7812855546128	13.383269961854	5136	1	3363	891
0.615605870792882	0.12531328320802	0.04892155539855	47.4800428677738	19.6369398512299	5137	-2	3366	891
2.21948268681664	0.021534601714405	-0.086199281206209	62.2197230809422	22.2466704346524	5138	-4	3369	891
0.225785238612139	0.683672180830913	-0.157104880582346	3.30643679550119	3.28591702010819	5139	-4	3357	892
0.366277051423391	0.732309746328438	-0.017605915413808	7.61711302550252	10.422126501264	5141	-3	3356	895
2.74616585968902	0.110299316521329	-0.537219867580752	39.5281821469901	27.8257541885655	5145	-3	3373	897
1.96369340024288	0.362919414969888	-0.110218530224935	17.7448237757911	30.0742391975341	5146	-3	3361	898
0.76498979010052	0.529582673005811	-0.025856270974066	13.6282206400163	22.3689436012919	5147	0	3365	904
2.29899282187592	0.220916214587101	-0.416437586165907	46.8423674021407	3.95770299430701	5148	0	3368	902
2.47699535439445	0.395375198367717	-0.0192852286978	23.6322033982447	23.0481228290858	5149	-1	3370	902
2.64522654201462	0.263505725044187	-0.124690955373742	87.3097869251218	23.1141206509077	5150	5	3351	908
2.11907826277572	0.026465566306204	-0.406385428472776	81.1453483965923	44.1178614843343	5153	0	3382	906
0.95629774748949	0.354265699274456	-0.227794330137178	24.8669487282281	13.6808376795593	5154	-2	3374	912
4.97936380208401	0.091000502765209	-0.144289927182963	33.5895592869173	13.010017990998	5155	-7	3379	912
4.47797766244454	0.02958428972201	-0.358400427978785	41.6556567213114	39.6405005229765	5156	-6	3384	912
3.51901769836318	0.286192834255753	-0.208760550989207	28.3916877204462	16.7112472976068	5163	-4	3266	802
2.20981193441359	0.328468229397022	-0.361265725261113	29.5108129460395	15.3575415515083	5164	-4	3286	802
3.25268105512075	0.156694513434184	0.460300945575068	53.6564488392259	41.2029253145784	5165	-6	3236	801
2.30325510574481	0.022435020519836	0.293557874139509	84.5884779406783	9.82364081644727	5166	-8	3288	801
0.447697320748442	0.671844111832816	-0.200614649115182	19.7347846900274	6.32765731614202	5167	-1	3272	804
3.12934363685185	0.193934027009077	-0.404437897033273	32.4527178988976	11.1533032492861	5168	-4	3267	798
2.86684823229994	0.090637221072004	-0.11544588429509	40.6971121302436	23.8628774800772	5169	-8	3294	798
1.41246729359575	0.485499687043605	-0.076960045514027	35.5438380150462	25.8991068195566	5171	-1	3247	800
2.02507433756857	0.338511699271193	-0.330347526810143	4.93893050114778	26.1876550235485	5172	1	3269	799
2.29504709643042	0.044776119402985	-0.166343941036301	67.7469459518326	52.0918056895908	5173	-2	3279	799
4.30308529756201	0.177570093457944	-0.201528735394986	66.0398435575117	75.6903823654945	5174	0	3255	794
0.89718427592236	0.235304691713104	-0.372784513296929	53.2956908852439	7.4739258551664	5175	1	3260	794
3.30979864353633	0.24290780141844	-0.439176366846578	45.1736238593682	31.6122840145982	5176	1	3265	794
0.477792402820598	0.694701020904229	-0.005043513363502	60.8698681547354	12.0132910808501	5177	-5	3263	796
0.90141716246131	0.439951573849879	-0.133690573179788	10.3435447692115	8.87533278637047	5178	2	3276	795
2.55299772372931	0.198986058301648	0.126613598078216	89.5022482511045	7.39087545623909	5181	-3	3256	789
1.60310947189491	0.502717391304348	-0.025578011197206	6.28036905194464	12.7817213603004	5183	4	3270	791
1.27969454191797	0.616302765647744	-0.066661277064769	6.35100989566357	10.3809134884336	5184	1	3281	817
0.981469162770596	0.042730299667037	-0.656174291211708	54.3654114206362	14.1809930373043	5185	-7	3317	818
1.36953059811839	0.490453790813503	-0.140691155334013	15.5269315121613	11.8605720588686	5186	1	3289	819
2.25129028652006	0.018859649122807	-0.173910256989924	49.0596651761476	40.7039934150488	5187	-2	3290	820
1.39641724391649	0.424380442062961	-0.044011395929244	28.0907690433659	12.2233914286275	5191	0	3282	815
5.12421571672489	0.005518328734726	-0.108415724713235	86.9500376660959	83.4362664315278	5192	-6	3283	815
4.31794253418655	0.286796901313574	-0.414742835420546	20.8111021647789	1.20101377193832	5193	-4	3280	816
4.90720769403495	0.315034862024943	-0.085187496986156	20.0648929920726	57.2501747785433	5194	1	3305	816
1.06995416210635	0.320926966292135	-0.189748323898795	17.1393901851981	32.7267174587114	5195	-2	3285	810
0.677470074303361	0.478293791014639	0.183868565982826	35.2302433148585	7.72361465126394	5196	1	3268	805
0.930414871946302	0.356992084432718	-0.331479032477106	26.083342887572	15.5164422028955	5197	-4	3284	806
4.01508315867398	0.000237416904084	-0.064620191124174	20.8990182498273	99.8725501172164	5199	-8	3295	836
1.50719959311968	0.397513321492007	-0.152164942066012	10.9086741611049	13.7003307689754	5200	-5	3309	834
0.355630027390309	0.726820054945055	-0.142165311860687	5.51118306029291	9.45063262415906	5201	-3	3298	833
2.9961157146156	0.194581810363363	-0.075040503046548	26.5035421446131	48.0418622154107	5202	1	3293	832
1.33448815004945	0.075421686746988	-0.233367641734294	19.6172746964277	50.5524333443752	5203	-5	3310	832
1.51429789059049	0.055592322964924	-0.157606646676968	12.891985263485	4.494310787263	5206	-8	3306	828
0.135132649609683	0.665350444225074	-0.208191615545502	35.8067928359091	2.66175239694828	5208	-3	3302	824
0.776903778862058	0.509545656356371	-0.125297491389655	16.2662060834042	22.6083675061939	5209	2	3292	823
4.69420844301	0.197193780811528	-0.118454120090206	34.9061974240632	54.9391149938414	5211	-4	3314	851
1.34903612889494	0.168653507914794	-0.269327246474011	61.9764070095491	25.7398085787095	5212	-4	3329	851
2.94981005353736	0.016099449765641	-0.525531695577629	28.4817543890893	11.8800132730464	5213	-8	3341	851
0.155979911065031	0.714754098360656	0.051813748144392	0.924966827110922	11.2597323514025	5214	-1	3316	852
0.918545275696866	0.463317582690873	-0.046862553076391	15.5479686339731	18.0686650761591	5217	-2	3315	848
3.39810417933327	0.138257091745464	-0.098551215483971	61.9595760372633	80.7592295463577	5218	-11	3336	848
5.41425391037654	0.005184174624829	-0.177208486772642	67.8342317565441	215.519037308073	5219	-11	3346	848
2.2554939680727	0.40858658948384	-0.045141561154558	23.2594068868516	21.0476915030165	5220	1	3287	845
0.28514373869359	0.559038461538462	0.026252486339341	11.1370801760864	16.4318538422099	5221	-6	3318	846
0.297801606498713	0.718622732321362	-0.043935141726406	3.81733572833074	8.23148988558521	5222	0	3307	843
0.501252421318031	0.249001331557923	-0.111340359049065	14.7698039438584	29.1622168238304	5223	-3	3322	844
2.90291270340338	0.198442202159674	0.349830268685817	22.3685545357241	42.6458726067841	5225	1	3300	842
2.14535294086324	0.264260332896952	0.328041006502644	16.5815926274575	0.863577036960152	5226	1	3313	842
2.41708532238118	0.120426829268293	0.304322839962614	32.0177098921397	22.2860795203843	5227	-3	3320	842
1.09979737638352	0.4069731564332	-0.064114520458482	61.3996825264564	74.1318505110313	5229	-3	3303	837
3.27530830156512	0.032640949554896	-0.140735411053592	42.0326829648579	24.8502981893824	5230	-2	3304	838
0.308394731488676	0.486452539027454	-0.155334686737639	19.4217563474918	11.0385808393754	5231	-2	3312	838
0.806266960956913	0.555737704918033	0.171734839862404	67.0673767294534	13.8615794244218	5235	0	3208	735
2.23464363011947	0.392496392496392	-0.153128693856228	42.4505340376261	21.8833884480169	5237	1	3207	740
2.32231346422994	0.405236691520721	-0.205227059803799	71.8165332081501	13.6399592788243	5240	-7	3187	727
2.44301723705903	0.261292064063344	-0.199163995478603	77.8666751635291	4.16553990979352	5241	-2	3198	727
0.565394870701908	0.653443619176232	-0.061991385624701	4.79691663762392	13.1422562460237	5242	2	3212	730
6.45037520905272	0.312669795011114	0.08616646426098	37.7560369903809	74.6241305640639	5243	0	3122	732
0.089989847212561	0.717948717948718	-0.142732398289651	2.31330508879643	51.0902940374351	5244	-4	3226	749
0.341104122414777	0.674009965906111	-0.165210025944544	43.426616692783	3.07265638408991	5245	0	3219	750
2.23324470056174	0.339317773788151	-0.243678420247204	34.615742827911	50.4407471823399	5246	1	3225	751
0.643373018836706	0.491578646874108	-0.142545814795902	4.99123844671686	6.11640546590975	5250	-1	3231	754
2.03004378777862	0.060320973990039	-0.087218306456752	73.3837806488368	20.1252995027723	5251	-5	3239	755
0.873103597371703	0.273441335297005	-0.364163805328788	77.6484467298106	3.90262924732476	5252	-2	3224	756
3.99384726195102	0.125568086180778	-0.289284940358635	24.8110770452758	18.8547724869111	5253	3	3229	756
3.07788796523623	0.047976779921462	-0.455469666997233	75.723180585331	41.1004007471174	5254	-1	3237	756
0.652230895461907	0.68	0.023149474736494	9.12204206205801	43.7372233767015	5255	3	3204	742
2.61871251905789	0.234329232571763	0.125126652892305	33.6340660807738	9.51406720003211	5256	-4	3190	743
3.35022776968624	0.119605142332415	-0.105414545929225	13.8923391303228	8.16519029996526	5257	0	3202	743
2.79116234040264	0.327272727272727	-0.290814738191751	32.0595831974245	4.34616849098159	5258	-1	3216	744
2.25043310582582	0.224700842074162	-0.101575550878086	41.4867261736992	34.2118353157335	5259	-3	3221	744
0.776578867992527	0.597240647386575	-0.161426218172853	4.64227421661749	10.3695873184495	5260	0	3209	745
0.937849612051407	0.496353836398225	-0.253478085897254	30.2207684973996	6.92645450701928	5261	-8	3227	746
3.38402111464379	0.039246196403873	-0.460672639834947	56.8032859909395	16.2037824452577	5262	-5	3234	746
1.59830478089954	0.288868994330051	-0.196410451789372	64.8557796528827	8.96575415520446	5264	-3	3220	748
0.220057241826988	0.712351251538777	-0.037244638821462	15.550295280553	12.1751557191135	5266	4	3242	772
2.70462853455971	0.287170639899624	-0.176469304387235	21.8887067666415	22.2024175452956	5267	-2	3248	771
2.47598274611714	0.129464285714286	-0.20294408656014	62.0783286265316	10.9361380872261	5268	-3	3273	771
1.49684473345888	0.531314521679284	-0.180269042990801	3.85874247666615	10.0293408852923	5269	0	3262	770
1.13422057183729	0.614294810569882	-0.054028950502398	2.33125640405893	9.06590227271663	5270	-3	3241	769
1.64560054256293	0.328385899814471	-0.135791076135662	81.6905634773974	61.3762544791979	5271	-3	3211	760
1.54996476061819	0.398255813953488	-0.102652878219252	61.8476282505277	57.056139994779	5272	3	3223	759
1.80265936737493	0.306840180684018	0.01198270178158	80.9755966090627	50.7659053969844	5273	5	3197	758
1.64589912040796	0.415141729458199	0.002328141976988	83.9622936381341	28.1785242430766	5274	-4	3222	764
0.813499826365314	0.360428481411468	-0.160932439563259	65.2698781120201	28.6085613058739	5275	4	3206	762
0.175358856069288	0.580957504034427	-0.014956819882734	15.4987320934687	17.0794567580882	5276	-2	3232	761
2.2867382417698	0.177712210621879	-0.298140267583645	75.5513839467774	34.8293390839179	5277	-1	3264	783
2.12497521893177	0.32544916988856	-0.309362830290419	56.2018872568038	12.8800153796789	5278	-5	3249	784
1.75675972378376	0.261111111111111	-0.10597440755799	62.7895251118024	13.641215583568	5279	-2	3252	784
1.34025774273187	0.282784810126582	0.127000360724635	43.1125977734866	9.88875083114256	5280	0	3250	781
3.29387329884741	0.169458342397216	-0.489856470805894	14.9853934574228	20.9320522271277	5281	-3	3253	788
2.16526007574981	0.102607031810572	-0.395485312402758	63.8553261570988	13.1621207783804	5282	-2	3278	788
0.570653440638062	0.646950092421442	-0.047294253936376	5.71843699512888	12.9710552605569	5284	-1	3244	786
2.6085191646675	0.202214022140221	-0.015121701825711	54.5933695748955	33.1694019014945	5285	-4	3230	775
1.1729238875683	0.486501007387508	-0.348081487182643	37.4371255582715	58.0342975193561	5286	0	3238	776
2.39604553720312	0.377878051602453	0.030323078682711	24.9262185362802	10.0733492867412	5287	4	3240	773
2.95446459693336	0.007274994803575	-0.187206821666719	66.7904921038373	21.5059368764606	5288	-3	3277	773
2.18616086718923	0.211369095276221	-0.433675803618408	21.0125989657361	30.1435413692816	5289	-5	3243	779
2.17399137629657	0.28704181724316	-0.111915704970364	48.6144478826307	11.0849290383703	5290	-2	3261	779
2.61314005932967	0.101524224278715	-0.00318869215171	80.9001153119492	19.7088551356949	5291	-6	3246	780
1.19237476940629	0.380425990833109	-0.205515178133275	66.2292286588959	2.18551716452948	5293	0	3161	684
2.69156678892046	0.023809523809524	-0.328849321713839	24.7631216148168	46.3441093946839	5294	-6	3154	683
0.710688657041726	0.425538103548575	-0.237695047180904	48.8999703777503	15.8937010404491	5295	-1	3141	679
0.406843354843838	0.635491606714628	-0.030408354341554	16.6143966633592	16.6470539284712	5296	-4	3145	678
1.99689723788632	0.225265392781316	-0.14648467837738	65.7198925089011	16.7399870417761	5297	3	3142	677
3.98368972088269	0.252446183953033	-0.263879778337084	64.4921035064795	34.2235099062281	5298	4	3151	677
2.15973079913277	0.268616544051678	-0.065078896268055	39.2254355362929	4.62086686825281	5299	-3	3165	692
1.46030681642407	0.129882264997197	-0.141640142541033	64.9650947840549	13.0490286312874	5300	-4	3180	692
1.4112459758277	0.021337397599543	-0.208503412589338	63.8384278598119	14.6122954436511	5301	-8	3166	691
0.169089962420523	0.72460824143935	-0.100875950855072	9.08406568334259	24.6228227787414	5302	-3	3160	690
1.66389413170088	0.588170137350465	-0.086827118678246	1.58857915919645	3.97586175816921	5303	0	3148	689
2.90251331469513	0.25505947783099	-0.316437166959517	75.1761311055298	16.5954186210349	5304	1	3147	688
1.967695787728	0.189963590311857	-0.29656224040515	65.2851055083855	8.85196921614389	5305	-2	3169	688
2.06297107365577	0.352914180816888	0.271519660460527	70.7031843480884	3.56979713133252	5309	-1	3143	686
2.7933103503136	0.267021769337656	0.248796822157589	88.9864063224457	6.58188957869884	5310	-4	3150	686
2.97841900954428	0.06180175897314	0.300744651551579	86.9422540372701	26.8428611917121	5311	-2	3181	686
1.26552532605086	0.137748344370861	-0.03697683645762	22.9478882166305	11.2920034129478	5312	-10	3164	685
2.88377851715434	0.292748091603053	-0.275011804225193	82.1118391805009	74.8963641176078	5313	-5	3138	667
1.9357093141354	0.087552742616034	-0.00645401821856	82.7171827217257	24.0030158965356	5314	-6	3140	667
2.45069313477884	0.019040063466878	-0.32528635620243	15.1057682532399	9.78469247659358	5315	-6	3144	668
0.483800341812501	0.570206022187005	0.177967553248838	37.9914711075814	58.7962930288786	5316	0	3108	665
0.482826721433179	0.716867469879518	0.063056792910863	10.2370997628555	10.8045428378869	5317	-1	3128	666
0.691552544883997	0.582883766552231	0.123267202188802	60.9788040385596	6.55114050968802	5323	-4	3105	662
3.76747662062056	0.118259915920307	-0.16300666568899	81.6309481927839	1.06082278916342	5324	0	3139	673
1.37617259053983	0.266523085206623	-0.288829744782155	63.1327747468346	6.459946755233	5325	1	3152	674
2.57860800966407	0.292522831050228	-0.266623175921811	83.7621964526754	2.32140405954431	5326	0	3155	674
4.72964397968148	0.019360516280434	-0.446146234155537	88.7931547303129	13.7819199753677	5327	-3	3171	674
1.05253393223073	0.387757212284149	-0.158145995910598	63.0695100317566	28.1824610720518	5328	5	3107	672
0.336942900678871	0.608008161183372	-0.119334765541463	36.1232306620203	26.9032252078432	5329	-3	3135	669
0.116345937537225	0.389197009886665	0.041768730589623	57.1779744318885	15.2653188669933	5331	1	3183	714
0.155176651530352	0.645640074211503	-0.125048023606303	21.1602994889957	7.48127719791447	5333	-1	3191	716
0.630204219462581	0.469495461262402	-0.038307927713177	21.1938661193101	7.07819487408594	5335	0	3185	710
1.09234184814949	0.532559313478041	0.03218892286583	25.8925055487512	9.08448457908206	5339	0	3175	711
3.1874880118807	0.245360122594926	0.121783820669796	81.7874283991768	68.6950069788868	5340	2	3205	722
0.289623099740204	0.731582537517053	-0.028103231353455	10.4398849832791	8.82495654459767	5341	0	3196	724
0.707921733444439	0.705249841872233	0.091551072326217	1.44785863730445	37.226105433092	5342	2	3195	723
2.35421709427916	0.04390243902439	-0.378413326931391	55.0379919278083	23.3927038615514	5343	-4	3186	718
2.06010421376024	0.121525215252153	-0.059629627265178	22.2378189740424	28.0441401725612	5344	-2	3194	718
0.410715847699883	0.717873731291932	-0.077058888292271	1.58559450832097	9.07391568642646	5345	-4	3193	717
2.10933322304655	0.441317047265003	0.0216203950873	77.6868248020593	17.4786095149509	5346	1	3192	719
1.02410256604833	0.042137718396711	-0.250512267067939	43.4973113395846	14.5804689188233	5347	-5	3170	697
2.3967500252271	0.457278723730634	-0.344674837156604	17.345416344081	4.11046376587704	5349	-4	3159	699
3.3633957581695	0.132456703014753	-0.375599174176196	61.8918895400938	1.73281299788195	5350	5	3174	699
0.632597906598045	0.672931795528976	-0.040357277680006	12.9661509005484	2.28020490750126	5351	0	3172	700
1.10360426899406	0.503267168043398	-0.359290143260749	49.6971817780068	12.4240994023768	5353	3	3149	695
0.36745774370065	0.766688697951091	-0.090236405277609	11.8813641180671	11.5523467410133	5354	1	3153	696
1.71235030680661	0.381804043545879	-0.31140551023259	65.5770383979628	34.2639014480634	5355	0	3158	705
1.29534944836611	0.391004415011037	-0.017677382095967	8.95778573953685	4.03748910101527	5358	-2	3179	708
0.878208000515352	0.611665790856542	-0.097110317032439	18.7968814398249	44.7480981672277	5359	-1	3168	701
4.13916960281858	0.060489678348536	0.297838769263563	46.1063446687418	195.505002897606	5361	-5	3066	616
1.28642211016671	0.298957452803607	0.086484378680604	73.4922074894651	15.1781640808837	5362	1	3074	616
4.06052432833001	0.146041180216515	-0.40854551300265	86.878131607223	20.1465994918514	5365	-5	3069	614
0.987569875994029	0.304933665008292	-0.429959606954943	86.0055798022863	8.71204646001854	5366	1	3070	614
4.72939455503077	0.091411042944785	-0.531612398911395	70.8253624525259	22.5243579512654	5367	-3	3080	614
2.74969874779247	0.031750266808965	-0.224158424552395	35.0601558961399	35.032606941823	5368	-3	3078	613
2.4998269472419	0.306895680727456	-0.188002127253467	50.693275262837	69.7708663964801	5369	-1	3055	620
4.29447469326644	0.23544106167057	-0.49432989094792	55.0531023551561	22.6881192178887	5370	-4	3088	620
1.35491843151549	0.377096204766108	-0.098525048120993	33.184659260044	12.8808930298861	5371	-2	3073	619
1.50246356579488	0.47485614210658	-0.307105039841735	71.0302725478714	0.446643451247772	5372	0	3072	617
1.63477739567751	0.158112582781457	-0.447299752458648	87.8982638728533	19.1529228844602	5373	-5	3076	624
3.18283208963834	0.185152619017711	-0.372989340806159	43.1196298359114	20.9956490653189	5375	-3	3087	627
2.2748364371425	0.081091322470633	-0.446226830099374	82.79538743278	26.7973087761746	5376	1	3095	627
2.41092628253871	0.067114093959732	-0.305424188924082	6.10125022989648	18.0451482437823	5377	-3	3077	625
2.19069952761626	0.268075117370892	-0.023917336752361	52.9181161543131	6.51798862691676	5378	-4	3079	625
2.97061032880866	0.360352591740922	0.058552192354386	33.1760392025069	5.04543901728	5380	-1	3047	600
3.48390187290656	0.095868748764578	-0.073889834849616	24.5454193866705	11.8546271497159	5381	-1	3092	600
3.36148785006685	0.024165593740715	-0.15210849929575	82.8966412749391	114.975538946731	5382	-5	3093	600
6.52779785484769	0.072697589551522	-0.247614806471535	28.521017415609	94.5196982265907	5383	-4	3097	600
1.20729938847711	0.482655826558266	-0.037945929563216	42.9393849491582	7.05489191635242	5384	0	3043	597
2.28284513418393	0.164245478802253	-0.118824694414961	38.8025420629743	3.8105286876619	5385	-3	3052	597
2.651932908242	0.291334250343879	-0.314169443276258	71.8614106200083	7.69266825794049	5386	1	3056	603
4.01448709186973	0.007520891364903	0.061510841232822	47.0717018716384	53.2465322705923	5387	-1	3083	603
2.61573406692004	0.164465786314526	-0.339374303748616	78.9593562965635	8.25762463631586	5388	2	3063	604
2.68125160327634	0.211649089165868	-0.594010070919281	50.2802180637012	9.44325228956783	5389	1	3068	604
1.70633736411483	0.37058219680305	0.098587316015788	85.1143294849016	28.7240215175553	5391	4	3050	607
0.123393356980035	0.782997191728364	-0.045522280902871	2.70021228177151	23.7075704041441	5392	-2	3057	608
2.02305674505959	0.379718168092602	-0.221375346956367	64.0864812480386	6.15733776006308	5394	-1	3064	606
1.79291651644359	0.493673647469459	0.266435548728415	40.8707990159897	31.0832116943388	5395	1	3044	611
0.332494131587445	0.716757387247278	-0.135372619526959	8.23028700257244	13.1533036429087	5396	1	3061	612
4.65952226804723	0.033982594280978	-0.062259783770926	77.8985191365093	36.9269327963962	5398	-7	3085	646
1.99983510168012	0.247791835760325	-0.134853213054908	78.0471447545108	14.8929434982266	5399	-3	3104	646
4.00622363029846	0.035571997723392	-0.571500308273721	72.7865265064115	9.83614524720761	5400	-11	3117	646
4.57905723985601	0.090419240373242	-0.137546042692267	69.9521880613988	23.0356339815597	5401	-5	3118	646
1.51446026332046	0.475571492604213	0.055611378021726	20.6823216433815	10.5661125592413	5402	4	3103	645
2.72388735192294	0.395142584254332	0.076682096961769	14.7365545415839	60.0543330902541	5404	4	3081	647
2.99226525679067	0.206593406593407	0.010017847384153	80.0250039462699	34.5552828848691	5405	3	3112	650
1.39878444232382	0.132429313329486	-0.263426189236442	64.4001471710834	30.4076448801238	5406	-1	3116	650
1.22825399621585	0.142169357122628	-0.045991752588061	61.7221182557029	12.7299194830314	5407	-2	3124	650
5.63098656721675	0.023440317345835	-0.148807519991266	88.7108146528879	132.153597308574	5408	-3	3082	651
1.60378994083676	0.24814167031045	-0.458446920896637	34.2575868213634	3.26089712356595	5409	-4	3113	651
2.88273600282643	0.19886197840677	-0.128293105072193	35.2245035089479	137.825397958824	5410	-3	3125	654
0.219263881960009	0.740696564885496	-0.095878294244568	24.5014106523787	12.6705085080323	5411	0	3120	653
3.25328997688573	0.299471423851999	-0.396028880800169	83.392962177264	14.1352007342475	5412	-5	3121	655
2.6796838504368	0.119458128078818	-0.289354679834192	35.9299335809031	17.5708505090614	5413	-5	3136	655
2.27383647802962	0.036228518346493	-0.116045746000913	66.1111088204254	22.6000652006974	5414	-10	3129	658
1.82036014652279	0.374047417442845	-0.097540677206645	82.1591288073748	2.65417763090089	5415	-1	3132	658
1.47940830431075	0.454252750201234	0.105163085189375	5.91424075155966	25.4516903297734	5416	-4	3119	657
2.04792350602967	0.281153738448614	-0.315483183236413	53.6765192974394	13.773967556722	5418	-1	3075	629
0.168558754713554	0.784207525655644	-0.039865308659691	1.81999943204741	16.9928388079254	5419	0	3086	630
0.871306256268954	0.51401214385801	0.024058179387647	36.1986988346267	1.27135769731375	5420	-1	3089	632
4.2813161405341	0.191623476677406	-0.138167158971771	43.1216660434258	101.896244650229	5421	3	3109	633
3.05795119210281	0.265684153596539	-0.021321985597095	68.8490091844423	80.2814226239464	5422	1	3110	633
3.49230577498793	0.000930405656866	0.227242305509293	48.8980167219285	148.145872601853	5423	-8	3115	633
1.01879433343487	0.372596994058022	-0.194114888042876	31.5639888336703	4.07772551293134	5425	-7	3114	635
0.318090122852005	0.770337922403004	-0.059649440576385	1.56259719685417	23.660674757171	5426	0	3094	636
0.767730385471086	0.555515887183149	-0.221327537706326	11.6914617300923	22.4224808456974	5427	-1	3090	637
1.14599210316428	0.474193548387097	-0.117681416448274	64.9094402020255	15.5011411420454	5432	1	3101	639
1.62976549948098	0.426967693650992	0.304258620676709	12.9081730786648	7.29606485891656	5433	2	3098	640
2.89099574785637	0.102974828375286	0.251183155479016	88.8158111202557	3.1953339171403	5434	-4	3102	640
2.78163471751178	0.120752673615812	0.064681331963073	79.6862053434715	9.92343248968329	5435	-2	3106	640
5.61874044188515	0.004658901830283	-0.338157944416634	41.0681756064794	169.920475415768	5436	-5	3111	641
3.88217988431309	0.125242284180707	-0.193272561487394	68.8257215570138	38.8091150994804	5437	-1	3130	641
1.37759793053479	0.298248989801809	-0.258078402771027	69.3842074909227	31.8477652549488	5439	-2	3091	643
1.23386791251946	0.436739015352038	0.077397846700847	54.2644884087929	16.1427152804495	5443	-1	3007	561
1.39397340560275	0.468795355587808	0.351023584307782	82.7260420766753	79.8481784215338	5444	3	2973	562
2.41866909943184	0.274756817094562	-0.388812308961698	57.6198316130316	32.6039259514162	5445	-1	3000	559
1.35003144140944	0.192775151924375	-0.346418619549044	85.1521491034744	6.17686721518915	5446	0	3012	559
1.23019260206697	0.494897959183673	-0.079642928304022	13.3564458995882	6.15265518702723	5447	0	2996	560
1.46004046793006	0.122992299229923	0.025561010705985	30.242537061445	9.11053342259974	5448	-1	2999	557
2.8386069756482	0.230564876957494	-0.134615410295752	35.2853988683623	73.963661142814	5449	3	3008	557
3.4004986341931	0.11847692096973	-0.187978151281031	57.5997637190562	16.556836015987	5450	0	2995	555
0.890985236336716	0.27481228668942	-0.415618479430833	51.4567651575476	12.4304163949204	5451	1	3004	555
4.00551360464887	0.071027781579308	-0.139778615070054	85.8179096851723	8.04098073899047	5452	-6	3018	555
0.169999544496408	0.74822695035461	-0.127661684493878	6.87294447637086	11.4173481772265	5456	-2	2994	554
1.13111490239457	0.613327076489911	-0.088493848703552	4.39861613079371	4.78546357020257	5457	2	2977	551
0.984025297166847	0.524347343084614	0.319108020381824	84.4851661890098	17.1080842078677	5458	2	2967	552
0.938625530703264	0.536801541425819	-0.266792838989458	54.0139665429567	12.7558386988008	5459	5	2985	549
3.23616585763363	0.118077324973877	-0.458273705033049	26.5886610587909	6.01183535501522	5460	-1	2988	549
2.19445015235852	0.363982139904085	-0.240252562660631	39.2841461078946	18.8942157148022	5462	5	2991	548
1.28634287749627	0.520423859169373	-0.114392219539479	22.1039694613625	7.58280022774903	5463	2	2982	547
3.52121827608662	0.22646952758745	-0.19102430790408	49.123879155101	7.50384551565855	5464	5	3001	547
0.609055751287527	0.58499071864227	-0.020176925169473	9.47612654102575	9.7089959957827	5465	0	2987	545
2.29458351324417	0.324802408731652	-0.28486930580171	89.5101147502722	67.6156616584697	5470	-4	2966	542
1.91877762823618	0.274586466165414	-0.048339536918081	60.6291481548075	10.481025651472	5471	-1	2983	542
2.38713532323718	0.379548156956005	-0.088657491265152	67.1901089709502	48.8519208029525	5472	1	2975	541
3.2851004911694	0.12895816242822	-0.050523240018045	57.8656557893564	20.2685183075056	5473	-2	2981	541
1.43044151781373	0.1335	-0.21120113106496	41.1298906995696	16.9899627360021	5475	2	2974	539
3.65148775960005	0.048959011060508	-0.117303211601809	54.7807663370988	21.6162998958579	5476	0	2986	539
1.61381688732961	0.024695478057734	-0.268892566819877	57.790528015762	20.5005378121262	5477	-3	2989	539
0.457883993577769	0.614299378287901	-0.100080596015151	17.3218272810362	74.9358451373649	5479	-2	2968	536
0.645706313175498	0.662492546213477	0.10633531087964	26.3225289120604	5.70302269207603	5480	4	2953	535
4.6982086611563	0.00951825951826	-0.064428874976853	33.909433728683	42.9925474644151	5483	-8	2955	533
0.28810021247869	0.538461538461538	0.048456115720996	16.1798159311786	25.7172462134807	5484	-2	3053	595
0.927165205624957	0.395366598778004	-0.457920822695258	17.2007243455355	3.99184737885185	5485	-3	3032	596
2.25686816918077	0.139592037355616	0.089571815189481	25.1814303152621	8.97180408645282	5486	-1	3058	589
1.44481080991343	0.20292006928978	0.230313835877061	25.1826985307967	13.4890609594412	5487	-2	3059	589
0.416165663267692	0.658725761772853	-0.086562766992737	4.00146329307132	1.0538136956849	5489	-1	3035	592
0.812897096941504	0.587113402061856	-0.155956208582186	27.8755268535023	1.7814325483792	5490	1	3027	585
2.09899021786113	0.328032481813568	-0.179212511992542	72.4963501764906	43.6783827050151	5491	1	3031	586
2.66195875721452	0.279382925872663	-0.23435358808434	56.3907838508225	60.3640331055148	5492	2	3045	587
3.87064117813002	0.215156680215026	-0.357667477782163	61.3582265656521	68.9654896770263	5493	-2	3060	587
0.318723399081072	0.677097383328837	-0.106607387843669	3.61048664680989	16.1178150984443	5495	-2	3040	581
3.58925711019188	0.227594114274795	-0.448685725688973	65.569409635269	14.8673782337703	5496	5	3030	582
1.13364158278796	0.213826366559486	-0.261532626851427	87.927347939731	15.1649423738934	5497	-1	3036	583
2.52066731550236	0.036716314513336	-0.052733310794985	72.1792856692594	66.0839050117491	5498	0	3037	583
2.51620673809089	0.066829098503307	-0.200395840074125	53.8152579878949	35.2190862468547	5499	-5	3038	583
1.87102840366208	0.047977085571071	-0.322939373589925	89.1035810284148	19.0540105807885	5500	-1	3051	583
1.0196576440133	0.590039147455415	0.29375518817187	21.7753528863276	7.39716378248676	5501	1	3023	584
0.989314070890433	0.199610688373739	-0.214342188368892	41.4532678840596	17.4674590991574	5503	-5	3041	577
3.51854035675134	0.064909798372833	-0.078817580491804	64.4281879409485	14.6101902308254	5504	-6	3049	577
1.00633051616985	0.422094691535151	-0.256673577279179	32.8021358154733	16.4941905298273	5505	0	3015	580
4.90428462865391	0.058146670757901	-0.274457845021939	82.0785385044147	41.6094358460263	5506	-3	3019	580
3.89130729835886	0.004641485275288	-0.156587250006422	44.6718294878349	49.8606020691421	5507	-7	3022	580
2.20083810271952	0.251994960100798	-0.026385165382167	57.9549601002737	50.1066956135819	5508	4	3021	573
3.56157270344999	0.232379623168179	-0.302166871941809	46.4787497681465	18.2507191612867	5509	0	3024	573
3.65926910211312	0.026884650317893	-0.610153595081352	82.9677975447767	40.9219547353491	5510	3	3025	573
1.09365245096779	0.393175451998981	-0.379963881755932	41.6293384191341	1.68250405788793	5511	1	3033	576
2.65871628289784	0.317812758906379	-0.043520758086321	69.530023164517	40.3395658132093	5512	3	3028	575
0.794401576655717	0.645635028555888	-0.051868453327994	19.1774149698361	38.969717284316	5514	-2	3003	569
3.09985749644004	0.092264416315049	-0.39316879204395	34.3882569602182	13.6344383909218	5515	0	3054	572
1.69820719939675	0.288221709006928	-0.535772011914949	34.6945769675071	2.03938202298742	5518	-2	3006	566
1.37146348248496	0.328463203463203	0.005497135703787	84.0504744471295	11.7144479265741	5519	3	3016	568
1.90883851506318	0.458647906657516	-0.007488254078936	34.1587357004677	17.8950155325076	5522	3	2917	495
1.23650088869336	0.279396640383956	-0.331483391567948	53.5517390652348	15.2539686395669	5523	-2	2928	496
0.388207168432369	0.664860525787678	-0.210400107478457	28.8502476034656	29.8959851889863	5524	-1	2902	493
0.285022140729808	0.621664675428116	-0.06144765135993	2.04444243069091	10.5635286754322	5525	-1	2908	494
0.812194404352339	0.517059211974466	-0.131705152813725	11.3853327824714	4.57812468548545	5526	0	2925	498
0.562180041009902	0.598154792414147	-0.254112430342675	52.5694188421385	46.4005009267448	5527	-1	2904	487
2.73979341140634	0.304203413125644	-0.349979304193037	69.6869390101586	42.5162585408704	5529	5	2889	485
0.6668896435142	0.406169060513303	0.057080765564762	24.3169781174229	6.8485387255596	5530	3	2903	491
2.11306634546139	0.277736822705492	-0.223927246891136	28.9177032271813	69.4110699324771	5532	-7	2920	489
3.41244696720323	0.227454909819639	-0.305784982715046	61.8283283663283	74.5504423407883	5535	-3	2887	480
1.11275000524912	0.009043112513144	-0.169157337854494	46.6017567142217	19.0681870150038	5536	-3	2918	480
1.78040454275953	0.162776285891345	-0.294947592295039	86.173194651896	18.5394469871547	5537	-5	2919	480
6.79457529618428	0.022062879205736	-0.384568697658586	67.787120442245	197.886806122979	5538	0	2957	480
0.824080211462129	0.55688622754491	-0.167537636311449	83.5964867346419	17.7660043121283	5539	0	2893	479
0.742923371055921	0.688731284475965	-0.027781111265034	3.25594514815591	16.9983937222852	5542	0	2897	477
1.81992330254433	0.11308651026393	-0.0299098707747	64.0389347034945	19.4839349325496	5547	-4	2933	481
0.315692371213907	0.67412890413432	-0.05108041360024	7.07088892505643	9.92706193980169	5548	0	2882	471
1.24905711139467	0.443013100436681	-0.108798431375608	26.522503429495	5.47503561111666	5549	2	2894	470
2.50035190633688	0.053745541022592	-0.138470437138074	89.3161316411373	25.2586979326298	5550	-6	2905	470
1.89795554196478	0.389019377568996	-0.037346656797835	11.9505056305825	22.8952091976037	5551	1	2858	469
1.97765186585815	0.005022930770911	-0.150631291337776	88.7685335769345	96.959822579354	5553	-7	2929	474
0.801658197431867	0.465863453815261	-0.156052150905513	2.40322239150969	4.3052658048039	5554	-3	2896	473
1.22322575212757	0.525680302757254	-0.285565362878197	74.6503812308418	39.4279605203452	5555	1	2941	525
3.3412886320532	0.257748776508972	-0.133834127186126	53.4306008546886	9.11192853290642	5556	5	2944	526
2.43468632782978	0.245693030540329	-0.276955046093282	19.1190458735682	11.4815001004459	5557	-2	2963	526
0.444367256356267	0.494624926166568	-0.223324355750992	28.1427973994316	54.8700822896936	5561	5	2949	529
1.58520751954308	0.354907161803714	-0.307156998327707	52.6057889938689	13.8510087951763	5562	0	2946	530
2.34831449930799	0.080556221529609	-0.363150950126562	67.2621966313863	23.2750535432024	5563	0	2972	531
2.02743433256288	0.396311066799601	-0.164935585189781	23.8713437527699	3.52613990376249	5564	-3	2976	532
2.79865837986088	0.211372277912202	-0.179068178564998	22.6134061505883	4.6852438035538	5567	-1	2939	518
1.68115610837626	0.283516867680475	-0.526607698790252	66.0474062230981	9.8295509471351	5568	0	2952	518
0.629004915078888	0.126500162179695	-0.120327956288021	30.7814016619311	40.3612038257399	5569	-8	2954	519
0.658401592454061	0.604431314623338	0.014192642626734	4.25884454096218	66.9721845652986	5570	0	2947	520
3.01904212127784	0.244611528822055	-0.355460741196438	66.173435050234	42.9435958729023	5571	3	2931	521
1.1782902426799	0.197021764032073	-0.129559349471748	87.0362633204837	10.1593904231003	5572	0	2961	521
3.36854019809238	0.128774595752971	-0.182239932598458	72.7097735530246	15.559587536679	5573	1	2962	521
1.32257238652099	0.476610933684013	-0.094891033968272	45.6588029119663	4.99932253015183	5574	1	2943	522
1.56860510956473	0.342359165888578	-0.016774690486205	60.7010304469611	9.18801694544787	5575	-1	2951	523
2.695898967642	0.448607949571003	0.246439120285747	17.8422691224656	38.0101297036855	5576	2	2916	524
1.28434387293638	0.368743497861519	-0.144981100493343	15.5670939373663	1.09326041446101	5577	6	2942	510
0.734180082375287	0.591649159663866	-0.038644067339453	33.9213304869619	8.82988971603301	5578	3	2930	512
2.01331846942604	0.363449222323879	0.12101102620309	18.3723034085822	32.5049295879688	5579	0	2924	514
1.88973401521408	0.2428913101249	0.050111856031762	27.5870863473377	22.390909795106	5580	-4	2934	514
0.701637105292589	0.603760445682451	-0.110748220790291	9.27617603592651	6.57345603544773	5582	2	2940	515
1.55111187971321	0.353667572240059	-0.265782345005921	34.8417597087002	15.6407233464234	5583	-2	2937	502
1.87620465911087	0.108000990834778	-0.386924147666395	85.0476136243131	10.8435713639328	5584	0	2938	502
3.96479310265774	0.126018946904605	-0.3182282243998	85.3668125690965	18.1330520263509	5585	-3	2935	501
0.240143125858142	0.70099829559289	0.000444253242374	3.56861193406991	33.4574122887951	5588	-3	2927	506
2.18431963837711	0.213740458015267	-0.172694751075331	7.63694009676885	4.96225210471622	5589	-5	2950	505
0.74296855574031	0.553873552983081	-0.085286150545174	36.1081476685909	3.59910887184029	5590	-1	2936	508
2.55466012660319	0.204649109901427	-0.051165189945383	35.156195884797	12.9356786090358	5591	-1	2923	507
5.19654750658946	0.105664325212973	-0.267332159922955	17.8488689684824	13.79340069069	5592	-8	2971	507
1.36959009098601	0.427517218760249	-0.101526756760398	15.2663403245857	19.0255707249961	5593	-2	2856	439
0.3720289777346	0.623275003556694	0.064823398714348	19.6292079235888	24.8013182148974	5594	-1	2847	440
0.53088615176996	0.432852083900845	-0.031563802924916	32.3103329721568	11.9828405566844	5597	-5	2851	438
0.530694861924408	0.580490555398929	-0.494856417248067	21.1225528747624	6.09109859369402	5598	-3	2861	443
1.72148622467928	0.307469414037347	-0.122291665492507	21.4123792125069	32.8233500734048	5602	-2	2868	448
1.05841402198516	0.605490196078431	-0.081070453572592	13.2378750458605	4.33886225160409	5604	3	2860	446
0.787116363608887	0.590446358653093	-0.066125769554807	3.93872411578055	4.7217279746194	5606	-5	2864	452
1.23699001606398	0.351085544627946	-0.16924093463811	14.2561612081488	17.1906335607689	5607	0	2859	449
3.85807960532562	0.086643342251492	-0.216451430513538	67.477503472369	47.048065535526	5608	-3	2911	450
2.47103569414723	0.266317365269461	0.053332604129914	42.5222501366332	114.8788166973	5609	0	2866	450
1.44073053648961	0.276748971193416	0.126893390314165	80.5398151502666	6.93468893747921	5610	-4	2869	456
1.26002749714759	0.578183985694417	-0.013081265022609	4.50680473547212	2.38256360241773	5611	0	2886	455
3.3172276386885	0.093862815884477	-0.256668495976979	70.2002564356982	43.6143533445317	5612	0	2906	453
3.01671732891704	0.176563321071992	-0.157807506445414	78.4385602317007	17.704083139268	5613	1	2870	453
2.05863475468219	0.27159209157128	0.122530171786388	9.19276155123556	1.25933854112421	5614	-1	2888	460
1.46970108068815	0.387588800668617	0.145332605082301	8.77837683546894	10.6988930375293	5615	2	2878	460
1.43789978347531	0.028904799787855	0.2647723020858	79.5918768563609	15.3471625388116	5616	-4	2885	459
1.63823452684608	0.084287200832466	0.017451720382211	43.9042870563705	18.8977397381727	5617	-4	2877	459
0.863055467657559	0.544505831798649	0.025000212146629	27.6573111800089	37.0235761391262	5620	3	2872	464
2.74218586131131	0.237801350048216	-0.094855611896505	62.2105503897261	10.961345468049	5621	-1	2874	463
5.01090244927827	0.009061964241979	-0.901814893210239	47.7705675374036	25.9881851173774	5622	-4	2890	462
3.19112677311159	0.278882109820901	-0.574675033378215	60.9465934776333	22.8528988204605	5623	-1	2899	462
1.15993554500956	0.221772272510719	-0.563497178322661	49.2824467629498	3.66389334325051	5624	0	2883	462
2.7222639342489	0.017851346965271	0.078071084682205	77.0208533657112	37.7697818425871	5626	-10	2879	468
0.932911866461342	0.239043824701195	-0.039318566773665	61.8584182317232	14.1685118133554	5627	-6	2880	468
3.05035853109932	0.01585601028498	-0.125101187136019	75.8452695624552	24.8764290710913	5628	-3	2895	467
3.1835715858687	0.115821678321678	-0.546142082691839	12.644668604261	11.5691872467511	5629	-3	2912	467
1.1289793705385	0.536670195070316	0.076997130918714	9.43540118940692	2.19046777559384	5630	0	2873	466
2.4760495420436	0.094019138755981	0.094662404414838	79.3450856656425	25.3660820772362	5631	-7	2881	465
0.307904833926254	0.662102019856214	-0.010727085893377	6.25981039023779	13.5452119486023	5632	-6	2818	405
2.09502930337705	0.266350474288567	-0.292444889185953	26.7502371673649	23.298784488	5633	-7	2821	406
1.49799667415784	0.244956088298125	-0.244424543857621	36.0948582659151	29.9995634337347	5634	-6	2831	406
1.79591861040194	0.347845702684412	-0.248392859743825	22.5262570827166	22.7566132519512	5635	0	2835	407
2.25484703395384	0.457938207402875	0.496692464474978	22.9918280677581	33.3092911947772	5638	2	2817	409
2.24659454926345	0.327881519639408	-0.076578310922979	59.9049496461278	98.6460393913795	5639	-3	2820	410
2.77551890413019	0.309850746268657	-0.173854581642731	57.411057852822	7.95315067489501	5640	-5	2841	410
3.57960601669237	0.165729792595464	-0.242671552164848	48.6078804073278	11.0983346748117	5642	1	2850	412
1.31840999262677	0.213506139154161	-0.122969755275252	30.1102513626756	5.97250067658104	5643	-1	2840	413
1.53113018507533	0.464033264033264	-0.345720746498525	46.6167547930244	8.78575295197936	5644	1	2827	414
1.27674821786063	0.513906334110892	-0.082175630991605	17.6019410752848	55.4964217314402	5647	-1	2834	417
1.74492882360585	0.187284768211921	-0.175732710360613	44.352383650382	12.112578697333	5648	2	2838	418
0.567666912540363	0.11961466416912	-0.191153293392198	45.0046694355106	10.747226817373	5649	-4	2845	418
1.29070198271938	0.605011053795136	-0.011415474184182	54.545850219194	10.3218072125877	5650	-3	2826	419
2.50729689839681	0.351087533156499	-0.08248418074796	72.8691322600299	32.4802201785538	5651	2	2833	420
0.889459427703123	0.2857847976308	-0.271223442199674	22.7923224370144	28.0155649445105	5652	-5	2844	422
2.73541035522629	0.076144984546221	-0.230929331568019	34.0227203128913	18.1112338307672	5654	0	2852	424
0.459311926215204	0.59391331079004	-0.244874557268098	16.7780061801898	14.6334791376629	5655	-3	2839	423
0.579612838805692	0.684754521963824	-0.012476699977665	30.2575725890495	18.6165665223052	5658	1	2837	428
0.321347609394465	0.657790927021696	-0.092190761079264	2.56656340176277	3.26373886490324	5659	-1	2848	429
0.181195888022651	0.645841468176494	-0.048956966797653	7.07806922515033	32.7141639768808	5660	-1	2842	431
2.18616458224755	0.381135296628254	-0.117761524336557	9.93518603427384	21.502342936329	5661	-2	2862	433
1.67544324714422	0.17420814479638	-0.205427944777073	49.8817343401046	23.5963428563448	5665	-1	2810	378
0.817663172146186	0.014861388968277	-0.04472135714046	72.9179000731284	13.8055236845865	5666	-4	2811	378
0.801491433096226	0.605381165919282	-0.253678804675702	19.046064000454	9.85960312957855	5667	-2	2791	375
0.279083303584991	0.648896068928379	-0.048969508699352	21.9861055607394	31.9591596674654	5668	-1	2789	376
0.62267164513449	0.629316047096177	-0.010164400788178	15.4994151690669	46.8760939937428	5669	1	2782	373
1.36868865792422	0.433072731580194	-0.056259641642977	20.5347812765811	47.8642280835764	5670	3	2799	374
2.93637646964537	0.229103214890017	0.231136175441123	39.9996617236565	28.8209302652036	5672	-2	2795	388
1.40382744277486	0.104046242774566	-0.168721027705749	20.2797923488518	43.0093878420779	5673	-2	2815	385
1.10951511803044	0.381128205128205	-0.126229216870611	8.43054921543202	4.73407871008054	5677	2	2805	396
1.21056832591121	0.365170852202552	-0.236808849230172	50.3151758913959	42.2868734608273	5678	-3	2812	395
3.26981146613217	0.08271375464684	-0.165194125076861	73.3703852370628	39.672472632128	5679	-5	2816	395
0.366240881898057	0.591285162713734	-0.184772886855757	12.6558614137201	5.92502989628636	5680	-3	2808	394
0.657568972151173	0.549271229404309	-0.045545316476273	2.45860922854758	1.64539718935831	5681	-4	2814	393
3.03359661444497	0.099325236167342	-0.476432260014352	15.0896338396461	15.6050529285914	5682	-7	2807	392
0.469555963230281	0.617141741507224	-0.1247080444779	2.45531126109652	12.2126133682421	5683	-1	2804	391
4.29776908929586	0.116338083154402	-0.52448269426883	27.5940252916579	19.7233159749073	5684	-6	2803	389
3.0567552278724	0.023755656108597	-0.288266713594439	88.888741143983	88.1729337116157	5685	-2	2832	389
1.56812747019906	0.373672467648371	-0.304045498337956	52.6817219654817	3.79277385679902	5690	0	2836	401
2.87548912535949	0.075606585788562	-0.401217497036591	48.7073967610924	12.9802274509927	5698	-7	2758	337
0.851547775019161	0.461522965350524	-0.124050348391699	11.8412667552094	9.50412264684237	5699	0	2759	337
0.500002487393622	0.733416187665061	0.075157002566284	63.7040522488827	16.1917331909086	5702	-1	2752	334
1.40526196500973	0.369595216191352	-0.496195825852934	37.5160754051168	11.9247507768374	5703	-6	2754	333
1.24159892109131	0.385871433482296	0.267693164484228	13.5512568759584	35.1186443890759	5704	-2	2750	335
0.251047090013296	0.752730696798493	-0.062415507132093	3.28661721090525	9.44544781687789	5705	-4	2793	367
2.17209353915561	0.372154823801271	-0.252449521781792	37.3378558001258	96.6934038808113	5706	2	2790	368
0.203432181485506	0.658017572762218	0.064023251947599	13.0609571035309	7.43764248395793	5707	-2	2774	365
2.20656422575559	0.387134366623937	-0.118660030341907	28.3009956081066	65.8641048570735	5710	3	2792	369
2.022334831804	0.492347284301774	0.032357211830765	31.7021741170648	62.812022676999	5711	1	2777	358
1.89773337910904	0.029955621301775	-0.046328765916215	65.1883434008783	1.83803593487098	5712	-1	2785	363
2.93140543760948	0.422025371828522	0.222350531625656	56.5049729216682	36.584888110735	5713	5	2775	364
1.63201098000978	0.518008474576271	-0.025454772022119	9.6793335655246	3.78815819432386	5714	-3	2784	361
3.43135934080454	0.050615043355515	-0.235476625122887	73.126438879282	30.8372465021248	5715	-5	2776	362
0.623450777308281	0.251457286432161	-0.026945451223067	7.01219660405843	27.7792318522086	5716	-3	2778	362
1.98199867614106	0.389125532448008	-0.04896835792259	14.1686690866649	58.4414487323833	5717	-7	2767	352
3.61138031599104	0.307086614173228	0.129148429057311	27.306960118953	30.4322343720462	5722	-1	2753	349
0.986128379240503	0.065401384970505	-0.739008749916286	15.1529544810012	5.64567070162536	5724	-5	2788	354
3.41161462716649	0.228371193813436	-0.186219357637971	16.3230626406501	2.98456946651885	5725	-2	2797	354
2.47040800942931	0.533940182054616	0.26297613680443	56.6423383419158	14.0776562445164	5726	0	2761	344
0.8961864238288	0.315396578538103	-0.393366757415255	44.2476213139732	29.9784767491672	5727	-7	2762	343
1.62520129831541	0.396499622261395	-0.087379567860374	14.4193846556958	50.6293492174272	5728	1	2764	342
2.74988571957378	0.296722671644887	0.22012645652027	83.4021067989208	52.1073000815738	5733	-2	2763	346
4.10097296816821	0.069332944095753	-0.065186299865862	73.254051303977	16.6344182342584	5734	-4	2773	346
1.59711764908011	0.026704146170063	-0.540731322274219	77.3897684151188	19.0909863846775	5735	-7	2779	345
3.66882920073686	0.190175904414205	-0.194132307948868	30.1249842299494	33.2111709048893	5736	-6	2780	345
