Handle database migrations

4 jobs for master in 7 minutes and 24 seconds (queued for 1 second)
Status Job ID Name Coverage
  Test
failed #242255
lint:2.7

00:05:26

failed #242256
lint:3

00:05:27

failed #242257
test:2.7

00:07:23

failed #242258
test:3

00:07:15

 
Name Stage Failure
failed
test:2.7 Test
  File "flatisfy/tests.py", line 447, in test_real_duplicates
self.assertGreaterEqual(score, self.DUPLICATES_MIN_SCORE_WITH_PHOTOS)
AssertionError: 5 not greater than or equal to 15

----------------------------------------------------------------------
Ran 7 tests in 25.098s

FAILED (failures=1)
ERROR: Job failed: exit code 1
failed
test:3 Test
  File "/builds/phyks/Flatisfy/flatisfy/tests.py", line 447, in test_real_duplicates
self.assertGreaterEqual(score, self.DUPLICATES_MIN_SCORE_WITH_PHOTOS)
AssertionError: 5 not greater than or equal to 15

----------------------------------------------------------------------
Ran 7 tests in 62.121s

FAILED (failures=1)
ERROR: Job failed: exit code 1
failed
lint:3 Test
npm ERR! You can get information on how to open an issue for this project with:
npm ERR! npm bugs Flatisfy
npm ERR! Or if that isn't available, you can get their info via:
npm ERR! npm owner ls Flatisfy
npm ERR! There is likely additional logging output above.

npm ERR! Please include the following file with any support request:
npm ERR! /builds/phyks/Flatisfy/npm-debug.log
ERROR: Job failed: exit code 1
failed
lint:2.7 Test
npm ERR! You can get information on how to open an issue for this project with:
npm ERR! npm bugs Flatisfy
npm ERR! Or if that isn't available, you can get their info via:
npm ERR! npm owner ls Flatisfy
npm ERR! There is likely additional logging output above.

npm ERR! Please include the following file with any support request:
npm ERR! /builds/phyks/Flatisfy/npm-debug.log
ERROR: Job failed: exit code 1