<?xml version="1.0" encoding="UTF-8" standalone="no"?>
<!-- Created with Inkscape (http://www.inkscape.org/) -->

<svg
   xmlns:dc="http://purl.org/dc/elements/1.1/"
   xmlns:cc="http://creativecommons.org/ns#"
   xmlns:rdf="http://www.w3.org/1999/02/22-rdf-syntax-ns#"
   xmlns:svg="http://www.w3.org/2000/svg"
   xmlns="http://www.w3.org/2000/svg"
   xmlns:xlink="http://www.w3.org/1999/xlink"
   xmlns:sodipodi="http://sodipodi.sourceforge.net/DTD/sodipodi-0.dtd"
   xmlns:inkscape="http://www.inkscape.org/namespaces/inkscape"
   id="svg2"
   version="1.1"
   inkscape:version="0.92.3 (2405546, 2018-03-11)"
   width="2481"
   height="3503"
   sodipodi:docname="E04P01.svg">
  <metadata
     id="metadata8">
    <rdf:RDF>
      <cc:Work
         rdf:about="">
        <dc:format>image/svg+xml</dc:format>
        <dc:type
           rdf:resource="http://purl.org/dc/dcmitype/StillImage" />
        <dc:title />
      </cc:Work>
    </rdf:RDF>
  </metadata>
  <defs
     id="defs6" />
  <sodipodi:namedview
     pagecolor="#ffffff"
     bordercolor="#666666"
     borderopacity="1"
     objecttolerance="10"
     gridtolerance="10"
     guidetolerance="10"
     inkscape:pageopacity="0"
     inkscape:pageshadow="2"
     inkscape:window-width="1920"
     inkscape:window-height="1018"
     id="namedview4"
     showgrid="false"
     inkscape:zoom="0.40084169"
     inkscape:cx="1161.5523"
     inkscape:cy="992.16544"
     inkscape:window-x="-8"
     inkscape:window-y="-8"
     inkscape:window-maximized="1"
     inkscape:current-layer="layer3" />
  <g
     inkscape:groupmode="layer"
     id="layer2"
     inkscape:label="artwork"
     sodipodi:insensitive="true">
    <image
       sodipodi:absref="C:\PRIVAT\Vevsida\Teikneseriesida\Pepar &amp; Gulrot\webcomics-master\webcomics-master\ep04_Stroke-of-genius\lang\nn\../gfx_Pepper-and-Carrot_by-David-Revoy_E04P01.png"
       xlink:href="../gfx_Pepper-and-Carrot_by-David-Revoy_E04P01.png"
       width="2481"
       height="3503"
       id="image10"
       x="0"
       y="0" />
  </g>
  <g
     inkscape:groupmode="layer"
     id="layer3"
     inkscape:label="speechbubbles">
    <path
       style="fill:#ffffff;stroke:none;stroke-width:1.11083305px;stroke-linecap:butt;stroke-linejoin:miter;stroke-opacity:1"
       d="m 429.55613,2404.9985 c -5.97038,-45.7602 -11.94075,-139.1296 0,-159.4675 7.59865,0 20.08217,-0.4622 20.08217,-0.4622 l -11.94075,-24.9601 21.71044,6.0089 10.85523,-8.3201 -7.05589,-13.8666 19.53939,6.4711 9.7697,-13.4046 16.28284,9.7068 8.14142,-13.8668 17.91111,11.0935 33.10844,-6.009 c 81.24454,-2.4492 161.58061,-6.1879 246.95636,-2.7734 l 26.05256,-8.7822 7.59864,12.9422 13.56904,0.4623 13.02627,-5.5467 13.02629,6.0089 43.42087,-4.16 14.1118,12.0179 16.82561,-10.169 5.42759,13.4045 16.82562,-8.32 2.71381,8.7822 40.16431,-10.169 -5.9703,20.8002 c 0,0 29.8518,9.2445 51.0196,2.3111 2.171,4.6223 -1.0858,12.9423 -1.0858,12.9423 l 10.8553,4.6222 v 12.0179 c 0,0 21.7106,15.7156 23.8815,19.8757 2.1711,4.16 7.0559,117.8673 -0.5427,135.8939 5.9704,0 9.7697,2.7734 9.2271,5.5468 -0.5428,2.7734 -4.8851,10.6311 -4.8851,10.6311 0,0 5.9705,7.3956 4.3423,9.7067 -1.6285,2.3112 -4.885,5.5468 -4.885,5.5468 0,0 5.4278,6.0089 3.7993,7.8578 -1.6282,1.8489 -10.8551,5.0844 -14.6544,6.9333 4.3422,3.6978 8.1413,11.5557 4.8848,13.4046 -3.2564,1.8489 -10.8552,3.2355 -10.8552,3.2355 l -2.7138,4.6222 c 0,0 -1.0855,9.2446 -3.7993,9.7068 -2.7139,0.4622 -14.1118,-4.6223 -15.7402,-3.6979 -1.6283,0.9245 -5.9703,8.3202 -8.6841,8.3202 -2.7138,0 -11.398,-8.7824 -11.398,-8.7824 -1.16,1.9756 -144.49581,5.2911 -156.31525,3.2357 -11.89113,-2.068 -58.61821,2.7733 -65.13135,2.7733 -6.51315,0 -33.65121,-1.3867 -37.45052,-2.3111 -3.79935,-0.9244 -18.99666,-4.1601 -24.42426,-3.6979 -5.42763,0.4622 -15.74009,5.0846 -21.71045,5.0846 -5.97038,0 -40.16433,-2.7734 -46.67746,-2.3111 -6.51313,0.4622 -36.36502,2.3111 -41.24986,2.3111 -4.88485,0 -59.70374,-5.0846 -65.67412,-5.5468 -5.97037,-0.4622 -32.02292,4.6223 -36.90775,4.1601 -4.88486,-0.4622 -32.56568,-4.6223 -41.24986,-4.1601 -8.68418,0.4622 -41.24986,-6.0089 -43.4209,-5.5467 -2.17105,0.4622 -5.44957,0.9234 -25.50978,0 10.31248,-6.9333 7.05588,-12.9422 7.05588,-12.9422 l -7.59862,-3.6979 1.08549,-4.16 -15.74006,-6.9333 2.17104,-5.0845 1.08551,-8.3201 -15.74006,-6.4711 24.96702,-18.489 z"
       id="path3894"
       inkscape:connector-curvature="0"
       sodipodi:nodetypes="cccccccccccccccccccccccccccccccscscccccsccssscssssssssssscccccccccc" />
    <path
       style="fill:#ffffff;stroke:none;stroke-width:1px;stroke-linecap:butt;stroke-linejoin:miter;stroke-opacity:1;color:#000000;fill-opacity:1;fill-rule:nonzero;marker:none;visibility:visible;display:inline;overflow:visible;enable-background:accumulate"
       d="m 818.04625,2447.3394 c 1.81385,78.9025 3.6277,268.4498 28.11468,311.9822 24.48697,43.5324 33.55622,70.7401 98.85481,79.8094 -68.92629,-32.6493 -89.78557,-105.2033 -96.13404,-230.3589 -6.34847,-125.1557 43.5324,-212.2205 43.5324,-212.2205 l -68.01937,-3.6277 z"
       id="path3896"
       inkscape:connector-curvature="0" />
    <path
       style="color:#000000;display:inline;overflow:visible;visibility:visible;fill:#ffffff;fill-opacity:1;fill-rule:nonzero;stroke:none;stroke-width:0.91861367px;marker:none;enable-background:accumulate"
       d="m 690.40714,2540.8503 c 10.82165,-3.4244 21.11615,-9.3082 16.60713,-18.0595 3.15632,-0.3805 13.97796,1.9024 12.17435,-4.1855 2.70542,-0.7609 6.31263,-0.7609 4.05812,-5.7074 3.15632,-0.3805 12.17435,1.522 9.91985,-3.4245 5.86172,-1.1414 60.87176,-2.6633 80.71145,-0.7609 19.83968,1.9024 73.04611,0.3805 78.45694,0 5.41082,-0.3805 46.8938,0 50.50102,0 3.60721,0 18.03607,4.1854 22.54509,6.4684 6.76353,-3.044 15.33067,-1.9025 15.33067,-1.9025 0,0 0,12.9368 1.35271,14.0783 1.3527,1.1415 8.11623,-1.9024 9.46894,0 1.3527,1.9024 -9.46894,13.3173 -8.11624,13.6978 1.35271,0.3805 12.17435,4.5659 12.17435,6.0879 0,1.5219 -8.56713,8.7513 -8.11623,9.1318 0.4509,0.3805 7.21443,5.327 6.31263,9.5124 8.11628,1.522 12.17438,5.3269 14.42888,7.9904 -3.6072,4.9464 -12.17437,9.5123 -13.97798,12.1758 2.25451,4.5659 8.11628,10.6539 6.76348,12.5563 -1.3527,1.9025 -7.66529,1.522 -12.1743,-0.7609 1.8036,5.7074 1.3527,51.3666 -6.76353,68.1083 2.25451,3.805 6.31262,6.4684 7.21443,10.2734 0.9018,3.8049 -1.80361,9.8929 -1.35271,11.7953 0.4509,1.9025 4.05812,8.3709 3.60722,11.4148 -0.45091,3.044 -2.25451,6.0879 -4.95992,7.9904 -0.45091,3.044 1.8036,5.327 -0.45091,6.088 -2.25451,0.7609 -11.27255,-3.4246 -13.52706,-2.6636 -2.25451,0.761 -0.4509,11.0344 -2.70541,12.9369 -2.25451,1.9024 -50.95192,6.8488 -61.77357,2.6634 -11.27254,-0.761 -94.68941,15.6003 -129.40886,9.1319 -4.05811,-0.761 -3.15631,-3.4244 -6.31262,-4.1855 -3.15632,-0.761 -4.95993,1.9026 -11.72346,1.1415 -5.86172,-3.8049 -22.1058,-3.2202 -34.28016,-21.4839 -4.05811,0 -10.82164,1.9024 -11.72345,-1.1416 -0.9018,-3.0439 0.4509,-5.3268 0.4509,-5.3268 0,0 -4.50902,1.1414 -4.95992,-1.1415 -0.4509,-2.283 5.86173,-8.3709 5.41083,-9.5124 -0.45091,-1.1415 -13.07616,2.283 -13.52706,-0.3805 -0.4509,-2.6634 4.95993,-9.1318 4.50902,-11.0343 -0.45091,-1.9024 -44.11043,-34.6537 -17.04642,-122.1665 3.60722,-1.1415 7.21443,-2.2829 6.76353,-3.8049 -0.4509,-1.522 -5.86173,-4.566 -5.86173,-4.566 z"
       id="path3915"
       inkscape:connector-curvature="0"
       sodipodi:nodetypes="cccccsssccsssssccccccssscssscccccscscsscccc" />
    <path
       style="color:#000000;fill:#ffffff;fill-opacity:1;fill-rule:nonzero;stroke:none;stroke-width:1px;marker:none;visibility:visible;display:inline;overflow:visible;enable-background:accumulate"
       d="m 2161.9635,2759.6873 c 75.5442,-65.8317 129.3057,-115.4309 140.8923,-189.8298 11.5865,-74.3988 -1.8538,-91.5331 -5.5615,-100.5511 -12.977,1.8036 -33.8327,13.978 -38.0039,19.3888 1.8539,-19.8397 -11.5865,-82.5151 -31.9788,-107.3147 -20.3923,-24.7996 -39.3943,-7.6653 -39.3943,-7.6653 0,0 61.177,94.6894 55.1519,157.8157 12.0501,-12.6253 34.7597,-36.974 40.3212,-32.465 5.5615,4.5091 8.3423,64.9299 -3.7077,92.4349 -12.05,27.5051 -38.9308,101.9039 -117.7192,168.1865 z"
       id="path3923"
       inkscape:connector-curvature="0" />
    <path
       style="fill:#ffffff;stroke:none;stroke-width:1px;stroke-linecap:butt;stroke-linejoin:miter;stroke-opacity:1;color:#000000;fill-opacity:1;fill-rule:nonzero;marker:none;visibility:visible;display:inline;overflow:visible;enable-background:accumulate"
       d="m 1846.2,2353.2992 c 0,0 37.5681,7.7521 43.5312,11.9264 5.9632,4.1742 29.8159,-2.9816 -3.5779,44.7238 33.9901,-15.5043 60.8244,-32.2012 73.3471,-30.4122 -5.3668,11.9263 -11.33,27.4306 -11.33,27.4306 0,0 31.0085,-12.5227 36.9717,-11.9263 -1.789,5.3668 2.3853,16.1005 2.3853,16.1005 l 16.1005,-2.3852 4.7706,14.3116 c 0,0 64.4023,-25.0454 72.1544,-22.0638 7.7522,2.9816 -3.5779,34.5865 -3.5779,34.5865 l 17.2933,-12.5227 8.3484,0.5963 20.2748,-20.2748 6.5595,11.33 4.7705,-4.1742 9.5411,4.7706 22.6601,-17.2933 7.7521,1.789 19.6785,27.4306 10.7338,-12.5227 5.3668,-0.5963 35.1828,1.1927 2.3852,-2.9816 5.9632,-1.1927 8.3485,-5.9631 4.7705,-13.7154 10.1374,0 20.2748,12.5227 9.5411,8.3485 7.1558,-20.2748 4.1742,-2.3853 1.1927,-12.5227 23.2564,9.5411 7.1558,5.9632 1.7889,-10.7337 7.7522,-0.5964 14.3116,4.1743 15.5043,11.33 23.2564,12.5227 -35.1828,-45.9165 -8.3484,-8.3484 30.4122,-8.3485 0,-95.4108 -11.9264,-131.19 -519.3928,6.5595 -13.119,86.4661 0.5963,76.925 -2.9816,25.6417 26.238,8.9448 -25.6417,13.7153 16.1006,9.541 z"
       id="path3931"
       inkscape:connector-curvature="0" />
  </g>
  <g
     inkscape:groupmode="layer"
     id="layer1"
     inkscape:label="txt">
    <flowRoot
       xml:space="preserve"
       id="flowRoot2987"
       style="font-style:normal;font-variant:normal;font-weight:normal;font-stretch:normal;line-height:0.01%;font-family:Lavi;-inkscape-font-specification:Lavi;letter-spacing:0px;word-spacing:0px;fill:#000000;fill-opacity:1;stroke:none"
       transform="translate(52.552065,-126.62151)"><flowRegion
         id="flowRegion2989"><rect
           id="rect2991"
           width="973.52362"
           height="213.03587"
           x="120.55251"
           y="265.53046"
           style="font-style:normal;font-variant:normal;font-weight:normal;font-stretch:normal;font-family:Lavi;-inkscape-font-specification:Lavi" /></flowRegion><flowPara
         id="flowPara2995"
         style="font-size:48px;line-height:1.25">Natta før trylledrikk-konkurransen</flowPara><flowPara
         style="font-size:48px;line-height:1.25"
         id="flowPara3914">       kl. 2.00</flowPara></flowRoot>    <flowRoot
       xml:space="preserve"
       id="flowRoot2987-4"
       style="font-style:normal;font-variant:normal;font-weight:normal;font-stretch:normal;line-height:0.01%;font-family:Lavi;-inkscape-font-specification:Lavi;text-align:center;letter-spacing:0px;word-spacing:0px;text-anchor:middle;fill:#000000;fill-opacity:1;stroke:none"
       transform="translate(341.31241,1949.0059)"><flowRegion
         id="flowRegion2989-5"><rect
           id="rect2991-7"
           width="602.40173"
           height="310.73996"
           x="120.55251"
           y="265.53046"
           style="font-style:normal;font-variant:normal;font-weight:normal;font-stretch:normal;font-family:Lavi;-inkscape-font-specification:Lavi;text-align:center;text-anchor:middle" /></flowRegion><flowPara
         style="font-size:48px;line-height:1.25;text-align:center;text-anchor:middle"
         id="flowPara3407">Endeleg ...</flowPara><flowPara
         style="font-size:48px;line-height:1.25;text-align:center;text-anchor:middle"
         id="flowPara3925">Ikkje eingong Safran kan laga noko som kan måla seg med denne trylledrikken!</flowPara></flowRoot>    <flowRoot
       xml:space="preserve"
       id="flowRoot2987-4-8"
       style="font-style:normal;font-variant:normal;font-weight:normal;font-stretch:normal;line-height:0.01%;font-family:Lavi;-inkscape-font-specification:Lavi;text-align:center;letter-spacing:0px;word-spacing:0px;text-anchor:middle;fill:#000000;fill-opacity:1;stroke:none"
       transform="matrix(0.96141471,0,0,0.91963896,435.69682,2303.9933)"><flowRegion
         id="flowRegion2989-5-9"><rect
           id="rect2991-7-4"
           width="602.40173"
           height="310.73996"
           x="120.55251"
           y="265.53046"
           style="font-style:normal;font-variant:normal;font-weight:normal;font-stretch:normal;font-family:Lavi;-inkscape-font-specification:Lavi;text-align:center;text-anchor:middle" /></flowRegion><flowPara
         style="font-size:48px;line-height:1.25;text-align:center;text-anchor:middle"
         id="flowPara3849">Eg treng ein </flowPara><flowPara
         style="font-size:48px;line-height:1.25;text-align:center;text-anchor:middle"
         id="flowPara3936">prøvekanin</flowPara><flowPara
         style="font-size:48px;line-height:1.25;text-align:center;text-anchor:middle"
         id="flowPara3938">...</flowPara></flowRoot>    <flowRoot
       xml:space="preserve"
       id="flowRoot2987-4-8-2"
       style="font-style:normal;font-variant:normal;font-weight:normal;font-stretch:normal;line-height:0.01%;font-family:Lavi;-inkscape-font-specification:Lavi;text-align:center;letter-spacing:0px;word-spacing:0px;text-anchor:middle;fill:#000000;fill-opacity:1;stroke:none"
       transform="matrix(1.4179226,0,0,1.4152108,1527.4333,1745.8167)"><flowRegion
         id="flowRegion2989-5-9-2"><rect
           id="rect2991-7-4-2"
           width="602.40173"
           height="310.73996"
           x="120.55251"
           y="265.53046"
           style="font-style:normal;font-variant:normal;font-weight:normal;font-stretch:normal;font-family:Lavi;-inkscape-font-specification:Lavi;text-align:center;text-anchor:middle" /></flowRegion><flowPara
         style="font-size:48px;line-height:1.25;text-align:center;text-anchor:middle"
         id="flowPara3892"> </flowPara><flowPara
         style="font-size:48px;line-height:1.25;text-align:center;text-anchor:middle"
         id="flowPara3945">GUUUUUUUUL-</flowPara><flowPara
         style="font-size:48px;line-height:1.25;text-align:center;text-anchor:middle"
         id="flowPara3947">ROOOOT!!!</flowPara></flowRoot>  </g>
</svg>
