<?xml version="1.0" encoding="UTF-8" standalone="no"?>
<!-- Created With Inkscape (http://www.inkscape.org/) -->

<svg
   xmlns:dc="http://purl.org/dc/elements/1.1/"
   xmlns:cc="http://creativecommons.org/ns#"
   xmlns:rdf="http://www.w3.org/1999/02/22-rdf-syntax-ns#"
   xmlns:svg="http://www.w3.org/2000/svg"
   xmlns="http://www.w3.org/2000/svg"
   xmlns:xlink="http://www.w3.org/1999/xlink"
   xmlns:sodipodi="http://sodipodi.sourceforge.net/DTD/sodipodi-0.dtd"
   xmlns:inkscape="http://www.inkscape.org/namespaces/inkscape"
   id="svg2"
   version="1.1"
   inkscape:version="0.92.1 r15371"
   width="2646.3999"
   height="3736.5334"
   sodipodi:docname="E11P04.svg"
   viewBox="0 0 2481 3503">
  <metadata
     id="metadata8">
    <rdf:RDF>
      <cc:Work
         rdf:about="">
        <dc:format>image/svg+xml</dc:format>
        <dc:type
           rdf:resource="http://purl.org/dc/dcmitype/StillImage" />
        <dc:title />
      </cc:Work>
    </rdf:RDF>
  </metadata>
  <defs
     id="defs6" />
  <sodipodi:namedview
     pagecolor="#ffffff"
     bordercolor="#666666"
     borderopacity="1"
     objecttolerance="10"
     gridtolerance="10"
     guidetolerance="10"
     inkscape:pageopacity="0"
     inkscape:pageshadow="2"
     inkscape:window-width="1858"
     inkscape:window-height="1057"
     id="namedview4"
     showgrid="false"
     inkscape:zoom="0.42773947"
     inkscape:cx="1154.9532"
     inkscape:cy="718.22761"
     inkscape:window-x="54"
     inkscape:window-y="-8"
     inkscape:window-maximized="1"
     inkscape:current-layer="layer3" />
  <g
     inkscape:groupmode="layer"
     id="layer2"
     inkscape:label="artwork"
     sodipodi:insensitive="true">
    <image
       sodipodi:absref="../gfx_Pepper-and-Carrot_by-David-Revoy_E11P04.png"
       xlink:href="../gfx_Pepper-and-Carrot_by-David-Revoy_E11P04.png"
       width="2481"
       height="3503"
       id="image10"
       x="0"
       y="0" />
  </g>
  <g
     inkscape:groupmode="layer"
     id="layer3"
     inkscape:label="speechbubbles">
    <path
       style="color:#000000;display:inline;overflow:visible;visibility:visible;fill:#ffffff;fill-opacity:1;fill-rule:nonzero;stroke:none;stroke-width:1.03051603px;marker:none;enable-background:accumulate"
       d="m 940.38355,2013.8005 c -4.12267,-23.5484 7.16878,-21.6681 12.23629,-25.7013 -7.8148,-19.5911 1.96,-42.6542 47.85156,-52.6916 10.6425,-15.6028 47.9933,-27.6723 74.3389,-15.3594 17.9523,-12.2516 46.9778,-12.6001 59.1368,-3.2593 12.5962,-10.7052 30.5451,0.8193 32.2096,3.2302 15.9251,-5.8831 38.5076,-2.1223 47.4825,3.6397 21.1369,-8.673 66.8808,3.8221 66.1547,21.381 24.9703,12.3888 26.7053,27.3092 19.4659,36.4677 19.18,10.2051 30.3204,58.394 -23.0259,63.837 -14.4794,18.3168 -55.0146,26.8077 -74.1944,16.6025 -25.6965,5.1703 -41.766,9.8101 -48.4239,0.1663 -12.5959,10.7051 -45.7472,11.2808 -36.7691,-6.7331 -15.6954,12.0544 -34.8387,16.2336 -49.9018,9.1936 -24.4603,14.2266 -56.657,2.6612 -56.6554,-10.9327 -34.88841,6.2156 -41.30031,-14.8951 -39.85039,-22.8449 -5.67,-1.1186 -19.20268,-1.8036 -30.05536,-16.9957 z"
       id="path4043"
       inkscape:connector-curvature="0"
       sodipodi:nodetypes="ccccccccccccccccc" />
    <path
       style="color:#000000;display:inline;overflow:visible;visibility:visible;fill:#ffffff;fill-opacity:1;fill-rule:nonzero;stroke:none;stroke-width:0.7505827px;marker:none;enable-background:accumulate"
       d="m 1115.107,2117.5779 c -2.7949,-19.1903 4.8601,-17.6579 8.2957,-20.9448 -5.2981,-15.9655 1.3288,-34.7604 32.4412,-42.9401 7.2151,-12.7154 32.5374,-22.5511 50.3985,-12.5171 12.1709,-9.9841 31.8488,-10.2681 40.0921,-2.6561 8.5396,-8.7239 20.7082,0.6677 21.8367,2.6324 10.7965,-4.7943 26.1065,-1.7294 32.191,2.9662 14.3299,-7.0679 45.3422,3.1148 44.8499,17.4241 16.9288,10.0961 18.1051,22.2553 13.197,29.7189 13.0033,8.3165 20.5559,47.5872 -15.6106,52.0229 -9.8162,14.927 -37.2974,21.8466 -50.3004,13.53 -17.421,4.2134 -28.3155,7.9946 -32.8292,0.1354 -8.5395,8.724 -31.0145,9.1931 -24.9279,-5.4869 -10.6408,9.8236 -23.619,7.6057 -33.8312,1.8686 -16.583,11.5936 -38.4108,7.7922 -38.4097,-3.2859 -23.6529,5.0653 -27.9998,-12.1385 -27.0168,-18.6171 -3.8441,-0.9115 -13.0187,-1.4698 -20.3763,-13.8505 z"
       id="path4043-2"
       inkscape:connector-curvature="0" />
    <path
       style="color:#000000;display:inline;overflow:visible;visibility:visible;fill:#ffffff;fill-opacity:1;fill-rule:nonzero;stroke:none;stroke-width:1.03370965px;marker:none;enable-background:accumulate"
       d="m 2413.3118,2672.5092 c 5.6585,37.3665 13.9905,36.1278 7.9028,42.6329 10.0669,31.0074 31.1466,67.8547 -24.679,84.6472 -12.597,25.0016 -112.533,43.3239 -145.0572,24.2251 -21.6194,19.8058 -57.0858,20.8871 -72.1927,6.2565 -15.1136,17.2493 -37.3544,-0.7482 -39.4522,-4.5513 -19.3094,9.6433 -47.0092,4.0739 -58.13,-4.9249 -25.6059,14.1741 -81.8441,-4.8622 -81.4184,-32.7937 -30.8453,-19.2445 -33.3585,-42.9362 -24.7511,-57.6295 -23.7107,-15.8774 -38.5946,-92.2945 26.4634,-101.9174 17.2152,-29.3863 66.535,-43.6229 90.2454,-27.7452 31.2708,-8.6874 50.7896,-16.3562 59.1805,-1.1438 15.1136,-17.2496 55.6167,-18.767 45.1175,10.0377 18.8662,-19.4512 42.335,-15.472 60.9308,-4.5519 29.5217,-23.0642 68.9959,-16.232 69.3517,5.382 42.4777,-10.5164 50.8702,22.9326 49.3071,35.5992 6.9594,1.6754 23.5174,2.5189 37.1814,26.4771 z"
       id="path4043-2-3"
       inkscape:connector-curvature="0"
       sodipodi:nodetypes="ccccccccccccccccc" />
    <path
       style="color:#000000;display:inline;overflow:visible;visibility:visible;fill:#ffffff;fill-opacity:1;fill-rule:nonzero;stroke:none;stroke-width:0.85225779px;marker:none;enable-background:accumulate"
       d="m 548.19354,3157.8739 c -13.12463,29.4594 -87.14951,31.9297 -114.40011,25.9414 54.9309,32.9559 53.01588,53.4317 -21.56482,56.611 125.07312,59.3948 22.86507,50.4071 2.70522,65.4678 98.20554,20.4688 54.26738,45.9427 36.78339,71.3015 112.87754,0.871 75.93787,41.5203 80.69545,73.895 9.56929,-15.1917 55.03036,-61.4417 57.76573,-9.9452 74.66193,-49.1304 164.59033,-80.8658 171.73092,5.112 30.08255,-43.2531 60.07481,-61.5337 57.76573,-9.9453 74.53499,-67.0972 141.5151,-42.9454 208.89235,-23.9812 17.6963,-20.2516 19.7582,-51.3638 77.0096,-44.0727 -8.0272,-20.073 11.3031,-33.8709 54.958,-42.0647 -58.0102,-12.1256 -68.7014,-24.6327 39.0105,-38.0923 -81.9625,-1.3019 -158.3928,-3.9692 -62.2331,-49.8704 -30.1681,-1.1106 -101.7449,37.1906 -68.373,-74.8987 -51.8754,35.8838 -107.22195,55.6891 -176.63145,-19.4783 -32.84814,37.5521 -89.82249,56.1343 -114.60913,9.2289 -8.90883,19.9966 -45.84959,27.5169 -77.20952,28.4289 -12.12695,-7.943 -24.63447,-18.7316 -37.68665,-32.8664 -21.33274,29.6794 -53.24414,49.7237 -114.60911,9.2287 z"
       id="path3549-3-7"
       inkscape:connector-curvature="0"
       sodipodi:nodetypes="cccccccccccccccccccc" />
    <path
       style="color:#000000;display:inline;overflow:visible;visibility:visible;fill:#ffffff;fill-opacity:1;fill-rule:nonzero;stroke:none;stroke-width:1px;marker:none;enable-background:accumulate"
       d="m 713.9685,3068.6785 c 59.98272,22.9665 72.40603,51.7648 83.09037,71.7564 -3.96986,4.3889 -9.50747,13.9597 -9.50747,13.9597 0,0 23.841,37.6333 29.26881,54.6234 5.42777,16.99 -11.14554,22.2846 -11.14554,22.2846 0,0 -47.75233,-72.1235 -61.50191,-84.8945 11.38696,-11.4395 15.42716,-18.9715 21.27652,-20.8402 -3.09592,-13.0541 -30.38419,-48.0256 -51.48078,-56.8894 z"
       id="path4456"
       inkscape:connector-curvature="0" />
  </g>
  <g
     inkscape:groupmode="layer"
     id="layer1"
     inkscape:label="txt">
    <path
       style="color:#000000;display:inline;overflow:visible;visibility:visible;fill:#ffffff;fill-opacity:1;fill-rule:nonzero;stroke:none;stroke-width:1px;marker:none;enable-background:accumulate"
       d="m 1410.1656,2224.4746 c -0.824,-5.3715 4.3942,-8.0572 4.3942,-8.0572 0,0 -5.2182,-4.1506 0.8239,-8.3014 6.0421,-4.1506 11.5348,0.9767 11.5348,0.9767 0,0 7.69,-8.0572 14.8306,1.2208 7.1407,9.2779 0,14.4052 0,14.4052 0,0 4.1196,9.7664 -6.866,11.9638 -10.9856,2.1974 -14.0066,0.7324 -16.7531,-5.1273 -7.6898,-1.9533 -7.9644,-7.0806 -7.9644,-7.0806 z"
       id="path5098"
       inkscape:connector-curvature="0" />
    <path
       style="color:#000000;display:inline;overflow:visible;visibility:visible;fill:#ffffff;fill-opacity:1;fill-rule:nonzero;stroke:none;stroke-width:1px;marker:none;enable-background:accumulate"
       d="m 1333.0902,2204.0312 c 4.0416,-10.1338 13.0576,-10.7479 13.0576,-10.7479 0,0 -0.3109,-7.6772 5.907,-11.9763 6.218,-4.2992 13.6795,0.3071 13.6795,0.3071 0,0 10.2596,-1.5355 15.2339,7.9841 4.9744,9.5196 8.3942,14.1259 3.7308,23.6455 3.4199,5.2204 0,16.2754 -4.9743,18.425 -4.9744,2.1496 -17.0993,5.8345 -23.9391,-5.2205 -5.5962,1.8426 -22.6954,3.0709 -22.6954,-22.417 z"
       id="path5090"
       inkscape:connector-curvature="0" />
    <flowRoot
       xml:space="preserve"
       id="flowRoot2987-4-9-3-5-9-8-3-5-4"
       style="font-style:normal;font-variant:normal;font-weight:normal;font-stretch:normal;line-height:0.01%;font-family:Lavi;-inkscape-font-specification:Lavi;text-align:center;letter-spacing:0px;word-spacing:0px;text-anchor:middle;fill:#000000;fill-opacity:1;stroke:none"
       transform="translate(753.04179,1697.0696)"><flowRegion
         id="flowRegion2989-5-4-5-8-9-5-4-2-2"><rect
           id="rect2991-7-9-6-5-7-5-4-9-5"
           width="497.70953"
           height="358.25998"
           x="120.55251"
           y="265.53046"
           style="font-style:normal;font-variant:normal;font-weight:normal;font-stretch:normal;font-family:Lavi;-inkscape-font-specification:Lavi;text-align:center;text-anchor:middle" /></flowRegion><flowPara
         style="font-size:45px;line-height:1.25;text-align:center;text-anchor:middle"
         id="flowPara3030-8-1-8-7-8-3-5">.i le turni ia nai</flowPara></flowRoot>    <flowRoot
       xml:space="preserve"
       id="flowRoot2987-4-9-3-5-9-8-3-5-4-0"
       style="font-style:normal;font-variant:normal;font-weight:normal;font-stretch:normal;line-height:0.01%;font-family:Lavi;-inkscape-font-specification:Lavi;text-align:center;letter-spacing:0px;word-spacing:0px;text-anchor:middle;fill:#000000;fill-opacity:1;stroke:none"
       transform="translate(869.66915,1804.7426)"><flowRegion
         id="flowRegion2989-5-4-5-8-9-5-4-2-2-5"><rect
           id="rect2991-7-9-6-5-7-5-4-9-5-4"
           width="497.70953"
           height="358.25998"
           x="120.55251"
           y="265.53046"
           style="font-style:normal;font-variant:normal;font-weight:normal;font-stretch:normal;font-family:Lavi;-inkscape-font-specification:Lavi;text-align:center;text-anchor:middle" /></flowRegion><flowPara
         style="font-size:45px;line-height:1.25;text-align:center;text-anchor:middle"
         id="flowPara4229">cu citno</flowPara></flowRoot>    <flowRoot
       xml:space="preserve"
       id="flowRoot2987-4-9-3-5-9-8-3-5-4-0-5"
       style="font-style:normal;font-variant:normal;font-weight:normal;font-stretch:normal;line-height:0.01%;font-family:Lavi;-inkscape-font-specification:Lavi;text-align:center;letter-spacing:0px;word-spacing:0px;text-anchor:middle;fill:#000000;fill-opacity:1;stroke:none"
       transform="translate(1812.0881,2350.4537)"><flowRegion
         id="flowRegion2989-5-4-5-8-9-5-4-2-2-5-0"><rect
           id="rect2991-7-9-6-5-7-5-4-9-5-4-3"
           width="497.70953"
           height="358.25998"
           x="120.55251"
           y="265.53046"
           style="font-style:normal;font-variant:normal;font-weight:normal;font-stretch:normal;font-family:Lavi;-inkscape-font-specification:Lavi;text-align:center;text-anchor:middle" /></flowRegion><flowPara
         style="font-size:45px;line-height:1.25;text-align:center;text-anchor:middle"
         id="flowPara3673">.i la'a mi'o simxu</flowPara><flowPara
         style="font-size:45px;line-height:1.25;text-align:center;text-anchor:middle"
         id="flowPara3671">le ka dunli le ka</flowPara><flowPara
         style="font-size:45px;line-height:1.25;text-align:center;text-anchor:middle"
         id="flowPara45">jai nanca li xo kau</flowPara></flowRoot>    <path
       style="color:#000000;display:inline;overflow:visible;visibility:visible;fill:#ffffff;fill-opacity:1;fill-rule:nonzero;stroke:none;stroke-width:1px;marker:none;enable-background:accumulate"
       d="m 2210.6349,2528.6131 c 2.0696,-13.9994 -8.3532,-20.0368 -8.3532,-20.0368 0,0 5.6241,-8.6102 1.0865,-17.2136 -4.5378,-8.6035 -16.6613,-7.7412 -16.6613,-7.7412 0,0 -11.2882,-7.8287 -23.7806,0.1332 -12.4925,7.9618 -19.7553,11.2152 -20.6573,24.8788 -7.6828,3.9568 -11.1303,18.6435 -6.6181,24.0487 4.5121,5.4054 16.5736,16.7998 32.3596,8.1827 5.4699,5.4216 25.1937,16.9447 42.6244,-12.2518 z"
       id="path5090-2"
       inkscape:connector-curvature="0" />
    <path
       style="color:#000000;display:inline;overflow:visible;visibility:visible;fill:#ffffff;fill-opacity:1;fill-rule:nonzero;stroke:none;stroke-width:1px;marker:none;enable-background:accumulate"
       d="m 2115.1571,2425.2289 c 5.9597,0.3755 7.5527,6.7768 7.5527,6.7768 0,0 5.7336,-4.7662 8.6939,2.8948 2.9601,7.6609 -3.8878,12.4964 -3.8878,12.4964 0,0 6.7409,10.4141 -4.9613,16.0754 -11.7021,5.6615 -15.4383,-3.4455 -15.4383,-3.4455 0,0 -11.4816,2.2104 -11.1307,-10.4391 0.3508,-12.6495 2.6649,-15.6332 9.6214,-17.2627 3.9875,-8.0194 9.5501,-7.0961 9.5501,-7.0961 z"
       id="path5098-4"
       inkscape:connector-curvature="0"
       inkscape:transform-center-x="27.255435"
       inkscape:transform-center-y="-31.014805" />
    <flowRoot
       xml:space="preserve"
       id="flowRoot2987-4-9-3-5-9-8-3-5-4-0-5-5"
       style="font-style:normal;font-variant:normal;font-weight:normal;font-stretch:normal;line-height:0.01%;font-family:Lavi;-inkscape-font-specification:Lavi;text-align:center;letter-spacing:0px;word-spacing:0px;text-anchor:middle;fill:#000000;fill-opacity:1;stroke:none"
       transform="translate(377.37547,2930.7834)"><flowRegion
         id="flowRegion2989-5-4-5-8-9-5-4-2-2-5-0-8"><rect
           id="rect2991-7-9-6-5-7-5-4-9-5-4-3-2"
           width="745.54956"
           height="234.83037"
           x="22.802517"
           y="277.03046"
           style="font-style:normal;font-variant:normal;font-weight:normal;font-stretch:normal;font-family:Lavi;-inkscape-font-specification:Lavi;text-align:center;text-anchor:middle" /></flowRegion><flowPara
         style="font-size:45px;line-height:1.25;text-align:center;text-anchor:middle"
         id="flowPara3343">.i le'o do denpa ma .i .e'e</flowPara><flowPara
         style="font-size:45px;line-height:1.25;text-align:center;text-anchor:middle"
         id="flowPara49">gau do le prenu co'a cikna</flowPara><flowPara
         style="font-size:45px;line-height:1.25;text-align:center;text-anchor:middle"
         id="flowPara3679">gi'e terpa tu'a do</flowPara></flowRoot>  </g>
</svg>
