<?xml version="1.0" encoding="UTF-8" standalone="no"?>
<!-- Created with Inkscape (http://www.inkscape.org/) -->

<svg
   xmlns:dc="http://purl.org/dc/elements/1.1/"
   xmlns:cc="http://creativecommons.org/ns#"
   xmlns:rdf="http://www.w3.org/1999/02/22-rdf-syntax-ns#"
   xmlns:svg="http://www.w3.org/2000/svg"
   xmlns="http://www.w3.org/2000/svg"
   xmlns:xlink="http://www.w3.org/1999/xlink"
   xmlns:sodipodi="http://sodipodi.sourceforge.net/DTD/sodipodi-0.dtd"
   xmlns:inkscape="http://www.inkscape.org/namespaces/inkscape"
   id="svg2"
   version="1.1"
   inkscape:version="0.91 r13725"
   width="1100"
   height="765"
   sodipodi:docname="Pepper-and-Carrot_by-David-Revoy_E05.svg">
  <metadata
     id="metadata8">
    <rdf:RDF>
      <cc:Work
         rdf:about="">
        <dc:format>image/svg+xml</dc:format>
        <dc:type
           rdf:resource="http://purl.org/dc/dcmitype/StillImage" />
        <dc:title />
      </cc:Work>
    </rdf:RDF>
  </metadata>
  <defs
     id="defs6">
    <filter
       id="filter3797"
       style="color-interpolation-filters:sRGB;"
       inkscape:label="Drop Shadow">
      <feFlood
         id="feFlood3799"
         flood-opacity="0.8"
         flood-color="rgb(0,0,0)"
         result="flood" />
      <feComposite
         id="feComposite3801"
         in2="SourceGraphic"
         in="flood"
         operator="in"
         result="composite1" />
      <feGaussianBlur
         id="feGaussianBlur3803"
         in="composite"
         stdDeviation="10"
         result="blur" />
      <feOffset
         id="feOffset3805"
         dx="8"
         dy="10"
         result="offset" />
      <feComposite
         id="feComposite3807"
         in2="offset"
         in="SourceGraphic"
         operator="over"
         result="composite2" />
    </filter>
    <filter
       id="filter3836"
       style="color-interpolation-filters:sRGB;"
       inkscape:label="Drop Shadow">
      <feFlood
         id="feFlood3838"
         flood-opacity="0.94664031620553357"
         flood-color="rgb(0,0,0)"
         result="flood" />
      <feComposite
         id="feComposite3840"
         in2="SourceGraphic"
         in="flood"
         operator="in"
         result="composite1" />
      <feGaussianBlur
         id="feGaussianBlur3842"
         in="composite"
         stdDeviation="5"
         result="blur" />
      <feOffset
         id="feOffset3844"
         dx="2.0242914979757103"
         dy="4.4534412955465683"
         result="offset" />
      <feComposite
         id="feComposite3846"
         in2="offset"
         in="SourceGraphic"
         operator="over"
         result="composite2" />
    </filter>
    <pattern
       y="0"
       x="0"
       height="6"
       width="6"
       patternUnits="userSpaceOnUse"
       id="EMFhbasepattern" />
  </defs>
  <sodipodi:namedview
     pagecolor="#ffffff"
     bordercolor="#666666"
     borderopacity="1"
     objecttolerance="10"
     gridtolerance="10"
     guidetolerance="10"
     inkscape:pageopacity="0"
     inkscape:pageshadow="2"
     inkscape:window-width="1366"
     inkscape:window-height="705"
     id="namedview4"
     showgrid="false"
     inkscape:zoom="0.78591497"
     inkscape:cx="507.09151"
     inkscape:cy="294.85496"
     inkscape:window-x="-8"
     inkscape:window-y="-8"
     inkscape:window-maximized="1"
     inkscape:current-layer="layer2" />
  <g
     inkscape:groupmode="layer"
     id="layer1"
     inkscape:label="artwork"
     sodipodi:insensitive="true" />
  <image
     sodipodi:absref="C:\Users\Mahwiii\Desktop\Manga\translations\pepper carrot\peppercarrot_ep05_translation-master\ar\..\gfx_Pepper-and-Carrot_by-David-Revoy_E05.png"
     xlink:href="../gfx_Pepper-and-Carrot_by-David-Revoy_E05.png"
     y="0"
     x="0"
     id="image10"
     height="765"
     width="1100" />
  <g
     inkscape:groupmode="layer"
     id="layer2"
     inkscape:label="txt">
    <flowRoot
       xml:space="preserve"
       id="episode-title"
       style="font-style:normal;font-variant:normal;font-weight:normal;font-stretch:normal;font-size:12px;line-height:125%;font-family:Arial;-inkscape-font-specification:Arial;letter-spacing:0px;word-spacing:0px;display:inline;fill:#ffffff;fill-opacity:1;stroke:none;filter:url(#filter3836)"
       transform="matrix(0.69723552,0,0,0.69723552,-801.66361,242.51842)"><flowRegion
         id="flowRegion2989"><rect
           id="rect2991"
           width="2405.8"
           height="107.55731"
           x="739.22333"
           y="644.36664"
           style="fill:#ffffff;fill-opacity:1" /></flowRegion><flowPara
         id="flowPara2993"
         style="font-style:normal;font-variant:normal;font-weight:normal;font-stretch:normal;font-size:86.05413818px;font-family:AlHor;-inkscape-font-specification:AlHor;text-align:center;text-anchor:middle;fill:#ffffff;fill-opacity:1">حلقة ٥ : حلقةٌ خاصةٌ للعطلة</flowPara></flowRoot>    <text
       sodipodi:linespacing="125%"
       id="text3592"
       y="336.20737"
       x="464.14069"
       style="font-style:normal;font-variant:normal;font-weight:700;font-size:9.86013889px;line-height:125%;font-family:Lateef;text-align:start;letter-spacing:0px;word-spacing:0px;text-anchor:start;fill:#000000;fill-opacity:1;stroke:none"
       xml:space="preserve"><tspan
         id="tspan3594"
         y="336.20737"
         x="464.14069"
         sodipodi:role="line"><tspan
           id="tspan3596"
           style="font-style:normal;font-variant:normal;font-weight:700;font-size:9.86013889px;font-family:Lateef;fill:#000000"
           dy="0"
           dx="0">ʅˢ˵̭</tspan></tspan></text>
    <text
       sodipodi:linespacing="125%"
       id="text3598"
       y="359.89548"
       x="606.60455"
       style="font-style:normal;font-variant:normal;font-weight:700;font-size:34.9375px;line-height:125%;font-family:Lateef;text-align:start;letter-spacing:0px;word-spacing:0px;text-anchor:start;fill:#000000;fill-opacity:1;stroke:none"
       xml:space="preserve"><tspan
         id="tspan3600"
         y="326.89349"
         x="405.12445"
         sodipodi:role="line"><tspan
           id="tspan3602"
           style="font-style:normal;font-variant:normal;font-weight:700;font-size:34.9375px;font-family:Lateef;fill:#000000"
           dy="0"
           dx="0" /></tspan></text>
    <text
       sodipodi:linespacing="125%"
       id="text3604"
       y="336.20737"
       x="457.79028"
       style="font-style:normal;font-variant:normal;font-weight:700;font-size:9.86013889px;line-height:125%;font-family:Lateef;text-align:start;letter-spacing:0px;word-spacing:0px;text-anchor:start;fill:#000000;fill-opacity:1;stroke:none"
       xml:space="preserve"><tspan
         id="tspan3606"
         y="336.20737"
         x="457.79028"
         sodipodi:role="line"><tspan
           id="tspan3608"
           style="font-style:normal;font-variant:normal;font-weight:700;font-size:9.86013889px;font-family:Lateef;fill:#000000"
           dy="0"
           dx="0">ϒ</tspan><tspan
           id="tspan3610"
           style="font-style:normal;font-variant:normal;font-weight:700;font-size:9.86013889px;font-family:Lateef;fill:#000000"
           dy="0"
           dx="-10.769089"> : </tspan></tspan></text>
    <text
       sodipodi:linespacing="125%"
       id="text3612"
       y="359.89548"
       x="516.59906"
       style="font-style:normal;font-variant:normal;font-weight:700;font-size:34.9375px;line-height:125%;font-family:Lateef;text-align:start;letter-spacing:0px;word-spacing:0px;text-anchor:start;fill:#000000;fill-opacity:1;stroke:none"
       xml:space="preserve"><tspan
         id="tspan3614"
         y="326.89349"
         x="405.12445"
         sodipodi:role="line"><tspan
           id="tspan3616"
           style="font-style:normal;font-variant:normal;font-weight:700;font-size:34.9375px;font-family:Lateef;fill:#000000"
           dy="0"
           dx="0" /></tspan></text>
    <text
       sodipodi:linespacing="125%"
       id="text3618"
       y="359.89548"
       x="456.89548"
       style="font-style:normal;font-variant:normal;font-weight:700;font-size:34.9375px;line-height:125%;font-family:Lateef;text-align:start;letter-spacing:0px;word-spacing:0px;text-anchor:start;fill:#000000;fill-opacity:1;stroke:none"
       xml:space="preserve"><tspan
         id="tspan3620"
         y="326.89349"
         x="405.12445"
         sodipodi:role="line"><tspan
           id="tspan3622"
           style="font-style:normal;font-variant:normal;font-weight:700;font-size:34.9375px;font-family:Lateef;fill:#000000"
           dy="0"
           dx="0" /></tspan></text>
    <text
       sodipodi:linespacing="125%"
       id="text3624"
       y="336.20737"
       x="404.91275"
       style="font-style:normal;font-variant:normal;font-weight:700;font-size:9.86013889px;line-height:125%;font-family:Lateef;text-align:start;letter-spacing:0px;word-spacing:0px;text-anchor:start;fill:#000000;fill-opacity:1;stroke:none"
       xml:space="preserve"><tspan
         id="tspan3626"
         y="336.20737"
         x="404.91275"
         sodipodi:role="line"><tspan
           id="tspan3628"
           style="font-style:normal;font-variant:normal;font-weight:700;font-size:9.86013889px;font-family:Lateef;fill:#000000"
           dy="0"
           dx="0">ʅˎˑ˵ʹ</tspan></tspan></text>
    <text
       sodipodi:linespacing="125%"
       id="text3630"
       y="359.89548"
       x="655.63959"
       style="font-style:normal;font-variant:normal;font-weight:700;font-size:34.9375px;line-height:125%;font-family:Lateef;text-align:start;letter-spacing:0px;word-spacing:0px;text-anchor:start;fill:#000000;fill-opacity:1;stroke:none"
       xml:space="preserve"><tspan
         id="tspan3632"
         y="326.89349"
         x="405.12445"
         sodipodi:role="line"><tspan
           id="tspan3634"
           style="font-style:normal;font-variant:normal;font-weight:700;font-size:34.9375px;font-family:Lateef;fill:#000000"
           dy="0"
           dx="0" /></tspan></text>
  </g>
</svg>
