<?xml version="1.0" encoding="UTF-8" standalone="no"?>
<!-- Created with Inkscape (http://www.inkscape.org/) -->

<svg
   xmlns:dc="http://purl.org/dc/elements/1.1/"
   xmlns:cc="http://creativecommons.org/ns#"
   xmlns:rdf="http://www.w3.org/1999/02/22-rdf-syntax-ns#"
   xmlns:svg="http://www.w3.org/2000/svg"
   xmlns="http://www.w3.org/2000/svg"
   xmlns:xlink="http://www.w3.org/1999/xlink"
   xmlns:sodipodi="http://sodipodi.sourceforge.net/DTD/sodipodi-0.dtd"
   xmlns:inkscape="http://www.inkscape.org/namespaces/inkscape"
   id="svg2"
   version="1.1"
   inkscape:version="0.92.2 (5c3e80d, 2017-08-06)"
   width="2481"
   height="3503"
   sodipodi:docname="E26P01.svg">
  <metadata
     id="metadata8">
    <rdf:RDF>
      <cc:Work
         rdf:about="">
        <dc:format>image/svg+xml</dc:format>
        <dc:type
           rdf:resource="http://purl.org/dc/dcmitype/StillImage" />
        <dc:title />
      </cc:Work>
    </rdf:RDF>
  </metadata>
  <defs
     id="defs6" />
  <sodipodi:namedview
     pagecolor="#ffffff"
     bordercolor="#666666"
     borderopacity="1"
     objecttolerance="10"
     gridtolerance="10"
     guidetolerance="10"
     inkscape:pageopacity="0"
     inkscape:pageshadow="2"
     inkscape:window-width="1439"
     inkscape:window-height="1033"
     id="namedview4"
     showgrid="false"
     inkscape:zoom="0.48912286"
     inkscape:cx="1243.3952"
     inkscape:cy="784.64633"
     inkscape:window-x="480"
     inkscape:window-y="4"
     inkscape:window-maximized="0"
     inkscape:current-layer="layer1"
     inkscape:snap-global="false" />
  <g
     inkscape:groupmode="layer"
     id="layer2"
     inkscape:label="artwork"
     sodipodi:insensitive="true">
    <image
       sodipodi:absref="C:\Users\Kari\Documents\Pepper and Carrot\Episode 26\fi\../gfx_Pepper-and-Carrot_by-David-Revoy_E26P01.png"
       xlink:href="../gfx_Pepper-and-Carrot_by-David-Revoy_E26P01.png"
       y="0"
       x="0"
       id="image10"
       height="3503"
       width="2481" />
  </g>
  <g
     inkscape:groupmode="layer"
     id="layer3"
     inkscape:label="speechbubbles"
     style="display:inline;opacity:1">
    <path
       style="fill:#ffffff;fill-opacity:1;stroke:none;stroke-width:1.4410342"
       d="m 267.49537,1886.1776 c -81.27266,0.4163 -119.48865,-10.1327 -138.59242,-19.4702 -31.698585,-15.4936 -37.897984,-108.6848 25.97401,-127.2534 64.20812,-18.6663 189.42278,-14.5153 240.81341,21.3805 51.39043,35.8958 14.73863,83.1585 2.92231,92.8715 -11.81651,9.7129 -43.19199,32.099 -131.11731,32.4716 z"
       id="path3659-8"
       inkscape:connector-curvature="0"
       sodipodi:nodetypes="cssssc" />
    <path
       style="color:#000000;display:inline;overflow:visible;visibility:visible;fill:#ffffff;fill-opacity:1;fill-rule:nonzero;stroke:none;stroke-width:0.77001458px;marker:none;enable-background:accumulate"
       d="m 274.67689,1855.3732 c 11.17842,15.8247 25.32183,43.4204 25.79652,49.4209 -6.73911,-0.5556 -13.09406,0.387 -18.03883,1.0204 1.81058,10.7946 32.21158,51.6223 41.64451,56.3046 -23.83945,-10.0592 -58.27989,-45.5693 -59.88737,-63.8703 6.68489,-2.1454 10.75049,-2.4727 14.26692,-3.6967 -0.36416,-9.3034 -20.80365,-30.8908 -20.80365,-30.8908 z"
       id="path5066"
       inkscape:connector-curvature="0"
       sodipodi:nodetypes="cccccccc" />
    <path
       style="color:#000000;display:inline;overflow:visible;visibility:visible;fill:#ffffff;fill-opacity:1;fill-rule:nonzero;stroke:none;stroke-width:1.10243285px;marker:none;enable-background:accumulate"
       d="m 1767.8132,1959.3191 c -38.3732,-49.7059 -37.0235,-154.5338 -26.0595,-176.9014 17.1455,-41.8224 58.2239,-49.2864 110.3019,-49.2864 52.0778,0 421.7288,-25.3961 475.1772,26.7951 53.4483,52.1912 36.6236,149.3892 -9.9724,210.2788 -46.5961,60.8897 -305.2947,48.4632 -305.2947,48.4632 0,0 -185.2222,4.0256 -244.1525,-59.3493 z"
       id="path3992"
       inkscape:connector-curvature="0"
       sodipodi:nodetypes="ccscccc" />
    <path
       style="color:#000000;display:inline;overflow:visible;visibility:visible;fill:#ffffff;fill-opacity:1;fill-rule:nonzero;stroke:none;stroke-width:1px;marker:none;enable-background:accumulate"
       d="m 1984.9695,2224.8076 c 97.5172,-13.4683 140.8945,-73.5032 173.5649,-113.8088 15.274,-18.8437 -32.2063,-50.3843 -32.2063,-50.3843 l -20.4844,64.3961 c 4.4776,5.3732 -31.2523,71.0033 -120.8742,99.797 z"
       id="path4000"
       inkscape:connector-curvature="0"
       sodipodi:nodetypes="csccc" />
    <path
       style="color:#000000;display:inline;overflow:visible;visibility:visible;fill:#ffffff;fill-opacity:1;fill-rule:nonzero;stroke:none;stroke-width:0.92060596px;marker:none;enable-background:accumulate"
       d="m 1950.6349,2043.7688 c 19.779,-23.0063 34.4661,-67.3113 180.1393,-51.7323 78.0304,8.3448 166.7465,7.6994 157.5467,88.2216 -9.1999,80.5222 -138.374,70.1622 -164.8236,71.1095 -26.4494,0.9474 -151.2196,0.012 -174.0806,-28.3054 -14.3104,-17.7262 -18.5208,-57.9183 1.2182,-79.2934 z"
       id="path4546-6"
       inkscape:connector-curvature="0"
       sodipodi:nodetypes="cssssc" />
    <path
       style="color:#000000;display:inline;overflow:visible;visibility:visible;opacity:1;vector-effect:none;fill:#ffffff;fill-opacity:1;fill-rule:nonzero;stroke:none;stroke-width:1.04263651;stroke-linecap:butt;stroke-linejoin:miter;stroke-miterlimit:4;stroke-dasharray:none;stroke-dashoffset:0;stroke-opacity:1;marker:none;paint-order:stroke fill markers;enable-background:accumulate"
       d="m 905.47211,2690.5487 c -34.94584,-50.7299 -31.20171,-149.6531 -21.2171,-172.4815 -5.85531,-34.1094 16.10883,-62.4869 71.13976,-57.0711 47.24043,4.6491 386.72913,-29.6046 435.40363,23.6617 48.6743,53.2664 46.5887,156.328 4.1545,218.4721 -42.4343,62.1442 -278.5578,44.4898 -278.5578,44.4898 -0.223,0.3529 -165.16689,20.1295 -210.92299,-57.071 z"
       id="path3992-0"
       inkscape:connector-curvature="0"
       sodipodi:nodetypes="ccscscc" />
    <path
       style="color:#000000;display:inline;overflow:visible;visibility:visible;fill:#ffffff;fill-opacity:1;fill-rule:nonzero;stroke:none;stroke-width:1.1471467px;marker:none;enable-background:accumulate"
       d="m 1107.7917,2663.674 c -41.0805,41.3971 -74.3212,126.4523 -32.6058,262.3106 -64.481,-107.4324 -40.7404,-218.5665 -31.5488,-251.0486 9.1915,-32.4819 64.1546,-11.262 64.1546,-11.262 z"
       id="path4008"
       inkscape:connector-curvature="0" />
    <path
       style="color:#000000;display:inline;overflow:visible;visibility:visible;fill:#ffffff;fill-opacity:1;fill-rule:nonzero;stroke:none;stroke-width:1.1471467px;marker:none;enable-background:accumulate"
       d="m 1891.9827,2656.832 c -40.4116,58.3597 -53.3089,167.7072 24.2468,263.2149 -108.4132,-99.3198 -82.2954,-214.0613 -72.6196,-244.9782 2.0322,-33.6961 48.3728,-18.2367 48.3728,-18.2367 z"
       id="path4008-0"
       inkscape:connector-curvature="0"
       sodipodi:nodetypes="cccc" />
    <path
       style="color:#000000;display:inline;overflow:visible;visibility:visible;opacity:1;fill:#ffffff;fill-opacity:1;fill-rule:nonzero;stroke:none;stroke-width:1.47372222px;marker:none;enable-background:accumulate"
       d="m 1860.2222,2744.4158 c -95.722,-11.4249 -111.6687,-33.2233 -134.4994,-85.7917 -22.8308,-52.5684 19.8838,-199.8538 39.8648,-211.8218 12.7234,-4.5693 221.8906,-1.6759 304.6599,10.4072 82.7693,12.0833 120.3419,4.1407 147.5268,86.3811 23.5578,71.2666 -28.7508,178.7306 -138.2047,195.4587 -109.454,16.7282 -219.3474,5.3665 -219.3474,5.3665 z"
       id="path3970"
       inkscape:connector-curvature="0"
       sodipodi:nodetypes="csccssc" />
  </g>
  <g
     inkscape:groupmode="layer"
     id="layer1"
     inkscape:label="txt">
    <text
       xml:space="preserve"
       style="font-style:normal;font-variant:normal;font-weight:normal;font-stretch:normal;line-height:0%;font-family:Lavi;-inkscape-font-specification:Lavi;text-align:center;letter-spacing:0px;word-spacing:0px;text-anchor:middle;fill:#000000;fill-opacity:1;stroke:none"
       x="253.58946"
       y="1788.8776"
       id="text4246"><tspan
         sodipodi:role="line"
         style="font-size:45px;line-height:1.25"
         x="253.58946"
         y="1788.8776"
         id="tspan4252">Kirjat ovat</tspan><tspan
         sodipodi:role="line"
         style="font-size:45px;line-height:1.25"
         x="253.58946"
         y="1845.1276"
         id="tspan825">suurenmoisia!</tspan></text>
    <text
       xml:space="preserve"
       style="font-style:normal;font-variant:normal;font-weight:normal;font-stretch:normal;line-height:0%;font-family:Lavi;-inkscape-font-specification:Lavi;text-align:center;letter-spacing:0px;word-spacing:0px;text-anchor:middle;fill:#000000;fill-opacity:1;stroke:none"
       x="2106.4656"
       y="2058.2512"
       id="text4246-3-5-9"><tspan
         sodipodi:role="line"
         style="font-size:45px;line-height:1.25"
         x="2106.4656"
         y="2058.2512"
         id="tspan927-2">Tämä on</tspan><tspan
         sodipodi:role="line"
         style="font-size:45px;line-height:1.25"
         x="2106.4656"
         y="2114.5012"
         id="tspan958">kullanarvoinen!</tspan></text>
    <text
       xml:space="preserve"
       style="font-style:normal;font-variant:normal;font-weight:normal;font-stretch:normal;line-height:0%;font-family:Lavi;-inkscape-font-specification:Lavi;text-align:center;letter-spacing:0px;word-spacing:0px;text-anchor:middle;fill:#000000;fill-opacity:1;stroke:none"
       x="2056.3108"
       y="1795.9185"
       id="text4246-3-3"><tspan
         sodipodi:role="line"
         style="font-size:45px;line-height:1.25"
         x="2056.3108"
         y="1795.9185"
         id="tspan1093">Tämä kirjaharvinaisuus</tspan><tspan
         sodipodi:role="line"
         style="font-size:45px;line-height:1.25"
         x="2056.3108"
         y="1852.1685"
         id="tspan1083">sisältää kokeneen seikkailijan</tspan><tspan
         sodipodi:role="line"
         style="font-size:45px;line-height:1.25"
         x="2056.3108"
         y="1908.4185"
         id="tspan1107">muistiinpanot ja kertoo</tspan><tspan
         sodipodi:role="line"
         style="font-size:45px;line-height:1.25"
         x="2056.3108"
         y="1964.6685"
         id="tspan48">kaiken tästä linnasta.</tspan></text>
    <text
       xml:space="preserve"
       style="font-style:normal;font-variant:normal;font-weight:normal;font-stretch:normal;line-height:0%;font-family:Lavi;-inkscape-font-specification:Lavi;text-align:center;letter-spacing:0px;word-spacing:0px;text-anchor:middle;fill:#000000;fill-opacity:1;stroke:none"
       x="1153.2078"
       y="2530.5317"
       id="text4246-3-3-1"><tspan
         sodipodi:role="line"
         style="font-size:45px;line-height:1.25"
         x="1153.2078"
         y="2530.5317"
         id="tspan1149">Esimerkiksi: etuoven</tspan><tspan
         sodipodi:role="line"
         style="font-size:45px;line-height:1.25"
         x="1153.2078"
         y="2586.7817"
         id="tspan1153">paholaisensilmä ampuu</tspan><tspan
         sodipodi:role="line"
         style="font-size:45px;line-height:1.25"
         x="1153.2078"
         y="2643.0317"
         id="tspan1157">kutsumattomia vieraita</tspan><tspan
         sodipodi:role="line"
         style="font-size:45px;line-height:1.25"
         x="1153.2078"
         y="2699.2817"
         id="tspan58">tappavilla tulipalloilla.</tspan><tspan
         sodipodi:role="line"
         style="font-size:45px;line-height:1.25"
         x="1153.2078"
         y="2717.8152"
         id="tspan1244" /></text>
    <text
       xml:space="preserve"
       style="font-style:normal;font-variant:normal;font-weight:normal;font-stretch:normal;line-height:0%;font-family:Lavi;-inkscape-font-specification:Lavi;text-align:center;letter-spacing:0px;word-spacing:0px;text-anchor:middle;fill:#000000;fill-opacity:1;stroke:none"
       x="1961.5219"
       y="2528.0559"
       id="text4246-3-3-1-2"><tspan
         sodipodi:role="line"
         style="font-size:45px;line-height:1.25"
         x="1961.5219"
         y="2528.0559"
         id="tspan1222">Mutta jos varovasti</tspan><tspan
         sodipodi:role="line"
         style="font-size:45px;line-height:1.25"
         x="1961.5219"
         y="2584.3059"
         id="tspan39">lähestyt sitä sivusta</tspan><tspan
         sodipodi:role="line"
         style="font-size:45px;line-height:1.25"
         x="1961.5219"
         y="2640.5559"
         id="tspan71">pysytellen poissa sen</tspan><tspan
         sodipodi:role="line"
         style="font-size:45px;line-height:1.25"
         x="1961.5219"
         y="2696.8059"
         id="tspan44">näkökentästä ...</tspan><tspan
         sodipodi:role="line"
         style="font-size:45px;line-height:1.25"
         x="1961.5219"
         y="2715.3394"
         id="tspan1230" /></text>
  </g>
</svg>
