<?xml version="1.0" encoding="UTF-8" standalone="no"?>
<!-- Created With Inkscape (http://www.inkscape.org/) -->

<svg
   xmlns:dc="http://purl.org/dc/elements/1.1/"
   xmlns:cc="http://creativecommons.org/ns#"
   xmlns:rdf="http://www.w3.org/1999/02/22-rdf-syntax-ns#"
   xmlns:svg="http://www.w3.org/2000/svg"
   xmlns="http://www.w3.org/2000/svg"
   xmlns:xlink="http://www.w3.org/1999/xlink"
   xmlns:sodipodi="http://sodipodi.sourceforge.net/DTD/sodipodi-0.dtd"
   xmlns:inkscape="http://www.inkscape.org/namespaces/inkscape"
   id="svg2"
   version="1.1"
   inkscape:version="0.92.1 r15371"
   width="2646.3999"
   height="3736.5334"
   sodipodi:docname="E06P08.svg"
   viewBox="0 0 2481 3503">
  <metadata
     id="metadata8">
    <rdf:RDF>
      <cc:Work
         rdf:about="">
        <dc:format>image/svg+xml</dc:format>
        <dc:type
           rdf:resource="http://purl.org/dc/dcmitype/StillImage" />
        <dc:title />
      </cc:Work>
    </rdf:RDF>
  </metadata>
  <defs
     id="defs6">
    <filter
       id="filter4375-4-1-1-15-1-3-3"
       inkscape:label="deevad outline effect"
       style="color-interpolation-filters:sRGB">
      <feFlood
         id="feFlood4377-7-9-0-4-4-4-7"
         flood-opacity="1"
         flood-color="rgb(0,0,0)"
         result="flood" />
      <feComposite
         id="feComposite4379-3-8-8-6-0-7-4"
         in2="SourceGraphic"
         in="flood"
         operator="in"
         result="composite1" />
      <feMorphology
         id="feMorphology4393-1-0-49-8-2-7-3"
         operator="dilate"
         radius="0.69999999999999996"
         result="result3" />
      <feComposite
         id="feComposite4385-9-5-7-2-1-2-9"
         in2="result3"
         in="SourceGraphic"
         operator="over"
         result="composite2" />
    </filter>
    <filter
       id="filter3639"
       inkscape:label="deevad outline effect"
       style="color-interpolation-filters:sRGB">
      <feFlood
         id="feFlood3641"
         flood-opacity="1"
         flood-color="rgb(0,0,0)"
         result="flood" />
      <feComposite
         id="feComposite3643"
         in2="SourceGraphic"
         in="flood"
         operator="in"
         result="composite1" />
      <feMorphology
         id="feMorphology3645"
         operator="dilate"
         radius="0.69999999999999996"
         result="result3" />
      <feComposite
         id="feComposite3647"
         in2="result3"
         in="SourceGraphic"
         operator="over"
         result="composite2" />
    </filter>
    <filter
       id="filter3649"
       inkscape:label="deevad outline effect"
       style="color-interpolation-filters:sRGB">
      <feFlood
         id="feFlood3651"
         flood-opacity="1"
         flood-color="rgb(0,0,0)"
         result="flood" />
      <feComposite
         id="feComposite3653"
         in2="SourceGraphic"
         in="flood"
         operator="in"
         result="composite1" />
      <feMorphology
         id="feMorphology3655"
         operator="dilate"
         radius="0.69999999999999996"
         result="result3" />
      <feComposite
         id="feComposite3657"
         in2="result3"
         in="SourceGraphic"
         operator="over"
         result="composite2" />
    </filter>
  </defs>
  <sodipodi:namedview
     pagecolor="#ffffff"
     bordercolor="#666666"
     borderopacity="1"
     objecttolerance="10"
     gridtolerance="10"
     guidetolerance="10"
     inkscape:pageopacity="0"
     inkscape:pageshadow="2"
     inkscape:window-width="1218"
     inkscape:window-height="777"
     id="namedview4"
     showgrid="false"
     inkscape:zoom="0.2459502"
     inkscape:cx="1485.939"
     inkscape:cy="807.51507"
     inkscape:window-x="54"
     inkscape:window-y="-8"
     inkscape:window-maximized="1"
     inkscape:current-layer="layer1" />
  <g
     inkscape:groupmode="layer"
     id="layer2"
     inkscape:label="artwork"
     sodipodi:insensitive="true">
    <image
       sodipodi:absref="../gfx_Pepper-and-Carrot_by-David-Revoy_E06P08.png"
       xlink:href="../gfx_Pepper-and-Carrot_by-David-Revoy_E06P08.png"
       y="0"
       x="0"
       id="image10"
       height="3503"
       width="2481" />
  </g>
  <g
     inkscape:groupmode="layer"
     id="layer3"
     inkscape:label="speechbubbles" />
  <g
     inkscape:groupmode="layer"
     id="layer1"
     inkscape:label="txt">
    <path
       style="color:#000000;display:inline;overflow:visible;visibility:visible;fill:#ffffff;fill-opacity:1;fill-rule:nonzero;stroke:none;stroke-width:1px;marker:none;enable-background:accumulate"
       d="m 524.44684,1977.3621 c -14.01377,-46.3951 -40.00882,-95.7772 -45.79925,-144.3988 l -11.44029,45.6542 c -62.91152,-129.7986 -216.9307,-210.2683 -37.93418,5.9274 l 4.61436,-21.5395 c 6.85365,14.1808 24.60331,28.6882 28.47492,44.653 l 15.40082,-17.4241 c 13.28656,38.1411 31.12227,58.0858 46.68362,87.1278 z"
       id="path4032-9"
       inkscape:connector-curvature="0"
       sodipodi:nodetypes="cccccccc" />
    <path
       style="color:#000000;display:inline;overflow:visible;visibility:visible;fill:#ffffff;fill-opacity:1;fill-rule:nonzero;stroke:none;stroke-width:1px;marker:none;enable-background:accumulate"
       d="m 734.33747,2852.147 c 34.68316,-42.7494 111.27433,-68.3456 171.06944,-6.0348 45.90017,-4.9397 81.26643,-4.2641 125.92729,48.6318 -41.84055,-33.4484 -69.35796,-47.6353 -136.48501,-35.9449 -35.82358,-28.4476 -90.54377,-19.0565 -121.82817,39.1849 -31.28451,58.2414 -17.69437,44.59 -17.69437,44.59 l -30.80741,-73.5852 z"
       id="path5074-3-6"
       inkscape:connector-curvature="0"
       sodipodi:nodetypes="ccccsccc" />
    <path
       style="color:#000000;display:inline;overflow:visible;visibility:visible;fill:#ffffff;fill-opacity:1;fill-rule:nonzero;stroke:none;stroke-width:1px;marker:none;enable-background:accumulate"
       d="m 921.73639,1713.3647 c 38.32906,18.6277 26.56293,53.657 -17.25459,29.5292 30.4647,35.9116 50.91128,52.0261 35.37649,66.5249 113.16101,-28.688 40.12509,17.6202 12.35589,45.6958 25.2138,-11.1892 65.39632,-42.7141 50.24712,0.9326 8.0165,-2.0071 17.4491,-7.7553 21.4169,0.9326 10.2141,-5.9994 17.8025,-7.54 22.2405,-3.7303 10.0387,-10.9178 16.5252,-13.7923 16.4745,-1.865 9.4908,-8.9943 12.4136,-5.8987 14.827,-1.8652 16.2884,-19.3104 22.3718,-13.8628 28.8303,-9.3257 9.2223,-11.5941 20.0147,-8.9681 32.1252,5.5954 12.3911,-19.7186 25.706,-18.519 39.5387,-5.5954 4.0629,-4.8576 7.7526,-13.0937 13.1796,-5.5954 5.4916,-2.5937 10.9829,-9.2401 16.4744,-2.7977 57.96,-25.5257 83.2408,-3.9641 110.3791,14.921 15.1317,-8.3376 26.0358,-24.4528 51.8945,-13.0558 2.4173,-11.638 16.2824,-16.3634 40.3625,-14.9211 -24.6985,-14.0451 -25.9691,-22.0409 31.3015,-14.9211 -39.9179,-11.5016 -76.7041,-23.0032 -14.8271,-34.5049 -14.4922,-4.5662 -61.8613,6.1755 -9.8847,-48.4933 -36.9085,12.0657 -70.4145,15.2007 -80.7249,-33.5725 -19.9115,12.8266 -41.9579,19.1806 -59.3081,-10.2582 -15.8027,13.7936 -37.9137,10.4819 -49.4234,3.7302 -3.114,15.1069 -26.6303,38.2752 -58.4843,-3.7302 6.989,23.8751 1.6991,61.9029 -35.4201,-0.9326 -0.7362,10.9306 14.5493,70.3734 -88.9621,-0.9326 12.9121,47.8406 -21.4561,20.0035 -48.59972,3.7302 13.46032,29.9949 -6.7969,32.3145 -51.0709,14.9211 34.1543,28.4805 -0.96419,20.6172 -23.06429,19.584 z"
       id="path3549-2"
       inkscape:connector-curvature="0"
       sodipodi:nodetypes="ccccccccccccccccccccccccccccc" />
    <path
       style="color:#000000;display:inline;overflow:visible;visibility:visible;fill:#ffffff;fill-opacity:1;fill-rule:nonzero;stroke:none;stroke-width:0.94901901px;marker:none;enable-background:accumulate"
       d="m 721.54955,1756.655 c 65.51134,15.425 132.2838,30.5991 20.78364,81.2353 107.91544,-16.2519 43.05755,11.8906 17.49852,29.935 191.94676,-41.4052 70.14409,17.8474 24.61792,52.6287 42.40886,-14.8404 108.96828,-54.5176 86.2551,-2.3845 50.04144,-26.6335 128.52974,-74.8686 36.8047,-0.39 77.18072,-45.8924 78.8959,-41.119 37.86798,-5.9045 50.51303,-31.4082 59.15789,-25.9232 53.40955,-6.5312 31.81004,-40.6127 38.83064,-22.5251 48.75174,-12.9095 14.9492,-14.208 33.6574,-11.8811 55.5213,4.3267 19.7757,-23.9364 42.7035,1.4801 42.8107,24.3218 16.3395,-34.413 43.3672,-39.2878 68.6301,-0.9563 0.4935,-22.9435 0.1235,-71.9868 38.9754,-0.077 -10.1663,-65.7771 115.9638,-37.9895 176.7837,3.324 -35.7979,-48.2731 -5.2981,-79.0486 68.9088,-56.8129 3.2737,-13.7886 26.7015,-20.2784 68.1124,-20.2561 -43.4163,-14.7301 -46.1949,-24.0007 52.5709,-19.6293 -69.3303,-10.7004 -133.289,-21.6174 -28.0178,-39.3597 -25.1999,-4.3417 -105.6434,11.5073 -20.589,-56.0738 -62.4024,16.6752 -119.6378,22.6623 -140.9777,-33.7096 -33.1916,16.3899 -70.5299,25.3519 -102.4955,-7.9038 -26.0717,17.2375 -64.2451,14.8911 -84.4929,7.7849 -4.209,17.8968 -42.8084,46.6403 -100.5935,-0.3202 13.777,27.4604 7.5539,72.3351 -60.8234,1.3589 -0.4433,12.8442 30.2296,81.36 -152.66022,5.0624 25.73287,55.1004 -35.30271,24.8968 -83.07999,7.7278 25.33554,34.1756 -9.23629,38.2919 -86.47975,20.9969 60.7169,30.9716 -0.10869,24.1975 -38.09269,24.517 z"
       id="path3549"
       inkscape:connector-curvature="0"
       sodipodi:nodetypes="ccccccccccccccccccccccccccccc" />
    <path
       style="color:#000000;display:inline;overflow:visible;visibility:visible;fill:#ffffff;fill-opacity:1;fill-rule:nonzero;stroke:none;stroke-width:0.73750591px;marker:none;enable-background:accumulate"
       d="m 541.5403,426.349 c 19.35438,-34.48897 124.62465,-31.54474 159.65002,-16.60243 35.02522,14.94213 48.05789,40.67597 49.68696,49.80737 1.62899,9.13132 -2.44359,51.46759 -20.36356,59.7689 -17.91985,8.30121 -69.23588,12.45182 -87.15584,12.45182 -17.91986,0 -75.12413,-5.2837 -89.59959,-17.43262 C 539.91108,502.72032 522.18584,460.83788 541.5403,426.349 Z"
       id="path3330"
       inkscape:connector-curvature="0"
       sodipodi:nodetypes="zsssssz" />
    <path
       style="color:#000000;display:inline;overflow:visible;visibility:visible;fill:#ffffff;fill-opacity:1;fill-rule:nonzero;stroke:none;stroke-width:0.94338304px;marker:none;enable-background:accumulate"
       d="m 456.02228,691.38453 c -10.16415,-60.08041 16.94021,-219.66888 225.30613,-206.52623 208.36574,13.14241 232.60882,82.72228 247.32846,110.77304 7.56889,18.62651 72.14413,144.63427 -91.61865,168.38164 -165.753,24.03598 -330.19496,13.73698 -381.01594,-72.62845 z"
       id="path3525"
       inkscape:connector-curvature="0"
       sodipodi:nodetypes="cscsc" />
    <flowRoot
       xml:space="preserve"
       id="flowRoot2987-4-9-3"
       style="font-style:normal;font-variant:normal;font-weight:normal;font-stretch:normal;line-height:0.01%;font-family:Lavi;-inkscape-font-specification:Lavi;text-align:center;letter-spacing:0px;word-spacing:0px;text-anchor:middle;fill:#000000;fill-opacity:1;stroke:none"
       transform="translate(272.58969,257.02206)"><flowRegion
         id="flowRegion2989-5-4-5"><rect
           id="rect2991-7-9-6"
           width="602.40173"
           height="310.73996"
           x="120.55251"
           y="265.53046"
           style="font-style:normal;font-variant:normal;font-weight:normal;font-stretch:normal;font-family:Lavi;-inkscape-font-specification:Lavi;text-align:center;text-anchor:middle" /></flowRegion><flowPara
         style="font-size:48px;line-height:1.25;text-align:center;text-anchor:middle"
         id="flowPara98">.i le nu ro da </flowPara><flowPara
         style="font-size:48px;line-height:1.25;text-align:center;text-anchor:middle"
         id="flowPara118">cliva cu fadni le ka</flowPara><flowPara
         style="font-size:48px;line-height:1.25;text-align:center;text-anchor:middle"
         id="flowPara124">fasnu vau le jai ca nu</flowPara><flowPara
         style="font-size:48px;line-height:1.25;text-align:center;text-anchor:middle"
         id="flowPara126">mi'o tigni</flowPara></flowRoot>    <flowRoot
       transform="translate(208.59665,162.53048)"
       style="font-style:normal;font-variant:normal;font-weight:normal;font-stretch:normal;line-height:0.01%;font-family:Lavi;-inkscape-font-specification:Lavi;text-align:center;letter-spacing:0px;word-spacing:0px;text-anchor:middle;fill:#000000;fill-opacity:1;stroke:none"
       id="flowRoot3045"
       xml:space="preserve"><flowRegion
         id="flowRegion3047"><rect
           style="font-style:normal;font-variant:normal;font-weight:normal;font-stretch:normal;font-family:Lavi;-inkscape-font-specification:Lavi;text-align:center;text-anchor:middle"
           y="265.53046"
           x="120.55251"
           height="310.73996"
           width="602.40173"
           id="rect3049" /></flowRegion><flowPara
         id="flowPara3055"
         style="font-size:48px;line-height:1.25;text-align:center;text-anchor:middle">.i .i'a</flowPara></flowRoot>    <path
       style="color:#000000;display:inline;overflow:visible;visibility:visible;fill:#ffffff;fill-opacity:1;fill-rule:nonzero;stroke:none;stroke-width:1px;marker:none;enable-background:accumulate"
       d="m 900.08615,716.05926 c 42.51329,20.49356 123.80235,14.32923 138.26235,-30.35733 -49.15569,36.55167 -109.63611,20.90132 -120.75593,10.89767 -11.11981,-10.00366 -17.50642,19.45966 -17.50642,19.45966 z"
       id="path3978"
       inkscape:connector-curvature="0" />
    <path
       style="color:#000000;display:inline;overflow:visible;visibility:visible;fill:#ffffff;fill-opacity:1;fill-rule:nonzero;stroke:none;stroke-width:0.93705124px;marker:none;enable-background:accumulate"
       d="m 1551.0886,795.42187 c 50.8379,-93.44304 302.1222,-85.46607 383.8805,-44.98197 81.7575,40.48363 109.508,110.20588 112.1935,134.94616 2.6855,24.74003 -12.657,139.44424 -56.5982,161.93554 -43.9408,22.491 -167.1739,33.7364 -210.0158,33.7364 -42.8419,0 -178.9029,-14.3154 -211.9013,-47.2313 -31.5662,-31.4874 -68.397,-144.96201 -17.5587,-238.40483 z"
       id="path3330-3"
       inkscape:connector-curvature="0"
       sodipodi:nodetypes="zsssssz" />
    <path
       style="color:#000000;display:inline;overflow:visible;visibility:visible;fill:#ffffff;fill-opacity:1;fill-rule:nonzero;stroke:none;stroke-width:1px;marker:none;enable-background:accumulate"
       d="m 1441.4333,792.86046 c 1.8123,17.9111 3.4719,36.60072 12.514,52.57918 2.6665,4.48827 5.7379,8.94714 9.7431,12.29849 4.9422,2.55729 10.902,0.92324 14.9972,-2.48609 6.2588,-4.50938 10.9613,-11.84776 18.8831,-13.58596 5.7972,-1.12556 10.4379,3.16953 14.6457,6.42604 10.5623,8.51108 20.0337,18.50261 31.8998,25.28467 12.8634,8.50453 27.0155,16.51979 42.7488,17.47511 6.2316,0.27366 12.7888,-0.31154 18.2031,-3.68195 14.2818,-8.01643 24.173,-24.34511 22.834,-40.90808 -1.8569,-10.48428 -12.9332,-19.03038 -23.5991,-16.39316 -5.6511,1.30784 -9.507,6.21921 -11.5244,11.3814 -5.4816,8.7963 -15.7551,13.86937 -26.0014,13.88113 -8.456,0.14805 -16.8709,-2.36044 -24.0764,-6.73748 -11.3704,-3.36484 -18.2685,-13.64874 -26.3598,-21.52774 -3.7502,-3.54453 -7.9795,-7.06083 -13.0234,-8.42848 -7.6564,-0.23923 -13.3775,5.76673 -17.631,11.40618 -4.5368,5.70318 -9.1549,12.83128 -16.9484,14.04463 -5.2949,1.57023 -8.0628,-4.3141 -11.2198,-7.42808 -8.8564,-11.35341 -14.0534,-25.32791 -16.0433,-39.50562 -0.089,-1.36474 -0.067,-2.72787 -0.042,-4.09419 z"
       id="path4496"
       inkscape:connector-curvature="0"
       inkscape:transform-center-x="-99.717282"
       inkscape:transform-center-y="101.38562" />
    <flowRoot
       xml:space="preserve"
       id="flowRoot2987-4-9-3-8"
       style="font-style:normal;font-variant:normal;font-weight:normal;font-stretch:normal;line-height:0.01%;font-family:Lavi;-inkscape-font-specification:Lavi;text-align:center;letter-spacing:0px;word-spacing:0px;text-anchor:middle;fill:#000000;fill-opacity:1;stroke:none"
       transform="translate(1347.1914,493.63886)"><flowRegion
         id="flowRegion2989-5-4-5-8"><rect
           id="rect2991-7-9-6-5"
           width="602.40173"
           height="310.73996"
           x="120.55251"
           y="265.53046"
           style="font-style:normal;font-variant:normal;font-weight:normal;font-stretch:normal;font-family:Lavi;-inkscape-font-specification:Lavi;text-align:center;text-anchor:middle" /></flowRegion><flowPara
         style="font-size:48px;line-height:1.25;text-align:center;text-anchor:middle"
         id="flowPara3138">.i .o'u mi finti</flowPara><flowPara
         style="font-size:48px;line-height:1.25;text-align:center;text-anchor:middle"
         id="flowPara4669">pa zabna tadji</flowPara><flowPara
         style="font-size:48px;line-height:1.25;text-align:center;text-anchor:middle"
         id="flowPara9411">be le nu pilno </flowPara><flowPara
         style="font-size:48px;line-height:1.25;text-align:center;text-anchor:middle"
         id="flowPara4671">le za'e mixre pe do</flowPara><flowPara
         style="font-size:48px;line-height:1.25;text-align:center;text-anchor:middle"
         id="flowPara3140">doi la karot.</flowPara></flowRoot>    <path
       style="color:#000000;display:inline;overflow:visible;visibility:visible;fill:#ffffff;fill-opacity:1;fill-rule:nonzero;stroke:none;stroke-width:1.08336055px;marker:none;enable-background:accumulate"
       d="m 1726.43,1121.2857 c 46.4491,-76.4647 305.1928,-85.7425 389.2513,-52.6143 84.058,33.1279 103.1319,81.9465 107.0415,102.1915 3.9094,20.245 6.3393,99.0823 -39.7182,138.5226 -35.3867,30.3025 -169.2124,45.6372 -212.2192,45.6372 -43.0064,0 -180.2928,-11.7143 -215.0329,-38.6495 -33.2325,-25.7664 -75.7719,-118.6227 -29.3225,-195.0875 z"
       id="path3330-7"
       inkscape:connector-curvature="0"
       sodipodi:nodetypes="zsssssz" />
    <flowRoot
       xml:space="preserve"
       id="flowRoot2987-4-9-3-8-9"
       style="font-style:normal;font-variant:normal;font-weight:normal;font-stretch:normal;line-height:0.01%;font-family:Lavi;-inkscape-font-specification:Lavi;text-align:center;letter-spacing:0px;word-spacing:0px;text-anchor:middle;fill:#000000;fill-opacity:1;stroke:none"
       transform="translate(1531.328,831.56854)"><flowRegion
         id="flowRegion2989-5-4-5-8-6"><rect
           id="rect2991-7-9-6-5-0"
           width="602.40173"
           height="310.73996"
           x="120.55251"
           y="265.53046"
           style="font-style:normal;font-variant:normal;font-weight:normal;font-stretch:normal;font-family:Lavi;-inkscape-font-specification:Lavi;text-align:center;text-anchor:middle" /></flowRegion><flowPara
         style="font-size:48px;line-height:1.25;text-align:center;text-anchor:middle"
         id="flowPara136">.i nu bu cu nu mi'o</flowPara><flowPara
         style="font-size:48px;line-height:1.25;text-align:center;text-anchor:middle"
         id="flowPara140">jai gau cnici fai ti</flowPara><flowPara
         style="font-size:48px;line-height:1.25;text-align:center;text-anchor:middle"
         id="flowPara9418">gi'e ba bo klama</flowPara><flowPara
         style="font-size:48px;line-height:1.25;text-align:center;text-anchor:middle"
         id="flowPara9420">le zdani</flowPara></flowRoot>    <flowRoot
       xml:space="preserve"
       id="flowRoot2987-4-9-3-8-9-5"
       style="font-style:normal;font-variant:normal;font-weight:normal;font-stretch:normal;line-height:0.01%;font-family:Lavi;-inkscape-font-specification:Lavi;text-align:center;letter-spacing:0px;word-spacing:0px;text-anchor:middle;fill:#000000;fill-opacity:1;stroke:none"
       transform="translate(725.21911,1446.0215)"><flowRegion
         id="flowRegion2989-5-4-5-8-6-3"><rect
           id="rect2991-7-9-6-5-0-1"
           width="602.40173"
           height="310.73996"
           x="120.55251"
           y="265.53046"
           style="font-style:normal;font-variant:normal;font-weight:normal;font-stretch:normal;font-family:Lavi;-inkscape-font-specification:Lavi;text-align:center;text-anchor:middle" /></flowRegion><flowPara
         style="font-size:48px;line-height:1.25;text-align:center;text-anchor:middle"
         id="flowPara3211-2">le io nai</flowPara></flowRoot>    <path
       style="color:#000000;display:inline;overflow:visible;visibility:visible;fill:#ffffff;fill-opacity:1;fill-rule:nonzero;stroke:none;stroke-width:1px;marker:none;enable-background:accumulate"
       d="m 799.55794,2061.6662 c 41.54476,-24.9583 79.49671,-56.3087 125.21587,-73.8403 l -43.51369,-5.8567 c 12.70794,-14.5474 33.04403,-20.2182 50.79008,-28.9032 l -26.26055,-7.9369 c 30.43962,-33.9774 70.07719,-50.7411 105.26895,-75.8248 l -46.93148,-10.2988 c -32.40962,29.4099 -59.34882,63.5475 -97.91175,87.6396 l 24.81802,10.2865 c -12.06842,10.1205 -24.58698,19.7921 -39.1159,27.4588 l 32.36116,10.2326 z"
       id="path4032"
       inkscape:connector-curvature="0"
       sodipodi:nodetypes="cccccccccccc" />
    <flowRoot
       transform="matrix(0.93080411,0,-0.09044116,1.21695,692.06542,1428.3539)"
       style="font-style:normal;font-variant:normal;font-weight:normal;font-stretch:normal;line-height:0.01%;font-family:Lavi;-inkscape-font-specification:Lavi;text-align:center;letter-spacing:0px;word-spacing:0px;text-anchor:middle;fill:#000000;fill-opacity:1;stroke:#000000;stroke-width:2.71217394;stroke-miterlimit:4;stroke-dasharray:none;stroke-opacity:1"
       id="flowRoot4212-3-7-8-6"
       xml:space="preserve"><flowRegion
         id="flowRegion4214-6-7-8-3"><rect
           style="font-style:normal;font-variant:normal;font-weight:normal;font-stretch:normal;font-family:Lavi;-inkscape-font-specification:Lavi;text-align:center;text-anchor:middle;stroke:#000000;stroke-width:2.71217394;stroke-miterlimit:4;stroke-dasharray:none;stroke-opacity:1"
           y="284.74136"
           x="84.744102"
           height="333.9072"
           width="914.18988"
           id="rect4216-4-0-26-5" /></flowRegion><flowPara
         style="font-size:48px;line-height:1.25;text-align:center;letter-spacing:5.20896292px;text-anchor:middle;stroke:#000000;stroke-width:2.71217394;stroke-miterlimit:4;stroke-dasharray:none;stroke-opacity:1"
         id="flowPara3048">du'e va'e barda no'e morsi</flowPara></flowRoot>    <path
       style="fill:#ffffff;fill-opacity:1;stroke:none;stroke-width:1.04715157"
       d="m 857.3428,2875.6026 c -31.56016,-6.8708 -43.71264,-13.258 -38.06733,-17.1941 -12.94465,-1.9615 -17.98851,-53.0973 -5.8951,-62.4448 0.80494,-0.984 6.45375,-3.9365 4.02616,-4.4272 -2.42745,-0.4907 -16.97618,0.9903 -19.40928,-0.9754 -2.4331,-1.9659 21.71857,-30.0034 18.48066,-30.9856 -3.23818,-0.9819 -53.41798,-5.0755 -63.94588,-9.4966 -10.52809,-4.421 -29.04904,7.0768 -32.28518,6.5863 3.8191,-14.2548 -33.14206,2.4724 -37.18684,1.9824 -4.04449,-0.4902 -11.37705,-15.2384 -15.42173,-15.7283 -4.04479,-0.4901 -22.61603,6.4014 -25.85216,5.9112 -3.23614,-0.4904 -1.66509,-12.7839 -5.70987,-13.2737 -4.04469,-0.4902 -21.79252,10.3348 -24.22009,9.8442 -2.42751,-0.4908 -11.41441,-25.0727 -15.46276,-26.5461 -4.04843,-1.4734 -29.81528,27.0565 -32.23922,27.5493 -2.42375,0.4927 -17.91419,-33.429 -21.15044,-33.9195 -3.23613,-0.4903 -19.3186,23.1187 -21.74625,22.628 -2.42755,-0.4907 -17.84213,-14.2524 -21.08002,-15.2344 -3.238,-0.982 -24.14246,30.496 -27.37665,30.4975 -3.23441,0 -30.7756,-13.2635 -33.21066,-15.721 -2.43497,-2.4575 -4.80318,12.7865 -8.03749,12.7879 -3.23432,0 -40.46171,-8.8341 -41.26856,-8.3421 -0.80664,0.4922 5.69709,9.832 3.27141,9.8331 -2.4257,0 -40.47471,-12.2763 -42.08275,-9.8169 -1.60773,2.4592 -82.52023,-12.2585 -88.17282,-10.2894 -5.65259,1.9693 36.53736,40.3052 32.50576,43.2571 -4.03179,2.952 -18.59921,-0.4839 -19.40217,0.9915 -0.80294,1.4756 8.92392,7.8637 6.5058,9.8316 -2.41849,1.9678 -29.88025,9.8467 -32.29659,12.306 -2.41653,2.4598 12.16178,8.8459 8.93314,10.3225 -3.22885,1.4765 -50.89942,10.8388 -51.69866,13.2977 -0.79926,2.4588 24.31071,14.2493 21.08946,17.6927 -3.22134,3.4433 -12.11007,4.9221 -11.29222,7.3804 0.81785,2.4583 16.19184,5.4021 15.39248,7.861 -0.79945,2.459 -8.83878,14.755 -11.25708,16.7229 -2.41831,1.9678 16.98366,0.9763 16.99106,2.9431 0.006,1.9669 12.83788,14.234 -30.91752,43.8839 67.22116,-22.9118 72.31739,-0.6303 99.01486,3.2922 26.69775,3.9227 16.27868,28.5125 20.32702,29.986 4.04846,1.4735 33.92861,-8.3732 37.98445,-4.933 4.05574,3.4405 5.69688,9.8319 8.93128,9.8306 3.23412,0 30.06413,-10.0372 34.10869,-9.5472 33.46676,-6.974 46.23297,15.227 39.50622,18.8592 5.66175,0.4893 27.45982,-8.3706 32.30944,-8.8643 4.84958,-0.4937 8.93859,11.7973 12.97778,10.8123 4.03921,-0.9849 29.88007,-9.8467 33.92645,-8.8649 4.04662,0.9818 7.29571,4.9141 10.52641,3.9292 3.23038,-0.9846 17.76997,-4.9244 17.76997,-4.9244 0,0 10.52246,2.9459 15.37388,2.9439 4.85139,0 23.09314,-12.4678 27.13232,-13.453 4.03916,-0.985 41.42669,4.329 58.81003,34.6438 -9.8389,-35.735 28.80782,-38.94 34.46229,-40.4175 5.65436,-1.4775 22.65111,2.9408 24.26248,1.465 1.61166,-1.4759 6.43345,-9.3451 11.28314,-9.8389 4.84957,-0.4937 16.16206,-2.4651 16.16206,-2.4651 l -1.62812,-2.9497 c 0,0 33.98939,7.8532 38.0434,10.8018 4.0539,2.9486 -2.47386,-12.7833 -4.91438,-16.7161 14.5689,3.9278 57.45465,12.269 60.69808,14.7262 3.24357,2.4572 -5.69308,-8.8486 -10.55754,-12.2885 6.47406,1.4726 12.13592,1.962 12.13592,1.962 l -18.64149,-11.7934 5.65636,-0.9858 c 0,0 -12.14886,-5.4039 -12.15815,-7.8625 -0.008,-2.4584 31.51373,-5.4219 31.51373,-5.4219 0,0 -12.9538,-4.42 -9.72881,-6.8798 3.22526,-2.46 11.3053,-3.9384 11.3053,-3.9384 l 1.59304,-6.3929 z"
       id="path5888"
       inkscape:connector-curvature="0"
       sodipodi:nodetypes="ccccccccccsccccsccccccsccsccscsccccscccscccccscccccsccccscccccccccccc" />
    <flowRoot
       xml:space="preserve"
       id="flowRoot2987-4-9-3-0"
       style="font-style:normal;font-variant:normal;font-weight:normal;font-stretch:normal;line-height:0.01%;font-family:Lavi;-inkscape-font-specification:Lavi;text-align:center;letter-spacing:0px;word-spacing:0px;text-anchor:middle;fill:#000000;fill-opacity:1;stroke:none"
       transform="translate(120.66404,2524.3888)"><flowRegion
         id="flowRegion2989-5-4-5-1"><rect
           id="rect2991-7-9-6-4"
           width="602.40173"
           height="310.73996"
           x="120.55251"
           y="265.53046"
           style="font-style:normal;font-variant:normal;font-weight:normal;font-stretch:normal;font-family:Lavi;-inkscape-font-specification:Lavi;text-align:center;text-anchor:middle" /></flowRegion><flowPara
         style="font-size:48px;line-height:1.25;text-align:center;letter-spacing:1.5px;text-anchor:middle;stroke:#000000;stroke-width:1.10000002;stroke-miterlimit:4;stroke-dasharray:none;stroke-opacity:1"
         id="flowPara4687">.i pei mi punji fi do</flowPara><flowPara
         style="font-size:48px;line-height:1.25;text-align:center;letter-spacing:1.5px;text-anchor:middle;stroke:#000000;stroke-width:1.10000002;stroke-miterlimit:4;stroke-dasharray:none;stroke-opacity:1"
         id="flowPara9424">fe ti voi ro moi mixre</flowPara></flowRoot>    <path
       style="fill:#ffffff;fill-opacity:1;stroke:none;stroke-width:0.97918153"
       d="m 1797.6547,3221.0213 c 62.9104,10.0559 41.7471,-29.1424 37.7397,-34.0012 15.3216,8.1536 41.4275,-0.8175 14.2722,-29.198 38.5829,11.3918 19.6964,6.02 -2.753,-24.5295 33.9847,15.5342 55.4154,5.7083 31.2754,-15.8279 34.6751,27.6918 46.8944,18.8512 24.779,-15.5352 43.6058,35.6171 35.446,22.2031 24.8195,4.6146 36.3141,32.1026 9.327,-15.6704 12.1037,-15.929 2.7767,-0.2589 14.5261,8.408 16.7586,8.095 2.2323,-0.3129 2.5195,-13.6711 5.2963,-13.9298 2.7767,-0.2589 13.5413,12.5937 15.2294,12.2266 6.5491,4.5107 13.4454,-23.2422 13.3146,-27.5889 -2.7915,3.7697 13.1984,34.6638 18.6914,31.8484 1.5779,0.6925 20.1714,-35.5723 17.9507,-35.1591 -4.1419,0.7704 8.3937,26.5651 12.1652,25.8438 2.999,4.7786 15.3845,-7.0605 15.8592,-15.0197 -1.1666,2.2521 9.1273,37.8823 15.095,34.7029 2.6935,6.6828 22.6207,-6.6134 24.0792,-14.7361 1.9083,-2.4872 1.835,14.105 4.0123,14.3219 -3.8419,8.1765 24.1646,-1.4809 28.697,-6.244 0.4894,0.5843 -2.7017,8.6896 -3.2781,10.3829 -3.1068,9.1256 22.4979,0.9885 29.4065,-7.7798 -26.6439,43.7563 51.1297,0.8958 60.4889,-5.2187 3.5902,2.4998 -29.0087,41.0184 -26.6173,44.4695 2.3915,3.4512 12.5752,0.7174 12.9542,2.3624 0.3791,1.6442 -6.8685,7.8833 -5.4559,10.1659 1.413,2.2825 19.0399,12.6063 20.3978,15.4187 1.3578,2.8128 -9.156,8.7264 -7.1437,10.5334 2.0124,1.807 33.0826,15.0762 33.3516,17.7802 0.2692,2.7041 -17.9262,13.7426 -16.1341,17.6694 1.7921,3.9269 7.6146,6.1133 6.7951,8.7091 -0.8196,2.5957 -11.4923,4.7452 -11.2232,7.4494 0.2693,2.7042 4.3365,16.4961 5.7494,18.7785 1.4128,2.2828 -11.5412,-0.079 -11.7612,2.0412 -0.2251,2.1195 -34.8317,9.709 18.7929,49.5612 -58.2432,-25.4505 -51.3979,-5.6882 -69.8015,-3.238 -18.4037,2.4504 -14.0792,29.6546 -16.966,30.9735 -2.8867,1.3187 -21.9265,-11.2875 -25.0336,-7.8488 -3.107,3.4387 -4.9111,10.2202 -7.0887,10.0032 -2.1772,-0.2155 -19.1427,-12.824 -21.9193,-12.5653 -21.7689,-9.7479 -32.7926,13.336 -28.6612,17.7 -3.8654,0.1504 -17.5719,-10.8537 -20.7829,-11.709 -3.211,-0.8554 -7.3088,12.1231 -9.9203,10.7921 -2.6117,-1.331 -19.0398,-12.6064 -21.8714,-11.8174 -2.832,0.7888 -5.4496,4.8119 -7.5169,3.5346 -2.0672,-1.2766 -11.4251,-6.4927 -11.4251,-6.4927 0,0 -7.4067,2.475 -10.6727,2.1496 -3.2662,-0.3232 -23.7676,-20.0382 -26.379,-21.3694 -2.6118,-1.3311 -48.334,26.3975 -47.0312,29.7402 1.3028,3.3428 -1.9047,-35.151 -5.5499,-37.1206 -3.6452,-1.9696 -15.5718,1.6615 -16.4951,-0.037 -0.9237,-1.6984 -3.3091,-10.5033 -6.5201,-11.3588 -3.2111,-0.8554 -10.6116,-3.7344 -10.6116,-3.7344 l 1.4189,-3.0717 c 0,0 -23.743,6.2022 -26.7949,9.111 -3.052,2.9086 3.0641,-13.6169 5.1376,-17.6943 -10.2384,3.2641 -40.0244,9.3995 -42.4767,11.8325 -2.4527,2.4329 4.8008,-9.1603 8.4523,-12.5448 -4.5198,1.1563 -8.3853,1.3067 -8.3853,1.3067 l 13.8408,-11.4724 -3.7004,-1.4395 c 0,0 8.7707,-5.0166 9.0457,-7.6666 0.2788,-2.6494 -20.6236,-7.9447 -20.6236,-7.9447 63.8677,1.4697 17.5485,-18.0658 -7.3762,-24.2961 z"
       id="path5888-2"
       inkscape:connector-curvature="0"
       sodipodi:nodetypes="ccccccccsccccsccccccsccsccscsccccscccscccccscccccsccccsccccccccc" />
    <path
       style="color:#000000;display:inline;overflow:visible;visibility:visible;fill:#ffffff;fill-opacity:1;fill-rule:nonzero;stroke:none;stroke-width:1px;marker:none;enable-background:accumulate"
       d="m 1949.2127,3186.2754 c -39.3897,38.4564 -118.4251,55.0326 -170.6211,-13.769 -46.1636,-0.3962 -81.2149,-5.1531 -119.4658,-62.8545 37.6962,38.0583 63.3903,55.3293 131.4185,51.4723 32.2972,32.3957 87.7359,29.3893 125.5394,-24.8478 37.8036,-54.2372 22.7273,-42.2473 22.7273,-42.2473 l 22.0999,76.6516 z"
       id="path5074-3"
       inkscape:connector-curvature="0"
       sodipodi:nodetypes="ccccsccc" />
    <flowRoot
       xml:space="preserve"
       id="flowRoot2987-4-9-3-0-3"
       style="font-style:normal;font-variant:normal;font-weight:normal;font-stretch:normal;line-height:0.01%;font-family:Lavi;-inkscape-font-specification:Lavi;text-align:center;letter-spacing:0px;word-spacing:0px;text-anchor:middle;fill:#000000;fill-opacity:1;stroke:none"
       transform="translate(1610.3918,2899.1214)"><flowRegion
         id="flowRegion2989-5-4-5-1-6"><rect
           id="rect2991-7-9-6-4-7"
           width="602.40173"
           height="310.73996"
           x="120.55251"
           y="265.53046"
           style="font-style:normal;font-variant:normal;font-weight:normal;font-stretch:normal;font-family:Lavi;-inkscape-font-specification:Lavi;text-align:center;text-anchor:middle" /></flowRegion><flowPara
         style="font-size:48px;line-height:1.25;text-align:center;letter-spacing:1.5px;text-anchor:middle;stroke:#000000;stroke-width:1.10000002;stroke-miterlimit:4;stroke-dasharray:none;stroke-opacity:1"
         id="flowPara4202">.i xu ue xo'o</flowPara><flowPara
         style="font-size:48px;line-height:1.25;text-align:center;letter-spacing:1.5px;text-anchor:middle;stroke:#000000;stroke-width:1.10000002;stroke-miterlimit:4;stroke-dasharray:none;stroke-opacity:1"
         id="flowPara9428">do na djica</flowPara></flowRoot>    <path
       style="color:#000000;display:inline;overflow:visible;visibility:visible;fill:#ffffff;fill-opacity:1;fill-rule:nonzero;stroke:none;stroke-width:0.93696803px;marker:none;enable-background:accumulate"
       d="m 432.9877,1617.0627 c -4.62527,12.4274 -29.80658,52.1951 -38.06244,14.2303 -42.3877,58.7063 -90.94164,48.6702 -139.14497,42.5415 -9.52731,17.151 -7.09875,40.5284 -46.96241,41.8809 7.95498,13.9748 -3.45476,26.5131 -32.14335,37.7702 40.98017,2.1523 49.77676,10.1919 -21.84737,32.9428 55.93525,-8.729 108.31222,-15.7896 48.57741,29.7155 20.66662,-2.7434 64.61473,-39.6905 55.82445,47.5981 30.8443,-32.8175 66.03449,-54.0861 122.59982,-6.41 10.83096,-24.5912 30.03942,-43.2637 76.82521,-20.4151 5.27288,-23.4564 55.3579,-34.0294 74.64488,-32.8013 -41.4714,-18.0042 -42.72921,-33.4479 7.62637,-44.6355 -92.48457,-29.3636 -21.82215,-34.798 -9.97409,-48.3811 -69.36813,-3.6001 -42.62685,-27.7127 -33.87821,-48.6361 -76.91874,12.707 -56.82784,-21.892 -64.0853,-45.4002 z"
       id="path3549-3"
       inkscape:connector-curvature="0"
       sodipodi:nodetypes="ccccccccccccccc" />
    <flowRoot
       transform="matrix(1.8217115,0,-0.17700578,1.8738433,-535.05413,1192.7224)"
       style="font-style:normal;font-variant:normal;font-weight:normal;font-stretch:normal;line-height:0.01%;font-family:Lavi;-inkscape-font-specification:Lavi;text-align:center;letter-spacing:0px;word-spacing:0px;text-anchor:middle;fill:#000000;fill-opacity:1;stroke:#000000;stroke-width:2.71217394;stroke-miterlimit:4;stroke-dasharray:none;stroke-opacity:1"
       id="flowRoot4212-3-7-8-6-5"
       xml:space="preserve"><flowRegion
         id="flowRegion4214-6-7-8-3-6"><rect
           style="font-style:normal;font-variant:normal;font-weight:normal;font-stretch:normal;font-family:Lavi;-inkscape-font-specification:Lavi;text-align:center;text-anchor:middle;stroke:#000000;stroke-width:2.71217394;stroke-miterlimit:4;stroke-dasharray:none;stroke-opacity:1"
           y="265.53046"
           x="120.55251"
           height="355.03918"
           width="798.1947"
           id="rect4216-4-0-26-5-2" /></flowRegion><flowPara
         style="font-size:48px;line-height:1.25;text-align:center;letter-spacing:1.45219982px;text-anchor:middle;stroke:#000000;stroke-width:2.71217394;stroke-miterlimit:4;stroke-dasharray:none;stroke-opacity:1"
         id="flowPara4358-7-1-6">ju'i</flowPara></flowRoot>    <flowRoot
       xml:space="preserve"
       id="flowRoot4133-6-9-4-8-5-3"
       style="color:#000000;font-style:normal;font-variant:normal;font-weight:normal;font-stretch:normal;line-height:0.01%;font-family:Arial;-inkscape-font-specification:Arial;letter-spacing:0.00204969px;word-spacing:0px;display:inline;overflow:visible;visibility:visible;fill:#ffffff;fill-opacity:1;fill-rule:nonzero;stroke:#ffffff;stroke-width:0.0836072;stroke-linecap:butt;stroke-linejoin:miter;stroke-miterlimit:4;stroke-dasharray:none;stroke-dashoffset:0;stroke-opacity:1;marker:none;filter:url(#filter4375-4-1-1-15-1-3-3);enable-background:accumulate"
       transform="matrix(8.3099216,-5.4900388,-0.26452567,16.18078,-7093.1327,-9087.3999)"><flowRegion
         id="flowRegion4135-2-9-3-5-2-6"
         style="stroke-width:0.86646658"><rect
           id="rect4137-1-7-1-2-1-4"
           width="200.00224"
           height="39.051064"
           x="1125.3193"
           y="1078.5308"
           style="color:#000000;letter-spacing:0.00204969px;display:inline;overflow:visible;visibility:visible;fill:#ffffff;fill-opacity:1;fill-rule:nonzero;stroke:#ffffff;stroke-width:0.0836072;stroke-linecap:butt;stroke-linejoin:miter;stroke-miterlimit:4;stroke-dasharray:none;stroke-dashoffset:0;stroke-opacity:1;marker:none;filter:url(#filter4375-4-1-1-15-1-3-3);enable-background:accumulate" /></flowRegion><flowPara
         id="flowPara4139-2-8-6-8-6-3"
         style="color:#000000;font-style:normal;font-variant:normal;font-weight:normal;font-stretch:normal;font-size:17.85409164px;line-height:125%;font-family:Lavi;-inkscape-font-specification:Lavi;letter-spacing:0.00204969px;word-spacing:0.00204969px;display:inline;overflow:visible;visibility:visible;fill:#ffffff;fill-opacity:1;fill-rule:nonzero;stroke:#ffffff;stroke-width:0.0836072;stroke-linecap:butt;stroke-linejoin:miter;stroke-miterlimit:4;stroke-dasharray:none;stroke-dashoffset:0;stroke-opacity:1;marker:none;enable-background:accumulate">K<flowSpan
   style="font-size:13.08514309px"
   id="flowSpan3116">R</flowSpan><flowSpan
   id="flowSpan3122"
   style="font-size:8.7063818px">A</flowSpan><flowSpan
   id="flowSpan3126"
   style="font-size:7.83930063px">K.</flowSpan></flowPara></flowRoot>  </g>
</svg>
