<?xml version="1.0" encoding="UTF-8" standalone="no"?>
<!-- Created with Inkscape (http://www.inkscape.org/) -->

<svg
   xmlns:dc="http://purl.org/dc/elements/1.1/"
   xmlns:cc="http://creativecommons.org/ns#"
   xmlns:rdf="http://www.w3.org/1999/02/22-rdf-syntax-ns#"
   xmlns:svg="http://www.w3.org/2000/svg"
   xmlns="http://www.w3.org/2000/svg"
   xmlns:xlink="http://www.w3.org/1999/xlink"
   xmlns:sodipodi="http://sodipodi.sourceforge.net/DTD/sodipodi-0.dtd"
   xmlns:inkscape="http://www.inkscape.org/namespaces/inkscape"
   id="svg2"
   version="1.1"
   inkscape:version="0.92.2 2405546, 2018-03-11"
   width="2481"
   height="3503"
   sodipodi:docname="E14P02.svg">
  <metadata
     id="metadata8">
    <rdf:RDF>
      <cc:Work
         rdf:about="">
        <dc:format>image/svg+xml</dc:format>
        <dc:type
           rdf:resource="http://purl.org/dc/dcmitype/StillImage" />
        <dc:title></dc:title>
      </cc:Work>
    </rdf:RDF>
  </metadata>
  <defs
     id="defs6" />
  <sodipodi:namedview
     pagecolor="#ffffff"
     bordercolor="#666666"
     borderopacity="1"
     objecttolerance="10"
     gridtolerance="10"
     guidetolerance="10"
     inkscape:pageopacity="0"
     inkscape:pageshadow="2"
     inkscape:window-width="1920"
     inkscape:window-height="1033"
     id="namedview4"
     showgrid="false"
     inkscape:zoom="0.65053827"
     inkscape:cx="492.90718"
     inkscape:cy="1134.6624"
     inkscape:window-x="0"
     inkscape:window-y="47"
     inkscape:window-maximized="0"
     inkscape:current-layer="layer1" />
  <g
     inkscape:groupmode="layer"
     id="layer2"
     inkscape:label="artwork"
     sodipodi:insensitive="true">
    <image
       sodipodi:absref="/home/midgard/git/peppercarrot/comics/ep14_The-Dragon-s-Tooth/lang/ca/../gfx_Pepper-and-Carrot_by-David-Revoy_E14P02.png"
       xlink:href="../gfx_Pepper-and-Carrot_by-David-Revoy_E14P02.png"
       y="0"
       x="0"
       id="image10"
       height="3503"
       width="2481" />
  </g>
  <g
     inkscape:groupmode="layer"
     id="layer3"
     inkscape:label="speechbubbles">
    <path
       style="fill:#ffffff;fill-rule:evenodd;stroke:none;stroke-width:1px;stroke-linecap:butt;stroke-linejoin:miter;stroke-opacity:1"
       d="m 116.39271,125.01045 c 27.11436,12.84293 67.77369,22.40868 2.79753,57.53267 24.65514,2.26732 55.04666,3.03659 30.77282,18.08169 9.35427,15.34205 -22.17487,30.68409 -44.76047,46.02614 23.62446,-5.37034 47.91541,-14.19368 16.44408,19.28423 16.90414,-0.95142 14.53012,7.80651 -8.05149,26.7419 53.31044,-35.32444 71.88705,-44.16601 74.13454,-16.4379 6.72758,-14.81655 19.81,-18.68176 11.19011,29.58823 34.85242,-84.74422 5.03037,85.59582 -4.19629,251.49995 17.1199,-76.23729 47.68498,-388.11014 51.75429,-230.13068 27.29082,-113.64788 66.04507,-18.86794 74.13454,-6.57516 -6.78908,-88.47609 42.94736,-51.77102 55.95059,-18.0817 -3.35217,-21.58677 12.59427,-65.06529 60.18953,-11.9905 -11.34835,-19.50565 -3.62502,-39.66182 39.12277,8.70292 -12.96389,-32.25639 11.05113,-41.3421 85.87198,-10.62404 -0.57715,-16.00848 7.34297,-26.33652 86.00706,2.35167 -1.47577,-14.70024 -17.51468,-34.9626 89.52094,-8.21895 0.69824,-25.65455 17.93987,-27.19316 47.97884,-15.2327 -5.13171,-22.04605 27.67432,-11.95183 69.25453,2.97228 -26.48264,-30.16714 9.62619,-26.77992 61.80851,-17.32781 -5.06708,-14.61437 -12.31138,-29.62237 18.18396,-37.80719 -31.14861,-34.91827 1.41298,-37.0807 11.1901,-50.9575 -21.93635,2.42931 -54.07984,-16.59824 -28.79514,-34.86703 -44.28386,6.75374 -28.02243,-14.35273 -25.58764,-25.8998 l -71.33702,-18.081696 -69.93824,-8.218953 -83.92588,-8.218953 -78.33083,-1.64379 h -79.72959 l -69.93824,3.287581 -60.14688,-8.218953 -61.54565,8.218953 -86.72342,-1.643791 -41.96293,27.944439 z"
       id="path4323"
       inkscape:connector-curvature="0"
       sodipodi:nodetypes="ccccccccccccccccccccccccccccccccccc" />
    <path
       style="fill:#ffffff;stroke:none"
       d="m 769.64342,368.8389 c -1.92547,-29.37566 32.59655,-102.91478 200.99343,-97.38339 168.39705,5.53134 221.10255,37.8436 226.03735,90.05888 7.8065,82.60313 -80.787,104.67751 -207.99916,110.79585 C 857.53306,478.6177 767.60802,421.91606 769.64342,368.8389 z"
       id="path3280"
       inkscape:connector-curvature="0"
       sodipodi:nodetypes="csssc" />
    <path
       style="color:#000000;display:inline;overflow:visible;visibility:visible;fill:#ffffff;fill-opacity:1;fill-rule:nonzero;stroke:none;stroke-width:1px;marker:none;enable-background:accumulate"
       d="m 818.55405,555.85967 c 39.18491,-37.68963 73.342,-77.76882 65.62626,-117.15486 -10.90688,-55.67559 -9.43261,-29.77014 -9.43261,-29.77014 l 41.81204,36.16737 c 4.42223,-1.37242 6.88006,49.17295 -98.00569,110.75763 z"
       id="path3072"
       inkscape:connector-curvature="0"
       sodipodi:nodetypes="csccc" />
    <path
       style="fill:#ffffff;fill-rule:evenodd;stroke:none;stroke-width:1"
       d="m 1292.2576,373.32184 c 12.1658,-32.17335 44.9273,-56.58424 80.5828,-72.88002 16.9683,-7.86735 36.3634,-13.63275 56.2102,-12.11624 19.7168,0.90609 38.9754,6.31613 58.9102,4.437 24.2402,-0.62062 48.9061,-3.32851 72.8679,0.54079 21.3013,4.22191 43.2477,6.40847 65.2291,6.53527 15.5073,-2.67987 29.6974,4.46273 43.5462,8.73484 12.4328,4.61458 25.1319,9.45602 35.5747,16.59401 9.6209,10.02028 21.1408,18.73777 30.8741,28.66886 6.3687,5.42924 5.7568,12.92846 5.4634,19.86886 -0.8271,14.21246 -2.2279,28.6493 -7.4271,42.34181 -3.1111,8.69294 -14.6108,11.56975 -23.447,15.56429 -20.9078,8.43248 -43.1091,14.82711 -63.0629,24.75034 -19.7685,5.0812 -40.777,2.70448 -61.0504,1.93661 -16.9878,-1.51252 -34.0767,-3.62166 -51.2105,-1.86276 -21.8073,1.28718 -43.5484,4.62 -65.4338,4.19311 -27.4162,-2.92943 -53.6736,-10.14239 -80.2423,-15.92843 -23.837,-5.09985 -45.5623,-14.68965 -66.4084,-24.94829 -11.1353,-5.8255 -22.9231,-12.59683 -26.8529,-23.33253 -3.2215,-7.39246 -3.9806,-15.30801 -4.1233,-23.09752 z"
       id="path4365"
       inkscape:connector-curvature="0" />
    <path
       style="fill:#ffffff;stroke:none"
       d="m 1600.5998,539.46175 c -28.0754,-14.3263 -28.0705,-24.10879 -27.1393,-35.26758 0.931,-11.15875 3.0258,-21.20884 -1.8373,-26.59493 -4.8629,-5.38607 -13.8837,-9.08681 -20.965,-10.93985 -7.0813,-1.85304 -2.5775,-10.15393 -3.484,-17.79341 -0.9066,-7.63954 -20.1711,-44.64576 -20.1711,-44.64576 0,0 -10.2917,29.72026 -10.4833,39.70135 -0.1918,9.98106 -0.313,13.62987 0.7147,17.62055 1.0279,3.99076 5.0156,13.43659 11.7527,17.22018 6.7371,3.78364 14.9313,4.06179 20.6767,5.77151 5.7455,1.70964 6.255,10.50318 7.37,19.09418 1.1149,8.59099 3.3294,14.64819 14.8496,23.66417 9.8749,7.72832 28.7163,12.16959 28.7163,12.16959 z"
       id="path3023"
       inkscape:connector-curvature="0"
       sodipodi:nodetypes="csssscssssssc" />
    <path
       style="fill:#ffffff;fill-rule:evenodd;stroke:none;stroke-width:1px;stroke-linecap:butt;stroke-linejoin:miter;stroke-opacity:1"
       d="m 568.8634,1318.3227 c 104.31326,44.7459 702.5032,155.1743 811.2553,71.8972 58.8149,31.0736 60.5988,42.1012 121.6331,4.8129 89.8869,43.503 111.1049,28.7465 133.2993,20.0459 48.5521,7.5979 70.9469,10.8128 141.1257,39.7648 -74.8014,-20.5225 -93.9086,-23.7561 -138.3472,-25.7747 -64.3635,22.373 -112.0813,-6.2147 -133.1658,-17.4012 -62.5836,39.1667 -64.7247,30.9426 -125.6546,-6.0558 -65.191,62.6405 -404.44384,23.8741 -807.88989,-63.3003 4.43886,-12.4294 -2.25591,-23.9888 -2.25591,-23.9888 z"
       id="path4385"
       inkscape:connector-curvature="0"
       sodipodi:nodetypes="cccccccccc" />
    <path
       style="color:#000000;display:inline;overflow:visible;visibility:visible;fill:#ffffff;fill-opacity:1;fill-rule:nonzero;stroke:none;stroke-width:1px;marker:none;enable-background:accumulate"
       d="m 184.63694,1291.4244 c 16.60013,-24.4048 51.51765,-44.927 97.31111,-53.2468 45.79344,-8.3199 130.51135,-6.1013 145.39429,-3.328 14.8828,2.7733 96.73862,12.757 114.48352,26.6234 17.74503,13.8664 41.78659,31.0607 46.93831,48.8096 5.1519,17.7489 0.57251,60.4574 -16.02766,69.8866 -16.60014,9.4292 -92.15932,29.9512 -136.23559,31.0606 -44.07623,1.1093 -146.53898,-7.7651 -175.73237,-13.8663 -29.19332,-6.1012 -60.10389,-13.8664 -69.26256,-33.2793 -9.15873,-19.413 -26.33127,-44.9271 -6.86905,-72.6598 z"
       id="path3533"
       inkscape:connector-curvature="0" />
    <path
       style="color:#000000;display:inline;overflow:visible;visibility:visible;fill:#ffffff;fill-opacity:1;fill-rule:nonzero;stroke:none;stroke-width:1px;marker:none;enable-background:accumulate"
       d="m 930.7164,1415.9898 c 0.98919,-33.5988 13.78488,-48.879 63.20835,-54.035 50.53245,-5.2715 242.01715,-0.8543 278.81895,13.4829 27.6583,10.7749 34.3593,29.3632 31.1862,51.2876 -2.9097,20.1057 -40.2699,42.0863 -102.4624,46.1473 -62.6412,4.0905 -172.3605,0.1265 -205.98752,-8.464 -33.62695,-8.5902 -62.73031,-21.5849 -64.76358,-48.4188 z"
       id="path3986"
       inkscape:connector-curvature="0"
       sodipodi:nodetypes="csssssc" />
    <path
       style="fill:#ffffff;fill-rule:evenodd;stroke:none;stroke-width:1px;stroke-linecap:butt;stroke-linejoin:miter;stroke-opacity:1"
       d="m 138.34095,2140.9069 c -65.917964,143.3288 417.39699,84.8962 458.13136,78.4896 33.26285,-3.9095 56.42597,-56.4084 12.91793,-95.9393 -22.95443,-23.0368 -407.05144,-58.7088 -471.04929,17.4497 z"
       id="path4430"
       inkscape:connector-curvature="0"
       sodipodi:nodetypes="cccc" />
    <path
       style="color:#000000;display:inline;overflow:visible;visibility:visible;fill:#ffffff;fill-opacity:1;fill-rule:nonzero;stroke:none;stroke-width:1px;marker:none;enable-background:accumulate"
       d="m 704.64369,2424.3616 c -23.71397,35.2799 -226.29749,76.4073 -298.29862,5.6391 -72.00112,-70.7682 -29.54832,-157.7543 11.11856,-185.8667 40.66677,-28.1127 160.81978,-60.1138 215.99667,-37.4597 55.17701,22.654 98.31458,57.1477 101.78557,129.1359 1.41663,29.3813 -6.8881,53.2712 -30.60218,88.5514 z"
       id="path4040"
       inkscape:connector-curvature="0"
       sodipodi:nodetypes="zssssz" />
    <path
       style="fill:#ffffff;stroke:none"
       d="m 850.58897,2578.1488 c -135.30528,-57.9651 -140.63961,-84.7512 -171.13373,-155.0552 -18.47641,-42.5973 -3.2283,-40.031 -3.2283,-40.031 l -49.17497,-11.0642 14.01108,45.466 c 0,0 10.64982,114.0154 209.52592,160.6844 z"
       id="path3063"
       inkscape:connector-curvature="0"
       sodipodi:nodetypes="cscccc" />
    <path
       style="color:#000000;fill:#ffffff;fill-opacity:1;fill-rule:nonzero;stroke:none;stroke-width:1px;marker:none;visibility:visible;display:inline;overflow:visible;enable-background:accumulate"
       d="m 1697.2135,3195.6421 c 26.0472,-38.9277 81.3871,-72.0081 154.2968,-85.9414 72.9096,-13.9332 208.1076,-11.8176 231.9013,-7.6707 23.7935,4.1467 154.5641,18.6083 183.1222,40.2778 28.5584,21.6694 67.2216,48.5058 75.7583,76.5324 8.5367,28.0266 1.9948,95.7459 -24.3202,110.9543 -26.315,15.2084 -146.4944,48.9597 -216.7934,51.4441 -70.2991,2.4845 -233.9259,-9.88 -280.61,-19.0616 -46.684,-9.1815 -96.1373,-20.9702 -111.0962,-51.5661 -14.9591,-30.5961 -42.8125,-70.7232 -12.2588,-114.9688 z"
       id="path3533-6"
       inkscape:connector-curvature="0" />
    <path
       style="color:#000000;display:inline;overflow:visible;visibility:visible;fill:#ffffff;fill-opacity:1;fill-rule:nonzero;stroke:none;stroke-width:1px;marker:none;enable-background:accumulate"
       d="m 1781.7091,3172.6398 c -48.5523,63.8885 -73.2055,83.2375 -139.8381,44.2545 -66.6324,-38.9831 -56.4924,-73.3908 -56.4924,-73.3908 -11.0082,12.3078 51.196,99.6662 196.3305,29.1363 z"
       id="path5002"
       inkscape:connector-curvature="0"
       sodipodi:nodetypes="cscc" />
    <path
       style="color:#000000;display:inline;overflow:visible;visibility:visible;fill:#ffffff;fill-opacity:1;fill-rule:nonzero;stroke:none;stroke-width:1px;marker:none;enable-background:accumulate"
       d="m 593.99464,1410.5953 c -6.68871,23.5614 -44.41404,25.5371 -58.30177,20.7478 27.99445,26.3577 27.01851,42.7342 -10.99009,45.2769 63.74106,47.5035 11.65273,40.3151 1.37866,52.3606 50.04853,16.3708 27.65631,36.7446 18.74592,57.0263 57.52586,0.6967 29.82507,13.6095 14.66145,41.7638 16.25533,-12.5018 59.11158,-48.5143 55.90259,9.3825 30.98644,-32.1503 66.12771,-46.7221 87.51932,4.0887 15.33097,-34.5935 31.13927,-53.7738 58.74529,-3.3944 -7.54378,-54.2338 42.81438,-38.9071 77.1518,-23.7397 -8.15363,-14.4967 5.64625,-52.1317 39.24648,-35.249 -22.82424,-23.7051 5.76044,-27.0896 28.00821,-33.643 -29.56375,-9.6978 -35.01226,-19.7009 19.881,-30.4658 -41.77054,-1.0412 -80.72188,-3.1746 -31.71592,-39.8859 -15.37453,-0.8883 -51.85221,29.7446 -34.84487,-59.9034 -26.43738,28.6995 -54.64366,44.5396 -90.01688,-15.5785 -16.74042,30.0338 -45.77627,44.8957 -58.40829,7.3811 -4.54021,15.9932 -23.36635,22.0079 -39.34833,22.7374 -6.18026,-6.3528 -12.55448,-14.9815 -19.20627,-26.2865 -10.8718,23.7374 -27.13484,39.7686 -58.4083,7.3811 z"
       id="path3549-3-7"
       inkscape:connector-curvature="0"
       sodipodi:nodetypes="cccccccccccccccccccc" />
    <path
       style="color:#000000;display:inline;overflow:visible;visibility:visible;fill:#ffffff;fill-opacity:1;fill-rule:nonzero;stroke:none;stroke-width:1px;marker:none;enable-background:accumulate"
       d="m 548.30505,1489.5343 c -32.71667,-14.168 -100.80088,-25.7605 -117.75539,-27.2872 -20.27048,14.0102 -50.61242,35.3064 -73.20544,50.1722 -5.31176,-1.4012 -91.51271,-47.8708 -99.56707,-45.7537 -8.05422,2.1172 -79.0692,29.9973 -84.37818,37.4927 18.70636,-20.5749 83.14331,-49.601 95.87634,-50.1894 8.58229,-0.7407 80.53436,35.2542 83.66571,38.0832 15.04972,-15.8838 71.20105,-48.2854 79.8175,-52.493 13.26097,0.788 64.22973,3.8642 121.88704,24.3755 57.65735,20.5113 -6.34051,25.5997 -6.34051,25.5997 z"
       id="path5901"
       inkscape:connector-curvature="0"
       sodipodi:nodetypes="ccccccccsc" />
  </g>
  <g
     inkscape:groupmode="layer"
     id="layer1"
     inkscape:label="txt">
    <text
       xml:space="preserve"
       style="font-style:normal;font-variant:normal;font-weight:normal;font-stretch:normal;line-height:0%;font-family:Lavi;-inkscape-font-specification:Lavi;text-align:center;letter-spacing:0px;word-spacing:0px;text-anchor:middle;fill:#000000;fill-opacity:1;stroke:none"
       x="530.62671"
       y="165.74541"
       id="text4246"><tspan
         sodipodi:role="line"
         style="font-style:normal;font-variant:normal;font-weight:normal;font-stretch:normal;font-size:45px;line-height:1.25;font-family:Lavi;-inkscape-font-specification:Lavi"
         x="530.62671"
         y="165.74541"
         id="tspan4144">Cayenne! Thym! Que podríeu</tspan><tspan
         sodipodi:role="line"
         style="font-style:normal;font-variant:normal;font-weight:normal;font-stretch:normal;font-size:45px;line-height:1.25;font-family:Lavi;-inkscape-font-specification:Lavi"
         x="530.62671"
         y="221.99541"
         id="tspan3030">anar a buscar-me dents de drac?</tspan></text>
    <text
       xml:space="preserve"
       style="font-style:normal;font-variant:normal;font-weight:normal;font-stretch:normal;line-height:0%;font-family:Lavi;-inkscape-font-specification:Lavi;text-align:center;letter-spacing:0px;word-spacing:0px;text-anchor:middle;fill:#000000;fill-opacity:1;stroke:none"
       x="977.2323"
       y="359.99969"
       id="text4246-7"><tspan
         sodipodi:role="line"
         style="font-size:45px;line-height:1.25"
         x="977.2323"
         y="359.99969"
         id="tspan4144-1">Amb aquest fred?!</tspan><tspan
         sodipodi:role="line"
         style="font-size:45px;line-height:1.25"
         x="977.2323"
         y="416.24969"
         id="tspan4169">No gràcies!</tspan></text>
    <text
       xml:space="preserve"
       style="font-style:normal;font-variant:normal;font-weight:normal;font-stretch:normal;line-height:0%;font-family:Lavi;-inkscape-font-specification:Lavi;text-align:center;letter-spacing:0px;word-spacing:0px;text-anchor:middle;fill:#000000;fill-opacity:1;stroke:none"
       x="1527.3799"
       y="361.57327"
       id="text4246-7-6"><tspan
         sodipodi:role="line"
         style="font-size:45px;line-height:1.25"
         x="1527.3799"
         y="361.57327"
         id="tspan4169-5">Pel que fa a mi...</tspan><tspan
         sodipodi:role="line"
         style="font-size:45px;line-height:1.25"
         x="1527.3799"
         y="417.82327"
         id="tspan4196">Dic el mateix...</tspan></text>
    <text
       xml:space="preserve"
       style="font-style:normal;font-variant:normal;font-weight:normal;font-stretch:normal;line-height:0%;font-family:Lavi;-inkscape-font-specification:Lavi;text-align:center;letter-spacing:0px;word-spacing:0px;text-anchor:middle;fill:#000000;fill-opacity:1;stroke:none"
       x="382.04089"
       y="1307.184"
       id="text4246-7-6-4"><tspan
         sodipodi:role="line"
         style="font-size:45px;line-height:1.25"
         x="382.04089"
         y="1307.184"
         id="tspan4221">Cap problema,</tspan><tspan
         sodipodi:role="line"
         style="font-size:45px;line-height:1.25"
         x="382.04089"
         y="1363.434"
         id="tspan3034">jo me n'ocupo!</tspan></text>
    <text
       xml:space="preserve"
       style="font-style:normal;font-variant:normal;font-weight:normal;font-stretch:normal;line-height:0%;font-family:Lavi;-inkscape-font-specification:Lavi;text-align:center;letter-spacing:0px;word-spacing:0px;text-anchor:middle;fill:#000000;fill-opacity:1;stroke:none"
       x="1115.5537"
       y="1427.5325"
       id="text4246-7-6-4-6"><tspan
         sodipodi:role="line"
         style="font-size:37.00366974px;line-height:1.25"
         x="1115.5537"
         y="1427.5325"
         id="tspan4221-0">Torno de seguida!</tspan></text>
    <text
       xml:space="preserve"
       style="font-style:normal;font-variant:normal;font-weight:normal;font-stretch:normal;line-height:0%;font-family:Lavi;-inkscape-font-specification:Lavi;text-align:center;letter-spacing:0px;word-spacing:0px;text-anchor:middle;fill:#000000;fill-opacity:1;stroke:none"
       x="376.62363"
       y="2182.0615"
       id="text4246-7-6-4-6-4"><tspan
         sodipodi:role="line"
         style="font-size:45px;line-height:1.25"
         x="376.62363"
         y="2182.0615"
         id="tspan4221-0-2">“El fred”, “el fred”!</tspan></text>
    <text
       xml:space="preserve"
       style="font-style:normal;font-variant:normal;font-weight:normal;font-stretch:normal;line-height:0%;font-family:Lavi;-inkscape-font-specification:Lavi;text-align:center;letter-spacing:0px;word-spacing:0px;text-anchor:middle;fill:#000000;fill-opacity:1;stroke:none"
       x="552.49438"
       y="2297.5308"
       id="text4246-7-6-4-6-4-5"><tspan
         sodipodi:role="line"
         style="font-size:45px;line-height:1.25"
         x="560.40454"
         y="2297.5308"
         id="tspan4284">Però quina </tspan><tspan
         sodipodi:role="line"
         style="font-size:45px;line-height:1.25"
         x="552.49438"
         y="2353.7808"
         id="tspan3041">colla de</tspan><tspan
         sodipodi:role="line"
         style="font-size:45px;line-height:1.25"
         x="552.49438"
         y="2410.0308"
         id="tspan3043">figa-flors!</tspan></text>
    <text
       xml:space="preserve"
       style="font-style:normal;font-variant:normal;font-weight:normal;font-stretch:normal;line-height:0%;font-family:Lavi;-inkscape-font-specification:Lavi;text-align:center;letter-spacing:0px;word-spacing:0px;text-anchor:middle;fill:#000000;fill-opacity:1;stroke:none"
       x="2024.5713"
       y="3193.8694"
       id="text4246-7-6-4-6-4-5-2"><tspan
         sodipodi:role="line"
         style="font-size:45px;line-height:1.25"
         x="2024.5713"
         y="3193.8694"
         id="tspan4315">Unes bones tenalles,</tspan><tspan
         sodipodi:role="line"
         style="font-size:45px;line-height:1.25"
         x="2024.5713"
         y="3250.1194"
         id="tspan3047">les proteccions i ja podem</tspan><tspan
         sodipodi:role="line"
         style="font-size:45px;line-height:1.25"
         x="2024.5713"
         y="3306.3694"
         id="tspan3051">anar a per les dents de drac!</tspan></text>
    <text
       xml:space="preserve"
       style="font-style:normal;font-variant:normal;font-weight:normal;font-stretch:normal;line-height:0%;font-family:Lavi;-inkscape-font-specification:Lavi;text-align:center;letter-spacing:0px;word-spacing:0px;text-anchor:middle;fill:#000000;fill-opacity:1;stroke:#000000;stroke-width:1.29999995;stroke-miterlimit:4;stroke-dasharray:none;stroke-opacity:1"
       x="708.43286"
       y="1494.5438"
       id="text4246-7-6-4-0"><tspan
         sodipodi:role="line"
         style="font-size:60.78111267px;line-height:1.25;stroke:#000000;stroke-width:1.29999995;stroke-miterlimit:4;stroke-dasharray:none;stroke-opacity:1"
         x="708.43286"
         y="1494.5438"
         id="tspan4208">Pepper</tspan><tspan
         sodipodi:role="line"
         style="font-size:60.78111267px;line-height:1.25;stroke:#000000;stroke-width:1.29999995;stroke-miterlimit:4;stroke-dasharray:none;stroke-opacity:1"
         x="708.43286"
         y="1570.5203"
         id="tspan4212">espera!</tspan></text>
  </g>
</svg>
