<?xml version="1.0" encoding="UTF-8" standalone="no"?>
<!-- Created with Inkscape (http://www.inkscape.org/) -->

<svg
   xmlns:dc="http://purl.org/dc/elements/1.1/"
   xmlns:cc="http://creativecommons.org/ns#"
   xmlns:rdf="http://www.w3.org/1999/02/22-rdf-syntax-ns#"
   xmlns:svg="http://www.w3.org/2000/svg"
   xmlns="http://www.w3.org/2000/svg"
   xmlns:xlink="http://www.w3.org/1999/xlink"
   xmlns:sodipodi="http://sodipodi.sourceforge.net/DTD/sodipodi-0.dtd"
   xmlns:inkscape="http://www.inkscape.org/namespaces/inkscape"
   id="svg2"
   version="1.1"
   inkscape:version="0.92.3 (2405546, 2018-03-11)"
   width="2481"
   height="663"
   sodipodi:docname="E10P00_092.svg">
  <sodipodi:namedview pagecolor="#ffffff" bordercolor="#666666" inkscape:pageopacity="0" inkscape:pageshadow="2" inkscape:window-width="1813" inkscape:window-height="955" id="namedview70" showgrid="false" inkscape:zoom="0.4" inkscape:cx="1284.4231" inkscape:cy="2618.6204" inkscape:current-layer="layer1" /><metadata
     id="metadata8">
    <rdf:RDF>
      <cc:Work
         rdf:about="">
        <dc:format>image/svg+xml</dc:format>
        <dc:type
           rdf:resource="http://purl.org/dc/dcmitype/StillImage" />
        <dc:title />
      </cc:Work>
    </rdf:RDF>
  </metadata>
  <defs
     id="defs6">
    <filter
       y="-0.25"
       height="1.5"
       inkscape:menu-tooltip="Darkens the edge with an inner blur and adds a flexible glow"
       inkscape:menu="Shadows and Glows"
       inkscape:label="Dark And Glow"
       style="color-interpolation-filters:sRGB;"
       id="filter4140">
      <feGaussianBlur
         stdDeviation="4.6710210876803542"
         result="result6"
         id="feGaussianBlur4142" />
      <feComposite
         result="result8"
         in="SourceGraphic"
         operator="atop"
         in2="result6"
         id="feComposite4144"
         stdDeviation="4.7000000000000002" />
      <feComposite
         result="result9"
         operator="over"
         in2="SourceAlpha"
         in="result8"
         id="feComposite4146" />
      <feColorMatrix
         values="1 0 0 0 0 0 1 0 0 0 0 0 1 0 0 0 0 0 1 0 "
         result="result10"
         id="feColorMatrix4148" />
      <feBlend
         in="result10"
         mode="normal"
         in2="result6"
         id="feBlend4150" />
    </filter>
  </defs>
  <sodipodi:namedview
     pagecolor="#ffffff"
     bordercolor="#666666"
     borderopacity="1"
     objecttolerance="10"
     gridtolerance="10"
     guidetolerance="10"
     inkscape:pageopacity="0"
     inkscape:pageshadow="2"
     inkscape:window-width="1920"
     inkscape:window-height="1025"
     id="namedview4"
     showgrid="false"
     inkscape:zoom="0.46082619"
     inkscape:cx="1418.5251"
     inkscape:cy="347.56343"
     inkscape:window-x="0"
     inkscape:window-y="26"
     inkscape:window-maximized="1"
     inkscape:current-layer="layer1" />
  <g
     inkscape:groupmode="layer"
     id="layer2"
     inkscape:label="artwork"
     sodipodi:insensitive="true">
    <image
       sodipodi:absref="/home/deevad/peppercarrot/webcomics/ep10_Summer-Special/lang/vi/../gfx_Pepper-and-Carrot_by-David-Revoy_E10P00.png"
       xlink:href="../gfx_Pepper-and-Carrot_by-David-Revoy_E10P00.png"
       width="2481"
       height="663"
       id="image10"
       x="0"
       y="0" />
  </g>
  <g
     inkscape:groupmode="layer"
     id="layer1"
     inkscape:label="txt"
     style="display:inline">
    <flowRoot
       xml:space="preserve"
       id="episode-title"
       style="font-style:normal;font-variant:normal;font-weight:normal;font-stretch:normal;line-height:0.01%;font-family:Arial;-inkscape-font-specification:Arial;letter-spacing:0px;word-spacing:0px;display:inline;fill:#241c1c;fill-opacity:1;stroke:none"
       transform="translate(-701.23633,-120.8471)"><flowRegion
         id="flowRegion2989"><rect
           id="rect2991"
           width="2405.8"
           height="107.55731"
           x="739.22333"
           y="644.36664"
           style="fill:#241c1c;fill-opacity:1" /></flowRegion><flowPara
         id="flowPara2993"
         style="font-style:normal;font-variant:normal;font-weight:500;font-stretch:normal;font-size:72px;line-height:1.25;font-family:ComicSpice;-inkscape-font-specification:'ComicSpice Medium';text-align:center;text-anchor:middle;fill:#241c1c;fill-opacity:1">Tập 10: Mùa Hè Đặc Biệt</flowPara></flowRoot>    <image
       y="139.36783"
       x="419.75894"
       id="image4165"
       xlink:href="data:image/png;base64,iVBORw0KGgoAAAANSUhEUgAABngAAAGwCAYAAACKHWv8AAAAGXRFWHRTb2Z0d2FyZQBBZG9iZSBJ bWFnZVJlYWR5ccllPAAAA2ZpVFh0WE1MOmNvbS5hZG9iZS54bXAAAAAAADw/eHBhY2tldCBiZWdp bj0i77u/IiBpZD0iVzVNME1wQ2VoaUh6cmVTek5UY3prYzlkIj8+IDx4OnhtcG1ldGEgeG1sbnM6 eD0iYWRvYmU6bnM6bWV0YS8iIHg6eG1wdGs9IkFkb2JlIFhNUCBDb3JlIDUuMy1jMDExIDY2LjE0 NTY2MSwgMjAxMi8wMi8wNi0xNDo1NjoyNyAgICAgICAgIj4gPHJkZjpSREYgeG1sbnM6cmRmPSJo dHRwOi8vd3d3LnczLm9yZy8xOTk5LzAyLzIyLXJkZi1zeW50YXgtbnMjIj4gPHJkZjpEZXNjcmlw dGlvbiByZGY6YWJvdXQ9IiIgeG1sbnM6eG1wTU09Imh0dHA6Ly9ucy5hZG9iZS5jb20veGFwLzEu MC9tbS8iIHhtbG5zOnN0UmVmPSJodHRwOi8vbnMuYWRvYmUuY29tL3hhcC8xLjAvc1R5cGUvUmVz b3VyY2VSZWYjIiB4bWxuczp4bXA9Imh0dHA6Ly9ucy5hZG9iZS5jb20veGFwLzEuMC8iIHhtcE1N Ok9yaWdpbmFsRG9jdW1lbnRJRD0ieG1wLmRpZDpCQjYwQzBBOTVGMTVFNTExQkJFQTkwQTBCRTA0 NzBBNyIgeG1wTU06RG9jdW1lbnRJRD0ieG1wLmRpZDo1QzNDM0JGNzRFQjIxMUU1QjU1OEM2Njg1 MDZCREMwOSIgeG1wTU06SW5zdGFuY2VJRD0ieG1wLmlpZDo1QzNDM0JGNjRFQjIxMUU1QjU1OEM2 Njg1MDZCREMwOSIgeG1wOkNyZWF0b3JUb29sPSJBZG9iZSBQaG90b3Nob3AgQ1M2IChXaW5kb3dz KSI+IDx4bXBNTTpEZXJpdmVkRnJvbSBzdFJlZjppbnN0YW5jZUlEPSJ4bXAuaWlkOjc5NEU2QTA4 QjI0RUU1MTE5Nzc1RjIwQzFDQTk2RjgwIiBzdFJlZjpkb2N1bWVudElEPSJ4bXAuZGlkOkJCNjBD MEE5NUYxNUU1MTFCQkVBOTBBMEJFMDQ3MEE3Ii8+IDwvcmRmOkRlc2NyaXB0aW9uPiA8L3JkZjpS REY+IDwveDp4bXBtZXRhPiA8P3hwYWNrZXQgZW5kPSJyIj8+C3doywAAjClJREFUeNrs3Qu4XkV9 9/1/OIWEQ0BAOSQckwIqFBArBlp2KOIBfSUpgaothwas+GqwD/gW8Hr0kUcDz6u2EL1qNVgOrSCG N4laWlQkG0UQRUCoSkw4R4KCJRxMOCTZ7/yYWWZnsw/3YWbda9b6fq5rLkiy97rvNfe615qZ/8x/ xg0MDBgAAAAAAAAAAADysRlVAAAAAAAAAAAAkBcCPAAAAAAAAAAAAJkhwAMAAAAAAAAAAJAZAjwA AAAAAAAAAACZIcADAAAAAAAAAACQGQI8AAAAAAAAAAAAmSHAAwAAAAAAAAAAkBkCPAAAAAAAAAAA AJkhwAMAAAAAAAAAAJAZAjwAAAAAAAAAAACZIcADAAAAAAAAAACQGQI8AAAAAAAAAAAAmSHAAwAA AAAAAAAAkBkCPAAAAAAAAAAAAJkhwAMAAAAAAAAAAJAZAjwAAAAAAAAAAACZIcADAAAAAAAAAACQ GQI8AAAAAAAAAAAAmSHAAwAAAAAAAAAAkBkCPAAAAAAAAAAAAJkhwAMAAAAAAAAAAJAZAjwAAAAA AAAAAACZIcADAAAAAAAAAACQGQI8AAAAAAAAAAAAmSHAAwAAAAAAAAAAkBkCPAAAAAAAAAAAAJkh wAMAAAAAAAAAAJAZAjwAAAAAAAAAAACZIcADAAAAAAAAAACQGQI8AAAAAAAAAAAAmSHAAwAAAAAA AAAAkBkCPAAAAAAAAAAAAJkhwAMAAAAAAAAAAJAZAjwAAAAAAAAAAACZIcADAAAAAAAAAACQGQI8 AAAAAAAAAAAAmSHAAwAAAAAAAAAAkBkCPAAAAAAAAAAAAJkhwAMAAAAAAAAAAJAZAjwAAAAAAAAA AACZIcADAAAAAAAAAACQGQI8AAAAAAAAAAAAmSHAAwAAAAAAAAAAkBkCPAAAAAAAAAAAAJkhwAMA AAAAAAAAAJAZAjwAAAAAAAAAAACZIcADAAAAAAAAAACQGQI8AAAAAAAAAAAAmSHAAwAAAAAAAAAA kBkCPAAAAAAAAAAAAJkhwAMAAAAAAAAAAJAZAjwAAAAAAAAAAACZIcADAAAAAAAAAACQGQI8AAAA AAAAAAAAmSHAAwAAAAAAAAAAkBkCPAAAAAAAAAAAAJkhwAMAAAAAAAAAAJAZAjwAAAAAAAAAAACZ IcADAAAAAAAAAACQGQI8AAAAAAAAAAAAmSHAAwAAAAAAAAAAkBkCPAAAAAAAAAAAAJkhwAMAAAAA AAAAAJAZAjwAAAAAAAAAAACZIcADAAAAAAAAAACQGQI8AAAAAAAAAAAAmSHAAwAAAAAAAAAAkBkC PAAAAAAAAAAAAJkhwAMAAAAAAAAAAJAZAjwAAAAAAAAAAACZIcADAAAAAAAAAACQGQI8AAAAAAAA AAAAmSHAAwAAAAAAAAAAkBkCPAAAAAAAAAAAAJkhwAMAAAAAAAAAAJAZAjwAAAAAAAAAAACZIcAD AAAAAAAAAACQGQI8AAAAAAAAAAAAmSHAAwAAAAAAAAAAkBkCPAAAAAAAAAAAAJkhwAMAAAAAAAAA AJAZAjwAAAAAAAAAAACZIcADAAAAAAAAAACQGQI8AAAAAAAAAAAAmSHAAwAAAAAAAAAAkBkCPAAA AAAAAAAAAJkhwAMAAAAAAAAAAJAZAjwAAAAAAAAAAACZIcADAAAAAAAAAACQGQI8AAAAAAAAAAAA mSHAAwAAAAAAAAAAkBkCPAAAAAAAAAAAAJkhwAMAAAAAAAAAAJAZAjwAAAAAAAAAAACZIcADAAAA AAAAAACQGQI8AAAAAAAAAAAAmSHAAwAAAAAAAAAAkBkCPAAAAAAAAAAAAJkhwAMAAAAAAAAAAJAZ AjwAAAAAAAAAAACZIcADAAAAAAAAAACQGQI8AAAAAAAAAAAAmSHAAwAAAAAAAAAAkBkCPAAAAAAA AAAAAJkhwAMAAAAAAAAAAJAZAjwAAAAAAAAAAACZIcADAAAAAAAAAACQmS2oAgAAAKA80yZPphIA IL4dwn8PCf99syu7hv/fzZXZbR7vUVcWD/pzvytPufK0Kw+68oIra6l2oJb3kbHw/c/M8pUrqQTU 1riBgQFqAQAAACgJAR4A6IoGYPdxZW9X+lyZ6cqUHr6fW125w3wwSCOIvzYGfoEq3jdkaAC4k+Dv UEUw+HFXbgv3gSddWU21VwcBHtQZAR4AAACgRAR4AKBl48wPwh7hynus+4HYMs03v+rnR+YHfhl8 QV0peKLAyVRXDhrl5+51ZUX4/2XmA6FPR/puDA3gzAz/ndvjulnoynfCveAhV9ZxufQGAR7UurFE gGfEjrcakvu5MlwPvIjGSy8i8npvk0b4t+dq9sDYYdADeqi7e3zOIy3dZakuaKAAAEZrZ1IJADCy Ca68yZUPWl4BnbFooPcaV5YaM/tRD32uXGVxVtDND//tN58KUQaPvUkxNrRjeG2Zm1mdacXf5a5c 78oqLqHyMH6COiPA88oOt4InJ7iyqIOH0dDlmJ3ORNDeSNuaX3auQE67Mw/0wDjVNs6MyNEO4YE3 vc0H5R2hQaCcyL9yZU2n341Q9zubD/IVy3dbXf6vJbqnuHKzMVMLGO77pcb5aVRFaRZzPwIAABXv /53oyult9gFzpf7ihcYgL/Ltz11r9QrA9vI+cJ0R9E2OAA9qfVMmwLNRCO6keEgtHNRo67eNsxFk 8BLWwyM3ZmfZpptC5kJ1srzLY2xw5XuunGw+0LZhhJ/bzJU3hp/b3OLkXx1Mgb+z+XYBf6AZmTc2 pONeNT905S3GCkMAAFANmtj4LlfObXjbkGAPctNnfiUa4tGE5Q+Zz1TDQG0CBHhQZwR4Bpk2efIZ 7j8LanZaW1peKdvUyH8p0rG0iudMV74f6mDoxa7gjpb+X+bKgeZnoSS5tCzv1VRAtGeOKw9bbzfB bSoFubWy9AuufIpOAwAA6CFN6Puw5ZdaqQwK9miC4LeMvTpQXY/Qp0t6DyAbTAIEeFBnm1EFm1hQ w3M6KLP3e1TEY+3uylmu7Gk+0DVuUNGftVpHeZ33tnTBHWHZMuCdR0egJ9Qx+I0rS1z5gflAOgAA QJnU3zrU/IpiZWsguDM8tZWVLl6THi81HwwDqnidIl3danWUJkb2WdqxKgA1QYCn/iY1+NzHu3Kc K/9veDC+OtTHTuZTAPwfV97hysTE72NXLkPg5bzq86iGntBeZJoBpkkMt1i8VZIAAABjGRf6Yhqs vNNI09sOBcEUDFNQbKox0As0yeBAD4FeAKNiFu+mHjVmItTNdq4c78ph5tOkaf8jBXn2M7/CZwJV BJTiRKqgJ7R65wlXvu3Kr4xUHwAAoBwKRhztylX0sbumoJgCPaRuQlVon2kylZRjSvj+a3/nc+jP ARgOK3g29cUantPTmb3f2xMcUyt59nblz12Z5cqx5gM8BHeA8jr4C6iGnvmt+T3JnqMqAABACTTb XLPONfuc4E48xYz+W4wZ/eits6mC0mlF3wPmU10CwCZYwbMpBXjqlkLovsze71pLNxtEg8yb9+Cc ruCrhYbbjyroGc3uVEq2dcZMTwAAkJZS8n7Zqjuzf/6g/7/XfIaH4cwc8ueq7RdUrOhRv/n9rqzm 0kPJVrkyLVyHKI+CvEp1eYErF9O/A1AYNzDA/WCwaZMnT63RQ+pMVy7L8H1rZc0yq8dsLy2j34sH LxrufGP/nV7RvecX4TP4jisvUCUAACAyTaQ7wZVFFXgvCnrc5cptrtwd2j5rI/ZTlR3iEPMraLTf axWCWcpSsYQ+J3pAk8ZPc+Xjlsf4za2uXO7KT81nOJCnh/nu6Ly2Df+/syuTXXmzK++06uwjpnM5 NuL9rfaWr1xJJaC+DTECPK80bfJkzTz6pFVvpk6rity8/Zk3FD6X8WcgmlXxGSNHKvCIkZ6jl37n ypfMB/yVLmUDVQIAACLZzXya7V619RTQucaVH7nyuPUmyKHxAwV9Pmi9C/h8K7w2k3nQKwqA7mE+ GCIKgh7kyuHW+6CIxmYusTjBEAW0d3XlCFfO7fG5aezvGBt5NSIGIcCDOiPAM4ppkycryHBUjxtq 7dzYLzQf1Lnf6jN7R42E91keM0KK2SD6DB4yAjtA8R1eQzX01HrzaUj+2ZUbzKdUeCn8G40AAADQ 0ViCK3OsN/ssKqhzUWjfrKtgvewXxg/KWsGudt23XTnP/Mpt2ncwvhcv0zjZm0L/J2V/t9djVkqX R5BnDAR4UOubLAGeFu+WPtizdw8eSKO5IDRuH7JmBBM0O6wKsyQGNxYUVLs+cYMByNk+rvzK0u75 pu/i4iF/N5eq34Rmc/7S/OzOH7rypCubmU9JSt52AADQDg1o3lhyn0ztvbNDWyaXvq/av1rB8IXE daXV2v/b/GTDZ7g8kcH34qNWzrjaRCsvhZmCWIeU8H0fCUGeMRDgQZ0R4OnkrrlxZc9V1psIPam/ fLBHM5R6NYhLnmOgNfuE78r+5nOWx7j/aRWKciY/3cJ3UAMQSptRpeDwUArUK0g8dLNf5XnW8v+Z kZ4160KdPebKf7uypSv/an5lDwAAQCsONb/Jd1mUJeFUy3/gUumqrkzUFr3P/Gqqn9jGVdpADt+J lPtf92pPagV6jrbejBcS5BkFAR7UGQGebu6cPtBT5j4x5Nd8JQ3cftnKS6Gnz+BgY8Y70KpXuXKS K6eH787WXXTsY6SfrMIea52s/itWkfZZ98v/BwbV469d2ZPLFAAAjDV2YOWmZKtLYGeo2IEetem+ H9raDxkTEJEX9W2WJjr27tbbTCtlrlQajCDPCAjwoNaNNAI8Xd45J7+8f9wZJTR0NSCoGfBrqfWe djYm8hkAbX8/X2N+1dvfuvJaay9d2wzz+1ql6FzfZOXPqtL53Nxl57vIYR1rcEAredgzDAAAjNb2 uNbKmVSnfu+7Xbmr5nXaZ3EGtrXX4n+48gHzq7SB3PzQ0qxs28yqEfAse9Wj7GhMSn4FAjyos82o gii07PPWxK+hRi6BheENhM/ggsSvM4PPAOjo+/lb82nV/tN8arBWO/dqmPYnel+a1bR/eJ0yDD6f gQh1qvd/ZLgvdWtbLlMAADACpbt92MoJ7qg/t5fVP7hjoU2oyYMLIxxr3KAC5OazCfuhVXBX+K4/ WuJr3mNp98AFUDEEeOI5NeGxH21II7dbFyd+aN5CFQMd2eDKytCRVY7wVlaLlJEKUQHbd5dUB/sn Op/+CB2GQ7hEAQDAMBTcWWbpVzyrHaN0ShdZs1KMqS2qVMazujiGxnQmmd/rkgAPcpQiRdvCCn7X 9y3xfemefTWXFtAcRHTj0WxqreJJsbT0Qqq3JQOhrlKkatODmBRGQOdeDAMEd7jyx6EjOhKtSilr SfldCe/dg88n5eo/HXt/63wARunq+rlEAQDAkPbB8hJeR6t2LrZm7x2z2Py+GZ2kDy7SIStAtjK0 uYGcPJ3gmKsqeJ4aTzo5/H8ZKyL1Gn308zYKW2zkSPsIn+jKQbbpXsLzw3/1Gd9rfh+22o5bkmJv dKzgievyRMe9nqptWarN5K6haoGuKVXbL8doxN/ag0ZoyhWYZZ1PN6uRDuLSBAAAg8QI7ihgo/1h NozyM5oE07RVO6P1YztNH7yzK28yv+IKyM1Aw871vVZOuraXXLnKla24xLK1m/k9qp4yP5F97pB/ nxvKovDM1md+qfmAEBqGAE9c/YmO+wRV27K7Ex33XqoW6Nrz5oM8q0dpyH+oB+/roYTH/liJ56HV SPM7bDgCAABIt8EdDTD92pXbzO/BeLMr97uyZlD7r0jJ1k91b6JYld3u4O92rhzryp5GlhbkSfec 31szgj3rLP1esLqX/NiVT9nomTNQTVqZeb4rj1n7mUYU8Hkq/D5pOxuEh39cTyZ8AKCeny3QJJrB +XwoAyM0OO7uwftKeY8te++uc+yVM3vGMptLEwAAmJ/00U1wR0EcrV7+N/NpeZ8zP+agwcy/dOU4 V15w5QBLm742Z52k3t3SlUNdeZcrvwl91w1UJTIyN/RJ3m4+5eBmDfiea9XdY4mOrT6oJv4pwP57 Lq+saCXmjdZ9Cvl54bmgtICskm0AVvDEtZoqAIBRjRvl2XNBDxsf8xMcUwMcZQfo9XpncpkBAIA2 aVDp9i5+/6XQ9tGM8SXm0/I+4soD5veW+d+uXGk+eEFwZ3Sqn4Pb/B2ladMAuYI8OxhjPchLv/l0 jdqP6ncNOWftEzQjQV9QEyb/2ZWl5oPsBHvzeg4ruB9rf2A9E06gWpuBh371zacKKoHgHdC9zc2n kNjWhl+9c0PNzveOHr3udVxqAACgDcWg0pQujqE0vNrvQSljnzE/qDgQilZvK9Bzfvh/tNb/PKzN drZWRmmij2Zs1y1dm67RvnANfX3QtTW4aO+JQ41MNTnSfeFB86v/FBx+sSHn3W9xx/x0H1aQTPu2 DE6LiWY8h4dzKVXbDAR4UMeGMIBq2t6VvczPKhwuwHNfzc53cQ/vg7dyuQEAgBaoTaZ0MN0MKimY 85D5PR9G2kdjvTGTvF0Kll3Qxs9v7cohrnzQ/L6W73BlX1cmWp5jP7o2+2zjYLVWJCjt0EjphZXm 605XHja/xxPyonvEz8wHeNY06Lw/YnH249EqyrvD9+UJI7iTk1TBHQvHnEAV1x8zGwAAZdnDlT+2 4Td6VKOWdB3xfCh0cNFs2ihbgyC7uvK4KwtdWUG1AAAGuda6TwejgUSlVSIdUHwXu/LONj6j8a4c GJ79R7hyj/l9lbQvj/Y/+nom593NPhRKfbWN+VVN67mEsrI2XKsvNeicdf88xrrb/0yedeUn5ldC cR/Oh8blUwV3Bj8XGGtpwIWEuLS0dGuqAQA2obRsh4Uyfph//2INz3lZD1/7bi65RtMm2UrVN3RQ RLNetbrrRPODHwCAZptpI6+GaFcxoI64NPh7vCtPtfE7+hy0J49WzWsvH6XM0+CvBs1zCPB0M5td 9aU0VU8bg9w50rU7sYH3Ek3AUqq2uV0c46nwvflvLqNsaJXi1ZY2uCPPUdX1R4q2+O7gywMAm9Bk goPMzz7ca4RnT53231HHUhtcrunxezizxZ8lnVu9OgnKTf+YjTzjdXr49/Nt+FSJAIBm0GSARZGO pcFY7fkyzZWtqNrolH53VodtcO1/qVX0+7vy+kzOt5uUgRtCG7zYAwp50X1kP2tmSqlPdNn3U1BT wZ0XuYyyMcfiTbIYiTKlrKOq648AT3yKuv/UmpUzFABG61iqM/nXrhxpfnbncO6tyfmqQa1Zgz+r QEPqihZ/7nIu01pQR1hpdua1+PP6uWuMgTgAaGr77PbIx9SeJ+81HzhiJU98S6y7STma1HFbBuep 66fblIFbhfNlIktetHJHgUxNDBzfwPNXIHd+F7+vFIxapUdgMw9Kpb2ghNe5kKpuTsMOcX3T/ACm NhPXoOaWVAmAhlKn6k9deY8rb3Xl1SN0tLR5bO6zSopZU1oW329+E9he57lVnZ7ZQsPxOi7V7CkF i3Lstzvb9STzgSGl6CGNCQA0R4qUMBqcfbv5lOWXWPf7SeCVbU2lWH2si2PckcF57t/l72sS8y7h ehxnDHbnYl9X/sJ8kHh3a+5kdK3imdvh/UFjj1tw3WdB/a+bSngdrd65gupuBlbwxKeouVINfc98 DkxurPk3pJ+nGoCOvz8KePxf5lNDbD5Co+MzNThPbQb6HVc+bX4z3G9bNQbMv2Kjz/bULLHVXKpZ mxraG50M1KkD+Meu/LkxyxUAmqLP0qSE0XPkNeZXbD9CNSexyrqb4d8Eug53De0jJjTnQ9f1B105 0Jq5eqegftnCDq97TTKfxHWfhSst/b47Gmc5xkjP1hgEeNJ43JXvu3K/K+upjmxpcFaDZj+hKoCO aZbh5DCQcOuQBodWl+xbg0aHch1/15VLzQf4qxQwUfDp6BEGA7Ry6iNcolnT4EW3M6R3Mh/gmUR1 AkDtadbw0sTjC6ebn/SINM6hCsa0c2jbbE1VZEOfl/bfGU9V2EUd/I4CPK8KfesdqMJK67P2JlkM DCqtUt9fqyFXUN3NQWQ3He0n8Uvzadq2ozqyo+DOb0MH6GqqA+iKAjiLQ6kbpWH7sSv/Yj4Y/FJF 6//sMCCwbfi754zZPLmLEdwRDfa9xZVvmN9DkI1ZAaC+rkx8fA0q3UU1J2/XtZKCN1fLIrVt3hra NndWtH2OTRGM26jTvWnVzzvclRtdeYJqrKRWJ1msD32y34fxBt3DNgu/PzF8XzSe//lBv6OxlpWu PEQ/v5kI8KSzKnyx9IUkwJMXRcZ/Z35G/j8bK3gAjHyv+LUr/25+YLzqnUc19EjHVg+xgjui1Il/ 5MrfmE+po/YL+/EAQP30WZrUbAWtzmZ1STmusM4CPDlMtno8XEvdpC8q2jZzwrEep22DjKjPtrCD +7VWP73BlTeazyZEv696xppkofvUs6487MqvXHnA/MRzbRuh8Xut0tL48r+Zn0zBliD4AwI86Sja qvRea8KXjtz2+VCEXBtQXmXVnZEPoPeUfuRn5lfw0IBGWWIGdwrbuPLO0G75R1d+YwyEAEDd+v1X JX6NU4xZw2XpdBXPm13pr/i5DYRrqdtUgoPbNv9gfkUDbRvk4hprP8CjMcfdXZllPjjwA2Msq0oO HeMz1Wf1aPjcbjI/JqnJd2vCvUufr1bxsA0IRmzoIZ2XaET0hFIDzO3wd/V5ac+Q/wg3VB6IAEai 2TWaOfMwVYGSaFn+8gTHVYfh1a68z3x6Bw0YKT0EA3UAUA+nWdoNnbXPYj/VXKorrP0Az6GZnNvN 1tkKhqFtm9cMadv8nP49MtFpmjat4vkTVz5gfjLij7nmK0Fj798Y5d/1GSk9pQJ7/5/5FVhD+2EK flcxuKP+6ZsG/flpV+4zP3EeJV9kSEMNiiIvIqt38vFieJgyIx/AaAZC4+Uh7hUosV2xLOHxNSNs V1dOduV1rnzblSWu/IKqB4CsacPt1Pu1HE81l66TVTyzQ3ui6ml9BkJ7RIOdi7ps2+zmyl+a3xv5 Ble+Z37wUftRFpNxNW7zgpHuCNXxZBe/u70rx5ofeNc+sUvpr/bcR23kSRa6DykV2+Wu/Kv57SJy WSgwWmYJTbw/zwj0lIYATzpqJOxsfmkw8qGG3j2uPEhVoCaYUZGOVvA8Y8yKQjkusbSzr0UDITu6 coQr+7vyF67MMz+TDACQp08mPr4GcRg87I0rrP3gnSZzrMrg3BRs0Z5BW7pylCszrbMsHUPbNiea T3v0eOgPbeXKLq78yHyaWqAKnuvidxXEVWB/hit7m18Rp+DmneZTFdJ3LdduoT81EqWRVCD7assr uKN4wmiZJXS/PtyVI7kEyvtAkMaeruzrykSqIhvFjPyH6aSgJphRkfZ+sT6UHGZCIm991nnq0U46 hRrsUMo2TVTRTLIV5vebAgDkZYcSnh/nUc0908kqHq22uiyzc+wP5exBf6+xrL1d+XAL1/jQts2B 4bjFvhYKIs0Mr3EXlxUqct13257fJlzrmiB2nPn9XbQdwbPh38915fdUdXLXjfJvGku4N/zMk5bX Fh/vauFnppsfk1rBZZDeZlRBEpubz297gPmVPMiHHnDMyEcdtDKj4kaqqatG8/hwjycNJ1LS4NzS Hl3jas9oFeDd4b8AgLxcn/j4Ci4wWai3rmvz50+vyXlrAFyDhgr6aIXOwjbbNtu5Msl8Oiv9WUGe bxiToFEvm4frfD/zK+G0Ov+vQ+FaT6/PfJBjJFqp9V3zKdrWZXhuMX8OXSLAE58aDXubXw65T7ih Ig+agb/BNs7kAXLWzowKdHavV2NZswDHUx1IRB2ve7r4/QtcOcz8wMdh4c+dupFnIwBkZaqNPrAU wxVUc88p88T8Nn5+eg2f56qDk8yPwXRDKx0+xyWFGtLYr1axKZi5rfnVPbTr048XXDXGzyhl3q2u rMnw/FpdHXwcl0J5X3LEpZm2J7hytPnBP+R1Ay5m5PPdQO76Iv8cXkn3+D8yn+4BSPFMUi7mTvbd 0YxqzUS9yHyqkdXhvxeF51snAyAaELqEjwUAsjEv8fEVVFhHNVfCJzpow9ZRvyu7m09F1SkNWjIB Dr3G6pr8HT1GP04TzLUX2CM1f5bO5lIoB4PY8b3Xlb8yv4qH+s2LBtO0RFuDtaSiQe6YUZGe9lh7 g/l0nDTCEducDhrEmgGm1TqXjdJRUGei33wAaGGbx9d9ZSYfDQBU3g6WflDlE1RzZbS7iqfOVrmy v3UX5LnJWN2A3tqWKshaK6t3BsK9W2lON1Bl6BYBiPjOMr+R2VZURZYU4NGM/F2pCjQEMyo6pwHy 17ryZ67sQUcQEWkfvwVt/o6CNUeFjkIrFABSOpMz23ydRcbMVgCouk8mPv7CNp43KMd5VMEfaMC0 myCPZt2fQDUC6NBYq3ek2CLCGEdADAR44tNMbvZjyJdW7mhg7XVGkA7A2F7lyjtcOdb8ygkaZ+jW bq7c2ebvKEhzUugotEurfQ5r83eWGytdAaDK/Zm5iV/jAqq5chTUmNXiz77QkProJsiziLYOemgf qiBrn27hZzRuoJVaW3XYhwM2QYAnvs2pgqwpzZJW8PS5shffEQAt3DMU2P8bV95lPsUj6drQKQ0k 3N7m7yi4c1mXr6v9eaa1+TvLuNYBoJLel/j4GjC/n2qupCU2dvpVpXJb25D66DbIczGXFHqkjH2y nqOak1CK1Okt/JzGGl/jyu+pMsTA4DUw/A1Z+5K83fxgLd8TAKPZ2vwKCM2WPd2V15tfzQO0Q7O4 brSxl/MPFiO4U1hh7QV59D6vNlatAUDVniUfT/waFxqzjatKn8vJNvJ+PPr7jzSsTroJ8swNYwNA 2crY83Id1ZzEjDZ+VkHkJ6kyxMDANfBKWoW1nyt/bX6Z+2SqBMAYFOQ52JWzzS/JnmOsbkB7rrXW ZnsVYgZ3Cu0GebSHFzn/AaA61IeZkvg1vko1V9pAaI9qstGMQWVi+PsmBue6CfJczyWFHkgd4LmV Kk6mr42+3L9RXYiFAA8wPO2jdJArH7D2N6AG0EwK6OzqyltcOT90pIFWnGE+WNKqFMGdQrtBnnnh /QMAem9e4uNrUHAt1ZyF1a70DypN/9w6DfJo8s1ULieU3KdMHai/g2pOppU98GYk7MuVdY2iYgjw ACNTkOe1rvwtVQGgDVu68iqesV1RPuIDrRlpMQ51ZUEbP58yuFNoN8ij98/gBwD0lvZxm534NT5L NSNjCvIc3MHvXUnVoUR7l/Aai6nmZOaP8e/qY/Vnfo7b8jFXD4NPwOiUrm0XqgGZYUYFcqYAmdJj KiXGU648Yn6FSB2v691cubONny8juFNoN8iz3MhTDwC99LYSXuMGqhmZW91m+0am08ZBiWaX8Bp3 U83JfH6Ev19oPsPHCqoIKRDgQR3NpQrQcMyoQM62d2X3QdexUhRohchL5vNRj6vJeSpgdXsbP69O wVdKfo/qgLSTpvQeI8AMAL1ybuLjk54NddHuJBY5i2pDCdTPmVfC66ymqpPfXy4wnxJyfvjzSTxD kRIBHtTxgQgAyNc+rhxgwwcqF7lyrdUjiHC1tZ5fW8Gdk603GyNrxVCrQZ4p4bwAAOVSerbpiV+D 9Gyok072HGSsAakdUsJrXEA1l3J/uciVPV0521i1gxIQ4EHd7EcVAEC2FNR5g/n9z8aP8DNKW/CA +cGsXM201tMv9DK4U2gnyDM7nB8AoDxlpGf7EdWMmmk3yMNYA1L7QgmvsZBqBuqHAA/qRIN9N1EN AJAlrcr5Y1eONb8SZLQ2iv5dG97mOJNSOdwXtdEB63Vwp6AgT6sz/hYZueoBoEznlvAaj1PNqKF2 gjx9VBcSmmrpV2I+aqwmQfd2pgqqhzzp9fxMm7T/hm4sk83PFmbvHQDI99n1OvO5iY9o8TmmlSJ3 mV/+npPr2+iAnWrVCO4ULnblUGtt9ZHO80gubQAo5RmaelBwfsWeR0BMRZBn+Rg/dxBVhYSuLOE1 TqGaEcFkqqCajUHkTTNkT3TlOGs93QuAemNGBXKiYM7B5leqvNOVXa31lTnKh/5Fy2ej0FZn5lVp 5c5gej8Kwp3hyoIxfnZ6OF9mCQJAWmUMOi+mmlFzaq/s7srt1voeiUAsfVbO6p2bqWqgnkjRli8N fl3qylPmB1kI7gAoMKMCVbK9+ckImw/6O00w2cmVw1x5j/nNJ2eZ34iy3cknn8yoLlp5Vlc1uDNY q3vy0DYBgPTeWsJrLKOa0QCrXNnfRt6j5F6qKJnnXVlnzVwpqK0GlpbwOqcYKzERx45UQfWwgidf lxgpyQAA1Xd26LCp07wm/J1W7SgQ+VrzM481U3Ib62ziiZ6F54TXqLpdx/h37XFzcSadLwV5VozR Id2Vyx8Aknu7+cHRrRO+BvvvoCnWml+trFXISpk1fVAb7StUTzLXh77BHuYngel+Nq4B5z3OyknN dquxeicW3Rtmh36Ono0LrXkZC/q4DKqHAE+eNBOa4A6AkTCjAlVqZ/y9K8+G8nz4+4mubBfKeOt+ RbGCRHdlUB/9Izy/lTLh3Zmcw9Dz2TF0yodLK8FMVwBIS4ODGnRe78rh4bkamwYGmfWNptGALXsJ luevXdnblT9z5W2uvNGVV7uyZc3Pe46Vs+L9eO7jXdvNleuG6fPMC89JbZ2ximpCr5CiLU+HUAUA RtFHFaAitFJHK3M0w0mznV4fyn6h0zYhUlvkbZnUxxLbNLXZo+HP+1p+wZ2C9j86ypUZoXNT0Hkx 0xUA0tKA3ddc+YwrP3TluQSv8e9UM4DEtHLql658yfzq/38ynxry+Rqfcyt7WsYwy/LZr7SKNJHi fFces5H3SZoe/v18a8bKs5lcFtXDCh4AAFBW4ziVXFKBaSDuslDqROfVb8x0BYBeeNGV75mfNKF9 77SSZ6uIx7+NKgZQokdc+UfzQYm/deWAyPe0KigruDPflcVcUh3Tc1Up9FpdZaXVPAe7crrVOzg5 hUujeljBAwD1w4wKAACA5lCQ5/vmV9s8YXFT8dxN9QIomVb0XO7K1a782pUNNTkvTXgrK7ijvWE+ wqXUMW2NoVVk7aTQ07P4da78jdV3vH0Cl0Y1EeDJ0zKqAMAomFEBAADQLE+aX23zc1fWRTzuc1Qt gB5QkOcaV2535fc1OB9lULrWygvunGzsu9MppRZ/ytobV1EQ8kHzmRqutPoEJYfagcujmgjw5GlV uGEDwFDMqECVlJXv+XGqGgAA+5X5FTcxgzLrqFYAPaJ0bd915TeW94D5oa48YO2tBukUwZ3uKLiz vIPfUxBSwchvWj0CkiPZn0ukmgjw5OtU23QzYwAQZlSgauaX8Bo3UM0AALy8ikeDiM9EOh6TCgH0 msa9tDLipUz75pe6cqd1l2VDwS3t6aJVJb9z5Wnz6cCGBnEuMII73eg0uDMQPpP7XHm05nXEdgAV tQVVkC0tVz3KlUNcOc2VuVQJAGNGBarn8yU8o+6lmgEAeHkAVKtnnzU/4DSuy+OtokoB9NjD5lfy KKAxPpP3rMDOiRYnHZtWUSpbwX+ZX6Wp+/urXDnQlde6srP5yfszXOnnculYp8Gdwc9ffTYbal5P jD1XFAGevKnRflcoZ4cG/KSan7MeXpPD/ytyfLgr07kUgD9gRgWqZoX5mXep7tXzjfQxAAAU9Exc H+lY/VQngB7TyhWtTnzBle0q/D41vnqQK+dbvFRsChpo9dK/ufK18P+6vyvQ9TpX3ufKka6cYATk u9FtcEdjsVu5sn24Dl6qaT2RLabiNyDUhwI+q2t+jjq/FUM6HLqOtZrpKmNzeYAZFagizWB7LNGx z6N6AQB4WTHItIV1v3pHnqJKAVTAcOnIur1X7mqbZr9Qii0FULSHWSuTx7T37R7mgzrvsfj76+h8 lY7tGlf+wTbd10VBL030Xhb+npRsndPnuDzCcTTZXkG3vc2PWQ4Mc80pQPKs5Ts5cQaXS3UR4EEd 6ObYHx7OesAR5EFTMaMCVaUZZbNcWRT5uNPMpywFAAA+uKPUPdtHOt5KqhRAj2lgXIPwsfYQP9SV b9jY40bKQHDHMH9f1oRKjXMpJdvVtmlwp6BUYM9xeXR9bS2LdKxtXHmT+YwqX7KNqVILW5vPQKTV Vh+yPINy53LJVBcBHtSJBvmOsTjRdyBHzKhAlS125UyLk4taFNxZQbUCAPAHrzafaiZWgOdJqhRA j2ng/DUWZ/8dDb63OuFsuvV2OwCl+brflQe4BJK5xOJNEFewaC9XTg/X7LXm949SIGdHV/7c/P7p CgJp8sRFmdXVDsb2GJVGgAd1k3qvB6DKmFGBqrss3KeXdnGMR80H8wnuAACwkWa3H+DKIeYHlwCg DjSpSwPnW3V5HI1/LsrovLXXzhqLt6caNtVn8Vdj6Rr7I1c+7Mq7zQd4lF5QAcr9XNnFlS1dmefK DebT7OXiRC6ZaiPAgzr6bGYPbiAGZlQgF/3mZzFd38E1qxVAV1i+eYsBAEih2E/iT105MGI//2mq FkAPbRHuawrwbNnlsQ7K8NyLgMCLXApRaexkaaJjbxb6ujuGa24g/N3QffHudGWi5ZFuXNfiAi6b atuMKkAN3UsVoIGYUYGcrHblSFd2d+UC86tyRqJVmbNC50YrgAjuAACwkQaNtGLnWFeOd2XniMdm 424Avby3aZ/lt5hPPzmuy+NNyuz8tY/LGUZwJzYFK+7p4vfVdz3MfADnsPDnkWjMffNRrt0bI1zX Zfgol00eFzZQN+SKRhPv5cyoQI5Wmc8/rKLNU4fm1tbMYQaXAAAYngaPFNx5h/mBQK3e2ZxqAZA5 DXrv5Mqprrwh9BOaQhkLvmp5rOzI8bq62jrbd2e4TBJ3hXKxK0db+6uClM1C+wCdXeE602qneVw6 1UeABwDyx4wK1MFaOjIAALREg1Taj2I3V97lyl+ZTwWzNVUDIHMap3yVK2eZz1KxSwPOWdkMTnHl FiNbQUpzXJnd5u8om4RWx64e5Wc0IbHffMaJq9t8jbnhdxdXtK1xN5dNPjdOAEC+mFEBAADQLFq1 815X3u7Kn5hPX0TfHkCuxoV7mFbza5N6rdzRJvV7WLxVicsqeN4Lzaf4WsElkNyh1n7WE30+J1vr GSUUnDvJ/Iradl5Le4hPq+B1MDe0NwYsj1RyjUYjEHWkm896Iz0BmtEQvodqAAAAaBSlYtMEn+2t +43HRzKfagZQEgVy9nOlz5W3uvLacH+LOais1NBKs9Xr1OZaraOUXDcY2QvKotWud7b5O7pWLuvw 9fR7P23zNZe7MrFC14RSwCrgpD3OlUpuPJdRtW1GFaCGXgw3Uy2h3EB1oKbU2L3WOssfCwAAgHxp Rq32p9iSqgBQA19z5V9cOcf8qsRJlmbFgAbedzS/aqYX9Lp7mU/HRXCnHNq/6fY2f6eb4E5Be/NM a/N3tMqsKgsxNJb6I/NBqme5jKqPAA/q6AVXLjQ/+P2QKy9RJaihTvLHAgAAAABQJVohsK8r21n6 TCyaCHyR+dUSZa9U1OsO8HGXRkHCG629SbExgjsFrYBpJ8ij93m1VScd2lOurHTlOa7b6iPAgzpS pPmm8LD+qisPGhvVoV7azemK8tEAAgAAAICx9WJAWytolCrtsBJfcwc+6lJp0vf0Nn4+ZnCn0G6Q R5N4z6tQHZIVKRPswYO60sNayxuvdGUrV97jymQjqIn8dbI5IMpr/Gh2y29dedIILAMAAAC9otRM GlDf33xarr7w94dba4O+2mBd+7ZoDwoN0mp84Qna+LVzV7g+tLdt6vTnX3blJKq8FJoU207GkxTB nUIR5Fne4s/PC/eay3pch0qVuLv51W7juKSqjQAP6my9+RRtapjt7crbzW/UB+TcSCG4U03q6D1i fgl4vyu/duV5qgUAAABIbovQ5+9z5TiLk8p6pGM86soXXbnBfPCHgE/+lLZNgUAF8VIGeWaHa7Sf Kk+q3UmxKYM7hXaDPAvCdbIi0ftRwGZn85PgNTl1/ZB/1x5/h4W63C7Ca5HhJDFWM6DudJP6hStL zeeOXE+VIEOaefZ1I7hTVRtCR0+bg37elW+6cgudPQAAACCZ3cxPgPuh+X13l4f+Uup9ShUA0Az7 O8Prqp821Zjhnjtlgdk/9OtS0tjUBKo76X3hzjZ+vozgTqHddG26p8VM66dAuAI2l5ofq/iB+b2d DwzXpO5hm4XXPMKVv3TlYFe27vJ153DNp8cKHjTlQf0T87Mx9uHGgkzo4bqfKx92ZW4Jr8WMis79 3pVbXVnkyi+NQDJ6Qw1xzcJSOtKZ4e9aTUGijuzi8P+Pu3KbK0+b38PuOSNYCQAAqkGDt8e78nFL n06rVbNDUXtKe7p8i7ZTtoogT+qVPNpKgFRt8WmM+/Y2fl7Zfr5S8ntUkEdBpVYn7yp14L5d3lPU TzzLfGB6MB33FFf2dOXH5tPCKcCztytHmw/y7GLdB68XWITJytMmTy7+V2Mvn3VlyfKVKxnHGnTx A03wQLiRrjECPKmQ4zjOPfkgV06z9EGdwTSj4quhQYv2PeXKT8M1S3AHZVAje9fQ6H6PdT9TdcoY 95wiANTvyo/MB4FoTANAvR1OFaBC7R4NNn7a2tswvWxqTy0K/z/DlZtpL2WpCPKsSfgapGpL42pr PTCn8aeTe/QdLVYMtRL0mBLOq9OAoK6zpSP8m9KwafWhAufHuvKM+QDPTq68yjau6qma6eFee+u0 yZOPIsjjEeBBUzzrym/Mz7TfieqIcu/Y28hxHMtIMyrKEmVGxSB/mFHRgE6Nzk8rHH6buBMAFKv6 ZvfgXlEEgOYO6RT9k/lZcgSHAaBcK0t4jelUMyrQ9lFg5yqrzmqdVi0N/dg3mZ/EiLyobdvOfimd XiMTaUdHM9NaH5fqZXCn0E6QZ3Y4v8VtvsYWNnJwp7C5+b3Ktwv1Mc7ySTepdsocKy/FXqWxBw+a QntkKLjzojGLplPkOE6jz/wKkHk1ulaKGRW3WDNyUW9mzZ4wUeTy7RtUdL9gtWS8e+/54Tm2vEL3 itmhw7AmPBf6jIlDAFCWJ6kC1Jz6ew+HtsaUTM9B7/ux0Idmf578KKvIrMSvcSXVHIUmzC5q8Wer ENwpKDBxQYs/u8ja34/nqDZ+tth/J7d71ce5/D0CPGiSzbnm21YEdR4JjVMFdHo9m0+DistDg1+z GHIeUGxlRkXOihkVdTYuNLT2Mp+asEnGhfuDAq93hmu5KLpfrAkNZ23i2Bfqadwo3wX9exEoujSU gSFFfzehIXWrgY0fhrqcl8F3fWm4Fs63uJuBAgCAZrUvzw/9vSk1OSf1oa81Jj/lSCsmFiY8fpGq Dd25vsWf06q6U61ak74vbuMau56P+hWmUAXh4TkwwGKGbgza5KkQu0Lnm9+oD93ZypVzXPmQK7t3 2NBsUqM6hxzHg+Wa41iNuaU1v57UiNozg/epwEGn+x49H66/fwyf54sNuU9ca52v4Jsf/juzg0aZ rqluN5qs+n0hx1Qkw33Gn3BlNU2QpIq9295mfl+mgvZJus2auZ8d0JTv/kslPe+BXNqXOfSLtLcL KbleqcrjaBNCeypl23xL2mod06S4VlLpxVi5o3vUpGH+/rkIn58mTraSrk2pA1e00a9cWpP7Q/G5 vWLS/vKVK2mrGKk00Bw7hwfyNlTFqA8rchwjtibMqBjvymHmZwPpuapN6JV2b0ONz/noLjvfc7u8 pj7qykU17JwoTUNd9jwo9uxR2oHPVKDTWuwdN3hmjjrrGmSJGYTS6qVDwv/fkvC89cw+wVpPR1Hs Z6egz92uPN1hB3dCuOeZEbwDeqmse+oWxqAjynOJ1Te4U7Rh1fYgyJMXfVbvNp+xIJXPGRO7O9XK PaOV4E4RvFE7Xpk5+jrst2o/4jvM7x+9oo12d6t78sxuox+8MvPPVhNntZf6A+ZT004M/blibHdc qG8YAR40x4GhIcWy6OFpYPEmy3swvshxfKYrXzH2WkJ51LDYyZW3mE9reGdoTGkD+hdqes5X9fj1 lbLs4pp8zyeEc5lb02tFn9VZoWN8V4++n3Na6CwpALJ4UGdsZehIvGCjD8Lo8zvA/Aqa4VLpqYOY IhDSTnCneEbOG+Gci9U+o7URDhrmGq1SDnMAaWxrBHNRjkNr3BYa+jwmyJMftWHnJ7xGddzPW+sr M7DRrmP8+wUj9BsHr4J/p8WbZDd9hGOp3XyN+cnJIz1XLwvXwNIuznew+0N7P8dxPu2h/gNX/iX0 U7RKSttu/JEr7wt9S429nMpXIHR6SdHWHVK0ZeFV5lOzzQk3tk6W79V1yZ/O6zyr/v4O7VoYbvRV bzS3upw4Z5pRcWQG77ObFG2D7/8vhsaHysGuPFPTz7UKjYdUA+dl6rP6p2kc2qb5SMnXz9ct3mzg IiAyuDPei3tgWamZWnGmbZxxCCC/tksTnrXIg/YdTLWKWc/iy23jbHqzV6ZUKvYP3Mf8gO9ZlnZQ tO4ph3vdt0gxjqZJPWsSXxN7GRNn2qWU34tGqM+hE8wmhO/3udbbrAl6bxe68lUbfsxK96PrR3iP 7ba9cxxz0gS7fvPpvu8Jfy6+FwryaHLt/+PKnctXrvwqXwGPDedRd8pl+meuHOPKq4080oMVOY7n 1fDcNJi3zKq/YquYUVFnpzbsOzU+NDj25Bmb3CEZv3fdmxR4WNqwz0wDkQ+XeG+eanFTvUyxjann Wh1UVcdst8jntW2FPtMFtK2Annm8hNfYmWpGSe2i2IOtmrU/LYwHaKKFBkT7zQcsVYYGVoq/12Dw RaEtr7175yc6Z7Upruajz4oG4mckPL6uiTlUc9uWmA96FB4Nf943fJ/HhT6B+l4K0C2y3qfEnhLa 0GvC+5o6zP3oqHC9DU5BVmSraceKcC/LKZXZb135V1d+YX6/Y6W+H1i+cqXKuvDv5xHc2RQp2lBn RXBHy/e09HJrqmQT5DjuPc1CUPCxrqt4zrTmLjOv+4DnrVafvWLK1ouUmFrVqP3JFg/5+5nhv7uV +Dwo7s3HlHB/mFyRz/yIYeq+TiYZM/yBXrithNeYbKQMQnrjI7ZPP2bx9sBT20mrQDSL/MsJ2kqz Q1tsMZdANvoT94M06H8d7aq2aEzlMnvlqhb1x/us+ntMzw5F19Wpg565A+F6i5EJYFU4joLpWh20 /xg/r/tSzBXCxbk92eLP6/6tMbz1w/2jAj1WnWwGlUGAB3WltGzaBFzBnT+1jUuu4ZHjuDqKGRXX WX0GzDVj7orQkEA9qfO8lGpo22nmU4Skpkb0Z230HM9FJ3Vou3AX8wGJ91i6oI/uzQpsT7NmDByq cxlz8Oa5ip3fIcNcS7nbwTauEpw55N/UflI6zl+EQQM9v1fa2ClVNFD+F66c4srrLN6AZi8VGwnr +r7d2E+ibGVsnrwj1YxM7kWnJmxTqC2lPee+Y2Pv6dcurSaYyP0zK8e78lTC4ys115FUc8cU2Dna qh/YGWp66B/pfnaipRlLWRvKWMfuD+3fWPV3uTFZJDkCPKjrdf135gdU1IHWzFJSJW3qC4kb2FXK cVwEeaqc4zi3GRVjdYBQfzebXxUym6po2Rtd+VTi19CquW5m/a2zjSt9FofnqdIDfNrSBKBTB3nu rshnr/t1zDzw+pxm2fD5xtGd3ay1CRdbhTbmB8N/v2c+0KEBd6WSKII9W4d2yOHmV61pwEFpf8bX pL6KjYSLNslIGxkjjSdLeI0+Y3UB0nu6w98bbo+NVIpVAhI7yHOxse9yTlaHNveCRMefHu69/VR1 20bbuyanttVj5tNDnmO9G8NabPHGnAjulIAAD+pInenTzeeMVgec3PCbSpXjWIO9D7X4ACoGH++y jXmONahynqVZWaRjf958IKnKmFGBXKiTq5mM/2TpBv/rRJMMFOjWfgm7J3guqZN5RYIOwDrbmBpA qeWuTPBZpwzyrA7HrkIazHEWd9B7SeLBhaYOCjzWxs8rFbAmj2jVmwI4v3LlQfOD7i+Gf1dbVJNZ NHFDgZ3tzW8OW1fFvo4XcTmVooxJNbtRzSipXdnuM61XAeUUQR71fz9hTJTLifZB+bilm6S6NLQj 1lHVLbez59SsXaz7gsZ8ygpiowYDDkDdKHCpAbTxRnBnODFzHM8IDQ915Fd02QApchwrFcTCiOer 93S/+Y3Ytq3R5xhzNiXBHXTaGe83P/iv1BKHhc72rVTNsHX1rCtPmN8kMpaF4Z55WQkdwBXhs06x uaz2JJqQ8H3r+jyzx9fApATX1GXh3GbxvYvikA77UvpsX28+ZcvfhA75R8J/54S/f334rm7egHpU kGcql1NpFiY+Pit1UZavtHg9Pxr6+hdZ71YLXpbgu3cWl0B2bftjEr/G56jmlqgPoX236jjpSQHE O1251BjbRAudEqCOuPmlo0EkzYjWQF+/xR9ULHIcxxiM00Dqw6HD8A+u/J6Pb9jGKalU0C2tPCtW 4xUBn1mhE57Kygy/ay9GPJ4CLSdZ+bM9+8PnGzOgUKTSHJfw+rwsHH/HUHfza/TdWxy+d5sNOj99 /xYa2rGsi9/dPHwvtGJHe+3sFf6rP29jzQjsDHYll1NpvlPCa5D1A2W1k04Kz7CR2o+zwv21Cvt8 vj/y8ebxXcvOisTtSU0UYRXl6KaG9lvds0noWtC41gQ+coyEAA/QPN3kONYM/SMt/YqPYmbymRHO Vbn0NZvjGSOQMdR68xtEPkdVILJi0HkvS7PiQ57MqD7GhTZXjJWlCqxoILm/x5+v9uaJGUBQkOfa Et776lB3Z4fPZJqVE+zZuYTXGBh0fvr+nTToHFnhM7ZVEetpnDV7stF0BiFK89MSXmNbqhkl0jNM KS13D23IGaEPumV4tlWlP6fn7QWRj3kQH392zkt8/OuMycsjUXBnuaVLk1c1Os81xippjIAAD9A8 RY7jdqjxqoHasnN/dhPkUfDiXvOzSJ81gjtDvWB+v4CvufII1YGE9xt11Kc1vB7UMdPeG7t02fbS vViBlbUV+Wy12jJmkEepgGaWfA6asKBgz5aWNo3b5B5+TkV6vcO4JY3pVKogmgOoglLcV8JrHEI1 owdWhTZkf+iDVnEvkisiH+9tfOzZUZt8RsLja8LE0VTzKxTBnZQeDX0vfb5aIT/RNk7gGVq2DD9z WOhPpJxYpfPu4xLAUAR4gGZqQo5jpWO73pUHzAd7sJGCOwp+fcF8OoAnqBIktsKanS5KK3cOdGXX Lo4xq8f34uGkCPIsMr/ZfdnWhefNjlbf1S4aIGt6sLWVe9UFVEMUb6AKSrHW0qZDFWYLA8NbFfn7 xz48ebo5cdtxqbEqdugzKVVwR99nBWg0BrZn6Hv1m1+xt3aMfsTq0NZWfyJ1ynJdE2dwKWAwAjxA MzUhx/FvwoNvHR/3Kxofmu2p4M6/uPJrquRlLxmrvFK7qKHnrVld25nfiHXHDo+hQfnFFX6enBq5 83J9D89HnbPY6eeqZEV4vmNkF1v6AfMmINVQeb6Y+PjHUcVAKd+/KVRnltQWPrGEtgnSBXfU7tPY mMa/FKCJMQZWpCzf09KkS9Y2BAR58AcEeIBm67d65jjW+37M/OqdDXzMm9C+Jf9mfq+L56mOP1gR 6obVXuk82MBzVnBHq3eU3kYBnq07OMY0S7/vWYwOzDERj6d0FH097qjXOVXXEm5HY37+B1MNXTuc KijNDYmPP5sqBkZ0W+Tj7UCVZkkBgZR7Os41VlNqFVOK4I7GmfY1PzaWavyrSJc82gTrThDkwR9s QRUACA2SVRV/j1eYTyfWCj2YNVi/1liVMZhWqdzhyjVGcGcoNeg0QHKsK68xJkCk8HTDzndcuI40 E+wDruxt7W+SmkNwZ3DH5YI27tNjuSp0tnq1ClPPD63iqePA5kDkz6qONLFEK50WURUdm04VlKaM fXh2CN8LoEo04FtMpBENgI+2evDe0F5ZZj5FdYw2xko+BgTnmN9LMtVKrJtCv6KJ4xvjwvc2Nk1u LnOf6f7Qv7k6Yh9jQbiv9fMVbDYCPAByUeQ4bqXBNDCowT7OCPIUnnHlm0ZatuFoNtCXzA/Iv9WV naz9wXiM/b1sUidkc1f2ceV887O1xrd5jBmWT3CnoPQRZ0Xq2OoYp5lPk9Ar/2T1nbl+m2EsWsm8 0Fi9gOpTQFqpX1IG1fQ8u4uqRg8pmHOA+f29jot0b9b35rOu/Mg6n+z4JB8NAo0/nGI+TXwKahuf YNVN25zSJRY3cKZxpf1t9H11Ul4n2i5BK28WRDqmrrmcJgYiAWYoA8hJqzmONbi6rRHEHmwgdFxu piqGpdRsPzY/m+YeY4UT2jfONgZ2tjG/j4sCHu92ZVKbx1KKh/5M7zOnRDzeAu7jySyjCloSe38p IJXPJj7+W6li9MBu5gdBf+jKGlfuDG2DWIF3BUW1UvOx8BozaXegS2q/35rw+LpeJzSsTvvMp6iL pZfBncE0ie2wiMe7qYHXBgYhwFNtiuwyyAhs1OqM481Ch+BVxiqMggZelULgEapiRC+FBrlmwDxh rPxCa7Rn2VbmV+govZ/S/Cn11T+7cry1n0tdnY6PZFwfN1vcAfF3cYklsZYqaLme3k01IAM/StyG nEUVoyQKsMwMfRYFXhTQKSPlYxHsUX/gfGMvHHTu+MTHv7hBdTnB4q+IOrhC7WCtjJ0W6Vha4XSj VW/8a8AYVynt4Ynq0Uxy7VWg2ZW3Ux2o0MM1pxzHu4b3qnRkG/j4Xq6D/zaCxmNRfnnN4DsmXENb USUYhe4xHwuDARPDNbOHKzuH+2UnDexjMm8EF6t4YnXGLnVlCR0D9LjzzZ5FqLp2Uhm3SwNhD5qf QEWbGqkooPJJiztTv1PzQtGK6vOsnMFgtXNeoL1Tm/5kynaDviOft2ak47oy8vEOs+rtJ6fPcUak vtP0cM+6qMfnpDHt50NdawzqWW4L6RHgqZ4XQwP6O65818iRjt6oQ45jrd55hys/CA+VpjeWB0Kn nD2JxvZL83vyqAFIgAcj0XdJgYfJg/7c7cro+TXprN0S8VgarNzPyCmN3oq5vxSQyoUWL5//0Pb3 941V8UijSoGdoeaGMsvSTjbRQKgmJd5uTMaj3dAapePaq+b9+kMt7j6ICrpVdS+5flfOjPQMV2Dx Cut8zK0buh6fc+X+cD9TWs1Hwp+RGCnaqkXBnfvCl1F7jXzX2LQP5albjmPNntdMiCPND9I3vVOq +/32RmC/Fb8LnSxSGGE0R4eO1eahxGhTfaImdaMVmwsjHu/DXG7oMXVYD6YaUHHXJzhmsQL8UWP1 DuJS30yp0J6yagZ3BlMf9toE/Sg9WzTDXTP3P2V+1v2LXBq1aTekTPGqwNEJNb8/fCPi8fQM+0zF z/krFm//ptut/PEvrdrRGIqC4Z925R/CfVPj2k9zS0iPAE916MvwkCtfC+VXxuwNpFfnHMd6oO3p yvtdea35fTKaHOTR/X53V3bhsh+TBqefMdIkYHSfjny8+Va9lAHd+KeIx5preQandf9YEzqVz/GV yZ6+n+xDgior0rSluJcR3EFM25gfBPxfGb1nTXp8IGJ7pAju3GB+xr36xv9F36NWtFpkYcLjL7L6 Tt7URLqYq5/ebXG2DEjdbzg20rHKDgBqPFtjil935R9d+U/zY9pPh39DCQjwVIcGE7/nyjdDw5wv AVJSQEX7GrwUGga9TDmiBu1T4f1MiHxsrdz5U/N5SP84dCaaGuTReSvA80Yu/7YaWcBwtOIxdjC8 bhum3h35eHtndv4aDP2tK9925f+YT7/LvTJ/GpBcaEB1nZ2g/TjJldeY32sOiGFCeEauyex9q898 daRj6dyV+lCDoUph/gyXRS29P/HxP1fDOtNz56qIx9OqmLsyOXdlEIk1maisAOBAuJ//u/lVSPe4 8nu++uUjwFMNCuZovwcFeO43gjtIpwjsVHEp/NzQ0J1pcYMwSkv2dvO5nbUnzz7W3FRlO7ryrtBR x8h0bSgYSGo/jOT4yMdTx2NVzeoo9mqk2Rmduzo6SvX4n6Hj/VXzKY7qaK01K52lPttTuQWiwr4V +XhqB+3syhHm90OjXYQY9ExUKp/nLb9JAmqP7NblMTTeo9VAGgxVWvR1XBK1lXr179wI12PVHGJx JyDn1m7TZKJYq3FPK+H9agzvp+bTsS0zxrN7hgBPdTrHiij/l5GWDWk0Pcfxdq78ufm8xh935S/M r2TZvGHXwdau9IW6YC+ekSkQqtVOzFTFSD4e+XifpUrHdFZG71X583/uyjWu/Dh07uu2ykXnowG6 /zA/SNW0dvthCY6rQK822NX+gTtWoOg5eEGX54PyaaB4fuRjbhvajxqkfD1VDNj+Xf6+Zrf3u3Kz EdxpgpgD9sNRWqw6Bd+/EPFYqvf7M2xjnxLpWNqCYYvE7/VxV24yn72B4E4PMcBXDcpL+Aur3+xd VMPUcMOdktF71swozRTcN2Kjd6twPA1YvM2V37hypDVrXwQ1/CabXyqu+81P6FQM64/C92YCVYFh TEhwP72hpnWlQcZYkwqmhHZrDvcsPVfuCffYl2r4uRbBHQ1YXGJ+8kjT3BX5+j7Mqpc+RIFJTYxR SrrlHfz+HTwueubzFndClyaF7u3K+8zPFD/XlWepZnThVa7sYX7yWcyBaQ3mLjYfPNGzSbPJ1w5q vykwowB2n/Vu0mORzkirfEnL1gz6zI/p8Fk6lvXh/nyAK7+sQV1pomXMNNhnW56TrG4O97MYfc6j wj0xhRfCda1JPaRl6zFW8FTjZq8H++N8IRBZsWpnueUV3CnEzHE8mDoSyiN+kDUzyD0+NJo+Gv5L urZNaZbqm80HeLaiOjCMAyIf71FrVoqrbtpLO2fyPrUaW0H0p2v6Wai9+l3zK89+ac2drfcRizMj V6t2qpwbfoV1t5IHvfnMYs8WV5tZE6X+Mlz7QKeKPVLVF4uxWl4Di7PCsfY0P6BbBHn0LF4dyqrw d4vDz2gsbFqH97dlXbzf9eH7eTeXQuPuy7FXV6rNqUmrmnCzdU3q6cTIx8t1Ep0+2wsjHeuqhO9T fR6t5F/OV7z3CPBUQ5G/nOVsiEUzlJTmbF7m5xEjx/FImpxDXEGMt5hPM6VG1DZ8ZV6mwYvDzc+w 2tXIM4/hvS3y8b5Y47qKdf/W7LD7wr2r6saFUtcUoGqrapDiy6Ez1+S2qzrfb4pwnOszONeLrf2A wWIeFz11SoJjauxA+1h+0sgEgrGpf3GgbVylo+tnp9DO1mowrZjfsovja7Bcq3GODPebdifLDITn 2UXhfZzZ4n1OP9dN5pX14fef4BJpnPMiH0+D6woUatzn3prUUcw02Lda3pPovhrpOFMs3Zia6leL FZ7m6917BHiq0TksGjwMJiIGLWvVrKLZNTmf/flIo9O9RgOlmj33P13Ziyp5+R6smYSamapUOaRn w0gOjXy8uqZnGxfpOaQOwzdd+aD5DZlzUMwi3qWGn6vSz2n1zu3GxCTRIF23myfnMMlC/ZWz2/yd lVwePXVL4vv7u6hijELt6G+ZT4OmYKP2Pz3ZlQ+48j/Mp0ibZJ2Nf2jQdvdwT1od6f0q/etloU+k fsDCEV53Rvi5bujZ+YyRJruJ1kZoMwym60gpgX9Wk+spdhrsy2twvcTaz/D4RO/xxdA3oE9QAcy8 6b1xoWO3bfg8XqJK0AWllSpreWQOOY4xOqVI0CDkzlTFy/Uwx/zqjJ2NgDtGFjt4/mBN2zZzIhxH wR0Nsmg16mOhE5EDtesOceXPXPlGRu97LBvMpwJRUHINt4I/WBKu007vDWonrcjgPL9l7eWD/zWX Rk9psE8rDRYkOv6l4dofoKoxTBvgRvMrHBUsOc78AKDGOrT3jiYjju+wra10ahcnvO50XKXMPCm8 32Ll8AsWdyVAMbmX708z2wwatJ8e4VpdG9plddlT+E2Rj9dfgzq53OLsSaSVUZdFfm9DFytwP+sx AjzVaABp9oo2Pt/O/Ka1QCfKCO6oMaKc+zeM0cgt8hyLgkDK1b2f+cGPdtPGLeOjTX4PYjWnn5E3 0/z+TJtTHRjl+xLb0228tu6jWmnWV+E6OjxSR0SDKd925VPmVwJsyKjjoFQvSj2jFDQvhWfnEzXo +KwPn8W93Ape0cE91ToP8KjT/ZUMrg8FDDQTf2mL7UX2Fuu9KyxdgGdKeCatoJoxxHmD2gEa59je Ng4EdtOOUlu9v+R73uoEx1U/Q4EuBbme53JpZJtBKdIfi3QtbRH68nVYQaH7xn+He0aMseo6TDSJ dc/TM3tC5LbZuHAfmxT6Pi/y9e4tAjzVoMDO68OXjgAPOqGcmimDO8px/IkuGrmDcxx/xpXTzA9o jDULtNscx0CrDgzfI1buYDSTEnX0WrnH325x0xZU3f3h2ZNbcKegzqlW8Ggl6xHhXB7L/DPZEJ7J tFVfSR1mzVS/s8NO93mhjZTDQEMrq5VO5JKohNSreK40v/8JUNCEw6GT+boN7Mg0q08wUWNwmty7 R2jroHlWhXZhN1lOipTr+5hPCfx4Derl66GN+U5X3mh+z65uJl7WYaLJQxGPdYD5FYoxTQz3M12D rNzuMWZtV4M2HjwkdAy3ozrQJkXib0907NxzHAOt6jRVBNCN+S38jII7Cgw0KbijGa3/6cpPLc/g TtHGVhoapZuYU5PPT7NDybM9srta/E4PZ56l2wA3tpNHaLuJUrhpIJbJOdVxRcJja7b1VKoYgdrR NyU4rvYsqdNKMQ1YK7hDcLTZzolwDAV43uDK0aEvmzsFPL9kfq8uZY35ufkV/Z1YWJPrJObeSm9I 8P62Du2+1/OVrkbnE9X4HDTY/dbwxWBlFdppSCvHcYqBI+U4PiphJ31wjmMt6dwxlImhwdvPxwsA L+9z0DRKZ3a9+aX+Oac1K1IXaF+vCTVpc2xhBMNHo5S0j3b4u7dnUrcDoe2mDv38QUUTc/Y1UnZV TbGKJ5UrqWIERyfok+resriGdaUUbe+wfAL7SHNvntHlMTSGolUZSp96gm1MNa7xxe0sv3HFgVC0 EuQLrvyjK/9lnaX+qtNEk/mRjnNQgvema0yryJS1YCe+1r1FIKE6FH3XoLY2SdPGtT+3uNFa1NPg HMcx1SXHMQDkbnYDz7nY54XNOqtFgwZKwaDZeuyvMjxds1q11Uk6Pg2MXmJ+1XQOVmT0XuvQZz/N ldMHtfsVSLzQWtu/6QpLl6atWMVDYK/ZFJxeGvmYusbPqWl9TQjPir8wn7GCvXiaqd985pJuxnOU EljjiBpc1yD7w+b3f3y1K89YHulfh2tL6TtxrSvbuPIh83tbbtZm3WJTMxO023Tv10Q2BfiVpvhb xl48PcMKnmo1inZ15V2unOHKm80HfYCRDJfjOIZpPBABoBSLqYJhO3XKI/40VVE5xb4Be1EVo9Ks 0U5XTCgf/6FUIQbRQPAD5gM0gwcBp4S/e9jGXiGoiVSzEr7HK42VfU13dIJjnmL1nfCqcTit3vkr 84OuW3MJRbUhlBwc3+Xv696rPUKV+v49rnzY/CD+37jyPzNuUxRBniXmUz+22y94iv7iK6RKF72V K6915X3mg4xbcQvq3YMF1eo4TwkN8P9hfpYWnWiM9CAnxzEA1N+jDTtfdcjXWL5779S936ABqT6q YkxaVXFrh7/7DatHSj/E8REbfVBG/9ZKgGVJwueJAk9H81E12qcTtH1urnmdKYWr0vN/0HygZ1cu o65p5crj4fn7s0zes7KYXBDhOEXKe03E2dP8Cp4JoU2RawBe/QCtiO535UHLJ2hXZeMSHVNBRm3v cJb5oCXp2nrUUUO1bBE6z8e68n+7chxVgmGQ4xgAmuHCBp7zVqGzwIzw6tnB/L4Be1IVoxoIbflO FAP2gLSyWn+2jR1g0TX57oTv8yoj/XtTaRA5dsrwC60Zkzy096w2Pteqi78P31HG6Drzgvn9fT9l fiVLTs/Riy1uAH7ckDbFnMzbU/pcf2GkB45hUqLj6r6loI62evi7cE9TO3h3Y0VPaXh4VJNuyErP plRZ+1MdGOb6IMcxADTDFdasVTxqmxazDlE9SiOjwai/4jMa01rrfANlDdj3UYVow1U2dlBcg2QL E72+BhE/yseQXZ9S95lLQ1Ga+E6CdG9K8N6+2qDPQM/S14bn6vlGurZOKJWfAgCfN7+CVns55hQg TB2AX5B5m+3X5lfwrOFSr3wfThPB/sR8UPFjrnw8tA32oHrK+QBQ7c9nS6oBQ5DjGAB6Y3Xk4725 xU7rvuZXWTaBBjuUXmIal1tlP59dzM+OPdUI8oylv4vv7tLQUQZaoQDLfi383PsTvgetNtqNjyIL +pweDveZuaFoEPiBDj7DmZHfmya1NG2mvgJr2qhcEygY/2nfM658L1zPz2d6DikD8HJxxp+vVmf9 zpXfc6ln0U9Q+kkFdLSy8y/Np6GcQtWU8yABkBdyHANAPbSab11BHm2YqpWWe5sPgNTZ+tCRYw+e atLg01RXPuDKduYHBVdTLSPS93Zmh53b683nNOe70Fxnhu9YK7Ty66IxfkbfVe25uSjR+73d/B6y XLPVdcYo15TuU9e5cmQbx5sb+f01OWW4xudIT9se3WueNL+C5/HMz+XUcB9PQd9TrXBakeln/GLo HwzwHcmCPqOtQtneWJlY2gMEQD7IcQwAvbUwYufr8DZ/fl3omK3gY0CPqaN2oPkgjwZU/pUqGfV7 qxRGj3Xwu2rzKc3FZVRjY2mwvdUAj1bQXNTCzy0xvwn59ATvVwGC81p8HyjXuPDZjLWvk66LqS22 NVIMtLInLNqlFR5a3bEh8/PQyrWUAfibLN8AvCYXkYEqznelF88elIAvCJAXchwDQG/dFfFY02n0 ImOalbe3K6+nKsa0yvxKjE5ocJ+0V82lFTftpPlrJW2iBveOT/ieFUA4lI+uUtTWuNbGDu4UPtzi z02ialGBa1uTTrSHdR3GN4sAfAoKwJ+QYZ0o5ddOrmzTRr9pao2u8R0jHmutobYI8AB5IccxAPTW bZGPtytVisz7EqRdaI02fu500EZprwgGN9cn2vjZ8S3+XJGqLZVvGHt0VYWytii4087q416murqb jwxt0v5Fr3Nl9xo8KxWAPzHh8RdZfpmctJ/LPq5MbON3DqrR9d3HVxytdsoA5IMcxwDQW8siH+8I qrSyVlIFiEiDNsd2+LuadXsJVdhYCsakmNGtfkCqTb11zd5oBCZ7TUG2B6z91LILqTpkRHt8/Hko E8N9J+d7j1b9zk94/M9lVh+HmE8L3M6EojqtfI51Lo9yq6g3AjxAPshxDAC9F3tW67lUaWU9SRUg Mq2antHh72qSD2mvmuuORMd9r6Ub9FEaUgKTvaMURZqUMqXN39P1cD/Vh4xsbj4A8CFXzjCfPjb3 sc5zEt6b1Z7IJQCye2g37Rs+51bNrtH13e25vGh+osjl3CrqjQAPkA9yHANA72kWfsyZrRoA24Fq BRqj3zqfmUvaq+aamei46yzNHp8FDSSewcdXuj5Xllv7wR05xnq7CTv3OHRC+wJqpcfHXPmaK6dm fj66N5+S8PjXWfVXOWnFzgnhnjSpg/dbh3tJN+eg+7gCO3e6co359HyoMQI8QLOR4xgA2ndN5OOd SJUCjdLpzFwN1l5J9TXOFtb6QP1zHRxf6YAOS/j+Fxh7CJRFA6Dnu7K0w99X8HlFj89hfz5GdEgr PHZx5U9cObgG59Nv6dIlaoLZ0RU+dwV3TnbldGt/9U5hjxpcA92cg4I7P3DlH1z5X67cwy2i3gjw AAAAtGdp5ONp8GsLqhVoDM3MPabD31Wqjj6qsFH2bvHnHg3XVifucuXMxM/NqXyUSWmm9y2uzOvw 93X9fIRqbNvOVEEl1WX/r/cnvi9Xsf+htGxKt/d3rrzelfEdHqcObaVOz0Fp2X7uyhWufNOV31pv V2aiBAR4AAAA2qMZUbHzYp9GtQKNolnyF3T4uxqUIbVjc7Q6YP/FLl/nMks3W1yUMowgTxran2uN +Vn5ndKKh3YHAFcnOJeZmdX9ZC4/JO5zzEp4/M9V6FwVyFFA60vm9yh9nfmVPJ06vQaff6fn8Iwr P3blh668wNeoGQjwAM1GjmMA6MzZkY+3gHsy0DgXu3Jrh797vdVnhjJGpo2wW91g+YYIr6eUOAR5 8qF7wKXm91joxjRLE6zpxOGZfQZcz0hticWfWFaYG54zVaAVqJrQ8FZXXm3dry6annnfaoJ1FrRX oP5ZVx505Um+Ps1BgAdoNnIcA0BnbkhwTPbWAJpFnfDjO/xddfrnUIW1psH729v4+XsjXZNlBHn6 +Hi7pkHZh80P0HZjhnW37878yOele1tOaWuP41JECW2FNyU8/nVWjQkj611Z5sqWEd/P2zL+3N/W ZV0qYLahIucyk69xegR4gLxsGFSaiBzHAKpircUf1GBvDeRoLlXQFc2an9Hh72rl325UYS1pcOta V6a0+PNK97cu0msXQZ5HE56f0gyewcfc8bVxviuPtXF9jET7LvV3eYx7E5zjQZl8FltY6yvsgG6s StDvKCioenRFzvNjkY93bsaf+aVdPCMmurKLK9vU6UswbfLkca5MdaXPlUNdYQ/bQQjwAHkNAGjj zB+YX4b/QPi7bjpzTcxxPDCoIM/rAKiKzyc4pga9SNUGNEu/db5i4nYjVVvdFMGddgaOvxj5Paid rJX+tyY8TwUov8712xbttaNVO/MiHEvBncsiHOenCc7z/Ew+j4O4JFGicyxd4F39jyoMlt8S+XgK XuWYRlHvuZsA/iRXDjG/j9HmNbn++8Lzb3m4Xl8eE1XAh1uDR4AnrhQDModTrW3bJ1FHqyoPdc1C +DtX/t784OLNrvzGOgv0NCnHsernv125z5WfmJ9ttoGvS/TvydTw8D3U8kqvAHRCKU1SDH4tMwa8 qoBNSVGm93b4exoAuITqq40i7VY7wR3N6k6xf4pWqh5ladO1zQ7ny8SG0e1gPhh2p3W/akdiBXcs 9K1SXBc7ZPC5fIFLEyXSeMa7Ex7/cxU5xwsiH3Nehp91t2m79UzVWN+J1nmAp78idTEhPP+WDvP8 05+XT5s8mTaEEeCJbXyCY06nWts2KZNjduIO87OkNKCozXX/2ZULXfmyK79w5fkOrq8m5DjWIN09 ob4+4cr/DIXBu3j6bJgZFZbPjBmC6ejUqQmOqcaqZm8T5OmttVQBSrStdT6QrjR5h1KFWVN7vNO0 W+clfF9l7Mmj811jpCgd6bpQKrunLF4qsJjBneJZmWKyyycr/tlMtTRjNftw2WMUdyW8H6stUYW0 r7FXpM62vFbxxLi3aKx/d1eOdOWlDo/xVMRz6jRjTF9oH4z1/HsftwYCPLGl2h+E3Nrt3xDr3NBS R2tDaEyrE/gjV74SHoQ/s/aDFnXPcaxZIFqto9mNX3JliSvfdeXfXXkx4+u8vyLvY8wZFZbHrEyC 6ejUCkuTE1v3O4I8QL3sYBtXul4aSpE2ttsB3G8YqyBypM9MA/gagOlklvEsSx+MLoI88xO/ztLQ puQ63hjY0XWxIOJxD7O4wZ3C5QmOWZXB5uGobXZlomO/gcs/ijpP3js14bGvq0DfY3WC582VmfSp 9B5vivgcOd8635rg6YjnNaWDerg0tAta8XFueQR4Ypuc6LjHU7VtOS7BMaucB1hBCuViXRIeXErt s64m5zZYp4Gop0JnUSueVoaOUhEky3kfHmZUxMNAAvXcrU8kOi5BnvogP3Tz6Hu7W3jGFoEcPbuL la5zQ4nZec5lAKPpNOhyaGifqh3V6QD+raH9XwZdv2ebX/2R0mzbuJpnXEOvjVYCOxs66MtMMz/7 P4XrEh23qnuMzbF0k8NO5xYZRW6ZStqhoP6MhPV2QgXO8byanlcr95YpkY6lMcLvd/H7D0Y+t1bT bhapattpI08xEOCJ7IOJjrvA2Muinc707ATHnV3xz0AN/N+68m1X/sPaG/yvc45jdXoeceVG8zNB 6rTnDjMq4jkg0XEJHG1qfI3PTfeXWYmOTZCnHtiIuRmKgftLQ5tDK60XWdxADveLPKmt3Wc+qKPB +zsj9FmOtfInK2n1x7QSXkdtTG22PbVB18f5NnpgR/eUZ1z5lSu3mQ/w3Rf6fetHObYG+SaaX3Gc sh2UIk1bFVPWTrW4q6qGmm5MConlqBqf282JvnMW2i297seuTdC3WmTVHvfaLfK95ZQu2wjPRT6/ Q8b493HWeapaGAGe2B262QmP/zmquCX7JTz2Ryt+7mr0a4VKvyu/tPZW8dQ1x7Hq5Dfmg1/ra3at M6MinlQbpB7BLTmpnSv2fpYk7GgVg7a5T/bQ/aMvlKmWxyD0o5GOM9fqPeje5ID2uHA9K6hTDNzP 7eH7IchTjWuiCOgMXr21NGJ/UUGWXu0TpkDBxIj3x5Go7a8Vb1+3PCajdTJ+oIDwD8P1MVqKvnWh 7f9V8wNg54SiWe5K1X2fDb/Pgvbq2KukayVV2ih9Z+ZUqE+6vITXualh9/BUqfiuqnH7RM+VlJl+ rqzAOS5J8Jy5p6L9KV2nt0c8nvqk/V0eY13k+r9qhPvaFrZxP+d5HR77TAMBnohOS3x8dRTPoJrH 7EylfBDNs+rPplG6NqVo+4n59AbtXF91zXFc1/scMyri2MHSpVg4l9tyW9dYuyZX7PxSd7Q0wPGA 5TfINS402h8J94+loSwPDfmqd7wXRzzWfjX+ftd5hd5IilRKD4freW6F3lsR5EH6NkQRyClS8ele pwlGRUAnxXWhgYz/n727Adu0qgsEfgaGjyFYxm/BF/GDEa0wxdoSrEbNLlqzxBxNbRNXsbUPstVa ob22zS2krTYZd7OCEutSV/GSqLw0t2QqRClUVtqSnUFBBtG0GAoYEJh3z7/73M3Ly/v1PM993899 P8/vd13nmndm3ufrPPfHOed/zv/smfJnj4BBBA52dnQ8R31+LA1/ZcPSVX51QHi9dmgcTzHI9p5c 3pbLh3L5y9Lf+0iq9hi9pBwTSye0xez3l6TuVnndkNoL+l1U6myaQY+ugjsp9XPlUpve1GI9Xp9m N8jTdgaBaY8/xrXrW1s4Jt7ds3OrHu9qcoylqT7pZQ3X/ZXlHli3neqVq1dM+Pkv0SQV4GnyZn9R B68Tr/G+JF3batrMhVvbPYCOxVdStYJn34iPm8Ucx3GNOz5VA8GHzdjxbkZFM42pD7b4/FIsPPhe 2efn63tHq24Y31bOyb7btOTasVqjve54z0u75p0uAzNheSqlvk562FE60fP8PY1Tnp4OrjSsSwxy XVhKBBkW08FVOXUgp07F1/bxEG2qi3tSx/W+PKd29Hr1ip4vlO9lKPeOLengnkvjrPKLSXsxGzsG 2iI92/4lx+DdqVrZ80epWvXxT6V/8JDU7MDcRo+H72/x+aPOrkzdD9ZvKteA3R2/7rysxnxNaneC RN3WnNX7YZsZBC5K0w+s39pC36pP59am8l6azAb1ojT6WOBqmr6PnFbugXXb6fwGnvPU3Xv33pdI mxYXF9XCmLYtLMTJ+OrUTXBnpcb9JWm0NFyzaksZNNnR4Wuel8sv97T+D83le3L5hVyeOuKNK5bx vzR1n897NU3MlIqbx6/n8j9Tla7twAo31aFeCC9suEEcjcMfLx3FWG3xzIZuuof19Fx5TQfX7+hk n5yml0alTz6Wmg3CR90+dk7OzZXErOk39PDcimvqd6YqaLzRgc4Xpe4HoqZ1nYhNcXd18L5j4PPo 8vPtK9zntqbR9utbt3OV2tu8u0/tzQtSv1bqbOS+fvoM1H19PEdqznr1ZrRRHl1+/ubU/iSvPuhb O33a/bG6Tt6Sy3U9uh9uKsdmzKB+VQPH5hfKPf83crlzjfp/SfnzN6d8jLyvg+Ogq3tp3Cs/OOXr S7R3YxXDrTN2PYu6/a2Orxl1X7dP14um6vK2Do7DCOh/eEr92jauK3H/ePkUj4U2gjtNtxO6OLYm cfbuvXsvTlQHlADP6LYtLEQn41kjDl605bxyEt+QhjtIPcnF5sVp9IGXqKcD6eDMp0NKGSeCH4G2 d6V+Dd7G53huqgI835JGX6nXl5mBTS2Dj+86Zu38Tqpmt0Xw4mulXh6Zy7/O5Q8Gev5sT9XMhz7r 46BfXMPf3WGHIhrE359mf/Czi/P5QbfkNP00Natdh6/saEAgBjn+rAfXsHECO7WdpdPYRzHj81MN P2fMrN7X0ncQwflzl13f4hr0hGUd2KY7bLMSSFitXqc1oaup9z+U93lsLo/P5XGljTMvgZuNXidf P4D26jTbptEnfk95/X0dv/bWcv390Ybbl/F9x/46EVz+vTW+/02lfXtvD46BCDLd1cHrxH3nlS21 A6Muz+rZdT+uAT83hWO7yTo9ulzjz03dB4NXOn6uSVWwZ/kxdHsZM7gjDScQFGlCP7Bk/KMe59rU Ut11HShrq28VbeSnTuG8iuvkn6TmJz+2MbH0C6mfq9UFd5afJAI869u2sFA32GKm2Pf2uKMRwZ5L 0uzN7qgbBNHZWyg3rzPHuMhETuKY9fR35eIXqczuLhfXR5fni5mBXzfGjTBucu9I1QyfL0258xXv /XmpCvA8I42XinHancimB4PvLY20vygNkbiBH5nLk1IVrP1sacQP7YLY+xkVqT9pRPrQWWuzI9pn cY29vqWGYZ9XSLX5uft0bDUx6aXPAZ42BqqaPm43Elxbfj1u4/4R7dAL0mxNOIoA3+Vp2HvPberx ufXkXM7oef9Ke2q8+8KvpumvdqsDPjeWfsDtDV2f4th9TC6n5PKy1O5A9WLpE/1S6ecfGMgxsD1V KePuTwcHm8Oh6eDkyqbbQE1MeI3v9hWp3wH9Pq5COamcD/G9z1pg/tLSvul7/y3u9TGhNcZ/binn 3iNStVfaQ1N76eq7zCzUZt8qsgn8fkdt2DhP2pgI0dYEsi6ynox83AnurHAREOBZ2baFhSHc3Nca OPjh1I8ZvU00Fs6fsOEcdRCzL/62dNL/OFUD+neWG2GUo0uj5N+kajn9k9Jk+X3rlVXTGmz7vlx+ MVUDSON27KPx+F2p24HTNmfJHijHQQxoxWDd4eUmeExp8PQ57cVaejujoieDEZvLud2HmWJLr9Fv Tv0ICLdd92d1dB+NRvkfpv7NsusyyLO0039tB8fVSeWcaiKNY1epVsbVdHrBWhMrHON7+OgGjrHl QbS2JgjMSiB7Wummmtan4Gk9WSvq9HVp2EGzLvU5heV6jsvl/al/g707y5+7llwH6xn7y68DJ5ef Y6Ln06d0TYjJiZHKKtK/fnVA3/9/Ln3JW0sfLII7MeD8mHJsbC39sSbb128vfbobR2gTtrX6qqt2 38+mamXDNNrAbaxCcD8dX4xpRIDnpvL3h5U29g+WNueRLb52V235NvtWbbdh20z52GZWi65WZW6U 4M4qBHhWOjMWFqLB8cUZ+ChDTwvURJ7NGNSPfVdiuerbys1gLdHwjCWaP5WqQE8EACaZ+VgPtnX5 HTyk3Jj+YzqYm3wIN+sucxzXF75NK5wzQ8tx3MsZFWm6wZ34Xp+YJg8Od2WaAeGmz+HHl47Fq9J0 OnvR+YqBsGtTf9IqTKtR3HQK1/q82p6qQZumOlZx3T0x9TvQGatjYnJIPRM5bC7l0AnbCePupTRq 7vqVBibarPMh57mPY7wv6U/rgejLlrXzti/5+zmrnFcxkeC3p3xu9XGSxZD6cc9Js7HqN47XPqQ2 H6p7UjXR4Ndy+UiqUk0PxbGlPXZ/uVceWdqK20tfO9qMDyvXijavodGXvW3ZNfS4GbsuTWOyTFsT YNTxZO312iHlHHxuaWs+o8VzLdrHry3tji76Vm1OoGtywlwX4xJdpCzvYn/ZjRDcWetgE+BZ4exY WBjqjareW+ZrpTN9oFxQviOX/zOwz9JEiq46uBM3mUgZcucIF+FI1RYDWK8ojcCJL0SpuwHvb8zl jeUGclSDNzk5jvupdzMq0nSDO0NOpzPE1ZdNruJoq07r1VLTDNzGYPxnpnhc1oGv68t1bb2VmfVe GHEvbDsFTVvpBJruLEca1vvL9TZmSMYs5EgbGzORY3DqiDRZoGcjaXbrwfL/MUY7daVBia6uMxFo /PXSUd7X8+/5rVPuwMZxEBsYfzb1M/XkKIMZP9GTwYAhurS0u/fP0GeaZJ82Uvr7XH4mVfvw3Dsj n+mE0u59eblmHOFrHlQ/bFYmRY/ar3jsAK+9Mek3Jt+9vrRf23JfOa+/1NEYSBcrrZdOHtxoG7ae 9HhGB33krvaj7cPWANt27907b6nuRzvZBXiWHTFVara7Bva240v8Wrng7E1VyqYvl07B4eUi/vIy MDEU5zZwMdxXGsHxXHeOem6Ueov80ZEaoYlASReDWJFq7oWpWr3z9anZ/MZBjuN++qXSoA+HlvP+ sNTexop96FSsZHvqz6zrSTsPfd1XZqnXpGGlMZ323mJdp2vbiBhEXBpQ6DJv+tBWTEZw5UA6OHkm ZiE/oVx3ogP3jNJu2NzQ9xIrfz9e/j5paqC4lz1rhWN/GufC0hQ6feqkTTMI22VqxbbPkRekapan AfzxdbkPwFTGH5JAzzjtl6FMPBunbXRWqtI2npyaTdk2rw7rqN86K/2uUT1kgOdiHBPfVcYMvrHF 8YE47v5TeZ2u7ifvTd2uxIt27GppU8fZJ3xI/agmxmjH/ayRZWnf7r17XeHXOiEEeB5o28JC3zct X+5AucHEAPSHy0029pq5Y9kgRHzRdw/oc026BDBmNv1lqvZzuX7M54iB8hhQiVm7TQRLYlbmW1ru WMcAU51e7uiWL7JyHPdHBCDfXM7zf5XL8amaXRR/Hpva21TxAZfPNN3Buk1pOBvPbkScWy/p8fub dJVlHKtL010dktpLGbDUtFMr9DHIM63je5Zmpz8uVQNUsY9bBH36NEC1VsB4sQfvrQ+phKOt96kp vO6sDNpG2+7FaZj7lvatnfn8NJuD+Gu1JWIG9mm+/hXFxKn3z8ExEW2jWPH3I+V+eoivfiJN7O+3 EduTAM9QRD85JvrEWNQzWzzH7itlS8efLwIrH5iz9kLXe2XXx9FNHfdjo8/48nJcJQGetW1WBYMW A2MRsY1ZXpGG7K/Tg5dsL6bZWt6/Uf+Yqg23r5/gOWLw8W9y+VCqBmwmXcXz6JY/c6SJ+aFcvj2X r2v5teKifn56YAR/1nMcn7akEdu3/Lux6vCN5aZbpw76plTl241Zkk9KVcCvjdk6/zKjYsp1cOyM XcN2lMZxX6/fPzHBY2OyQaR0iABRLOE/vHToIz3HQ1tum/xiLqdPsd7i+4z9ZrqebdYnszg7/cZU zVaM6+CPlGP5sB68r/VWA16VpjuwGm2JT5X21bSuddNYiThLgZ2fT9KwNSHalUNKz9qUPeWeLEj4 wOt2pC3r44SyNttG7yn9iYcNrE1fB+H6dC081mnEMvVWDkd28FrTCNDGipqY2Hp1mv1JdDFp/IIp tRcWy3X6tg383v3lHhY/H1r696MeGy9Kq6+WYgUCPA92z4Au0pGG7V25/PdcvpJma/b6JHk742IS ga+PNPA+IvVdBHhiVm7f861GhyDS6zwydZuWq3bOsj9n2RVp+unIVrsuxDF7SykxePcXqZopH7N2 Htpwo+sBMyoGKK4V96aDG78eVu6Lm3ry/o5Isxeg/6dyTMbKyF25/EOp7xPLdfYHc3lyam8FxGk9 OU9jdda8zTaLQe03pdmddBKf6zdTtYrytaWjOc1ryUauz9f05Jx4xRTup9NI6xH35Ben4aQlXKv/ eFYyGN/UdfENaX4G8lezr1wDYsLivO7fdF7qX+rKrvux/ztV2SiOSf1fxbM8UH/ZHB6zV0+hXXNr OjjgO2n62tqB0h+MCWj3LOkXRj/syNInOXTJ798+0O8r9hmP9Gkfaun5Dyw5l6chjo2YlP2rM3ou 9mXVe1zzInPLapk87iv9+xtKif5RTD6OCWcxnrqRiejzuKK5mc6NFG0Ptm1h4WOp/0vFIwVbzHT5 L6kKhhyYsa9hkvQ/McD9J6kaQLtz0nMkl0eVhsS3pskGa47voFMv/U+3uspxPInDy7Eb+f2fl6pV VU3o24yKUfZPixtfBBo+X86XCJAfVQYVYrVTbCzfhwkQfU4BME4azbg2xwzlX0jV3iLLV5xGgy9m 0/9ouQe01bnf1KN6PC7N/myzeu+2eRm0elwuby3X26Om9B42usp0Wrm0p31eTiO4MwsrNOq9U+Yx JU/TZnlPlaZsLtfTHT26TjUtBqwjZVLf9/rsSgwA/kqqMhBs6el7XK1NE+25L/bkPXaZNnvStPpr iQHtSEH+wVSNd611/9xa7rMvG+HeHs93Z3nuz5fyd6kK9Gwu/cEYkI6gwUKqAo//PvVvguc419Y2 giD1PpWxkv13pvwZI/B3+Qb6V4s97BuuJCYA/HLP7hMr9WGjb/+5XP5XqhYixDl1fzl3IiD779L6 41FrZnqQom39k5sHi3yGbQ6SR8PgmvLzOBsaHyjvL2Y5zdrKnVo0SmKFxDizA6M+vpwmD+7U6ht/ PO+hYz5HXKi6mLG5vzRC3p3mN/1Pl05J059FsZ6vlZvvlnIzjRR+kyzP7uuMiv1p4+mGYlbJh8o1 9Jpyjh9azp2Y8R4rSfqQYumOHh9Xl4zRMfhqqlasXJceHNypr7XRGD+1NBqPaamz2CdxX4jVS69O szcbft4CO7Ubc/nj0rk8oeNO46irpD7eo2OlK10Hd2Zlv6kYPPtgmp29UqY1qBPn6AVp+Ku4unBf uX+8pdRZpLr+tjTaAG7fjLuH6bz4Qin3pP4FeNZr09w65thFPS60K1Vpj+r05uOMEaXyHrpsd0Wb o8mN5ZcGdUa5Tka/9LJSYozzBalKX75aHcagc4zvxJ7Nf1K+hxtKX6Tex/qI8rm+JVXjg0eVvuMs XFt/MlWTDJpOLRjXtnf04DN+epX+Vb1aK9pkd5dxkviuDy/XnCNL/78vAZ+oz9emfk4GWb5iKuo2 Msj8bqoCv0vHYmP7jD8tj4m6/p5yfi2/dl3ivjhhJ8cKnpVtW1jYUhqT41zwbi43l12l8fb50lDZ v06HM/KlxkyBmCGw1pLTO8tJ80vlZJll28tFYpRGQ8zijw07fyxNPlMyvpfYuyRmavxAGj3AM610 HJtKg2uWZrz1Mcdx3/biWW9wJvZo+qlcHj9mw6Xve2dsZPZcXB9if67/XBry9y/7/1hF8oZyvD1m ig28uHac3uPjKerlyhE6n9Ho+2TpbF2ZVp+YENfYnynX78fM2Tkb5+hvpeEH5+c1sLPUN+TyG6la PdlFoDjanc8Zo85HWfnYpi5WONfXrS6DO7OQOzzq7IVp+Okk63zwd5d+1N3lPhQDgUeVcngafyLX emL2bQzsW7HT3HEZAZ9Y8XFm6m86nnpMIMq1vv8Nfa/RPo9VEo9K/RhkjaDs20a4v8bYxRUNHQ/1 cb6RwOY00zc1sSKkrRSF0Td8fjmu6vGkuBd8rrxeTIr9f2nliWdLRZrzf5jR866p/fRi9fp/6OE4 QRyfv1L69l8u/f/PlTGDO9LBcdjodz6xjJM8srQJNg3kutOHY+hnU5UJ5Q1rvO8YV43gTqxGOjEd DOhekjYY2LGCZ52bhgDP2rYtLMQFIWbpP6P8udyuVM22iBU1+1tquG0pJ000Yk8qF5+Y1fCZVEWd 58FxSxrxy8Xsi5iFGvlQP18u1E1HfqPDF7PJn5YOzqxJq9wIo7HwkTT6zJM2rNXIHIrlaSz69JmG FOAJMdj4prTyrIm1DGlGxVrpHRfLNSJmLf1pWj3oHo2TC8uxduSUPsfxqf8zfOPeFLPeNhLkiYG0 2Hsngjd/tU7jf6GUly35tyZmBw5lsDWO4XemyWbKL64wSNDFtdrM9EoMFl9cBlvaTNNWb8Y9Seqv jaZXWT7LOC1pk417ft5c7kuzFtzp8nO13WGfhVU7dT74G0t/7aby9/tLWyhywz+h3PtPLAMQhzR0 HER74w+TGald2JwO5vk/qfTbm1xZsNFrZLQzYgTqljS7e861Kc6/V5V707QGV+tz98Njfof1+NGx 5e9NHQ/1QPTjlzx3Kte1Ptxvol9wRtrYKrsYL4ntBj7R4XuP8aQIlj23vGas7Phqms1sOONeQ19Q zr1RrptDmdgVAZunpGpM7/rSlr2vnFf1/ePrU7VvcYzxfGNpB3W5H1g9oXmokwEOKf2RxTWuYRG0 jrH1T45z7gvwrHOTEOCZzLaFBZVA302yGm2a5DhuXsxGiVlxsXntwzfQuRlpRsUAjvlowP95aTzd sEbjIxonMTgXgd0vlcZ/WtbY2rSkc1WvvGxqQGFIs77rPRnWW2n5vjLwcdGEjdal9f60Jf9+5iq/ f11pQA4xv30cT+en0XKJf60MIMREh7vLvx1WBkwi0HBEanaGelynY1acAcwHH6dvLfewY1u6P8a+ atemZlYqxzn8i+ngQP7SWcbXp/Vz3y+99i6dkBTXw5XSzOws95Ym3v9GP2NXwZ0YtHr5DJwP29Ns 7LVzZ2mnxWfZlarJcdGGvKccF4eU4/bEcqzGSrhvL/f0cVbfjZteiPbbhUeUP09e8u+RMePRIzzP dUva/XtL+3C9LB2Mpw6SnNvRtbtuz3zCudv4ebeU82UY6mDYWsG6tlZdTVu0Y7+jtOW+s4yftBnk qevxhjTsfRo7IcCzTodHgGcyAjwMSBOzwruwkVkgsRF7H3IcD22TxRjMiNkokcv1x9KDZ8btLJ3X WRmYqDuHZ5QOfAR4/rY0ovZ10IjaumQwoR7sDCsFW+tBoSHP2lmpI3e7xmoj9fqK9MD0Ekstlg5z bAwbaSY+W46n28sxv6Uc/5F24MmpGsg8ZoLOSlxL35EMYK53rf1v5V61tcF7Y9T7uwyOjPxddBXc GWK7YKX6mpUUvxHojgB/TED40AauVxHQiZU8kVo5BrWelDYW5DEwDO235x9X+m2vaqgvW2fciH7h jckkFRiljzfr/bu498cEgJgY+7xcHpaaW1FYt+fj2iOoMyIBnnUa8QI8kxHgYYD6GuiR4xhgbXUu 8XqA40C5vkVgtt4kNoKYMav43nRwhnqs4InATiyJjxnqsb/TKDPUd5br6dVJcGGUzmEEl/9tGi+4 EN/lH6UqRcxn1fvYxpkQMlaXIA1/FusoaTf7Ls6XT5Z25eWpCoJvRFwvYyAnUh++trSZlwfDDQzD dG0u7ZrlqdNXUqdyT6VPaAUJsNHrzHfn8vpUpW3bMuLj6/GoeuVnXH9MfJyQAM/aBHgm7c0J8DBc MVB4VpruLE05jgHG73jEip5HlGteXPvW2wA29pSKVTyRBvAHUjUovTzIU6/ki8HR2LPKptANtLfL vaRO57iSeh/BpM4bsz11k2ZsFoI70Sa8OnW3X0mbYm+dmBX7a6maJXvPiI+PgE6kZHlhLo9N1b5x N7oeUjPABDBMY4zfRn/rqNI2WD42VLt2yc+CyO6/0+twCvB0foGAvpHjGGCO2n6pSrPwqPL328uf Bi6ZJV3t1zcLwZ1YpbJ7hr77f0zVrNlztTNpgwEmAKBvNqsCmHuRWiLSjb0kyXGsgwnMupjZc3cu N6mK6TFBqPX+zdVdfI1pNoI7n+zotaI9uDzgEm3D2xp47qUr4A6Ua9zXnAoAAMxLBwigFsGXPaVc nOQ4BgCG5d2p/VRjp6bhB3fqVGSRLvcbGnzeOv1upHqM/cCsDgQAgBYJ8ABrua90zHeVv1+mSgCA ntqe2k83e3aqVj4PXazmi1UvsRz4KakK+EwiUvC+Mg0/8AUAAIMiwAMAAAzdllyuaPk1Is3Yb89Q nUU6s0hl1sSmrLfkslBKuD5Vk4Ss5gYAgBYJ8AAAAEN3QQevEStUFmekvmLFTqTffWSafPVO2JFW Xj0VKdvenMsH04P34AEAABpo2AMAAAzVSbmc0/JrPDvNzmqUTbkck8t35PLY8ve2xH5IF+XyxVw+ Vr4rAACgIQI8AADAUEVw4qMtv0bsL/NnM1BPUSKDw8NzeVYuP5TLIzp8D6flsjtVgZ7jHLoAADA5 KdoAAICh+s5UrRJp09BTs23P5e5c7k3Vyp2n5fIDuTxjSv3BCPTEip7zUpVab9FhDAAA4xHgAQAA hihWpPxuy68Rq3f2DLiOvi+Xt6Vq/5u7ctmay/G5PKwHfcHzc3ldLien2Ul/BwAAnRLgAQAAhqir 1TtDtSWXy8vPC+XPOlVbX8T3F4GnbWnYgTQAAJgKe/AAbYqBhTNzuTBV6TeWlveV/9uqmgCAEVm9 s74LlvX7Dkn9Cu4sFXvznOSwBgCA0QjwAG2IoE0EdWJG5gdyOWeF39lR/u+28rsCPQDARj0xtb96 52cHXD8nrdL+6jNBHgAAGJEAD9C07akK2owyqHBOecx21QcAbMD5HbzGlQOun3c2/HyxmmlnKVe1 +L4FeQAAYAQCPECTXpPLFRM8/oryHAAAq4kUsDtafo3zcrlvoPVzXC6nTfgcEcg5NZejUpXW7fRc frKU08u/HZaqvXPOzuXmBt+/IA8AAGyQAA/QlNhP56IGniee4+mqEwBYxRkdvMalA66fN03w2AjW ROAmAjmfzmX/Gr8bAbDYo+jiXE5MVbCnqdU9H01VIA8AAFiDAA/QhJgp+oEGn+9TuWxWrQDACt7Y wWvcONC6ifbTOHvvREArVutEsGaclUuLqQr2xOqeWPkz6Yqe2F/p+lStFAIAAFYhwAM04f0tPOdP q1YAYJlY1XFay68RwY6hpmc7ZYzHxKqdl6a1V+uMIlb+xIqe8yZ8ngjyvNUhDwAAqxPgASYVOdLb GGiJzZOt4gEAlnpyB6/xngHXz7kj/n4Ed2LVzmLD7yOe7y2pSts2iViNJHUvAACsQoAHmFSbmxyf onoBgCW62H/nEwOtm80jtstihc3FLb+nSNsWqd8mSdl2eTLpBwAAViTAA0zq/Baf+yzVCwAs8boO XuNLA62bx43wuxFwuaCj9xWp305O4wd5IlWb1L0AALACAR5gEltafv4zVTEAUMQqjhNafo2rUvPp yroyysrn53T8OScN8sSEoq1OAQAAeCABHmASR7T8/CeoYgCgeEQHr3HNgOtn+wZ/L4JYe6bw/iYN 8vy8UwAAAB5IgAcAABiCkzt4jcsGXD/nbPD3fnyK7zGCPE+d4PNZxQMAAEsI8AAAAENwUgevcfsc 1ON1U379fbk8e8zHvthpAAAABwnwAJO4o+Xnv0oVAwDFKR28xucHWjcbXdkS6dHu68H73ZXLpWM8 7qJU7cUEAAAkAR5gMjFAMEoe9cU02oa+f6SKAYDiOFUwsT6loHvtmI87xdcIAAAVAR5gUm9f4//u T1Wu9b/PZW8uN6UqIPR3qVr9s94M0g+rXgCg2NHBa+yb8Tq8rkfvJep65xiPO9epAAAAFcvbgUld ksv5y/7tQKoCOBHM2Z3LDbl8JZe7czk0l4fmcmIu23J5QqrSihy2wnNfp3oBABqzp2fv5+dyOWfE x+wo/dj7fJ0AAMw7AR5gUremaq+c08rf783llvJvf5rLX+VyYy53pirwsymXw1OVZuWbctleSgR7 jir/H87WcQcAmGmxiif24hl1dVakafu06gMAYN4J8ABNeH4ut6UquBMrdt6by/vLz/cu+93Yg+ee VAV9onwil8/k8sO5PCOXY1K18ucS1QoAdOjmOfiMZ+ayq2fv6bw0eoDnjCTAAwAA9uABGhGzL2PA 4MZc3pnLb+by2fTg4M5KvpzLu3P59dJRvyuX5ySrdwCAB4q9/P4hVRNFDrTw/JcNuG7u2eDvndnD 937DGI95ndMBAACs4AGa8/upStcWs19jv51RBl5iUOIPcnlILv819S8/PAAwfb+Sy2NzeUopx+dy ZDqY3nWe7d/g752Qy0k9a2vF6u5R07SdkOzDAwAAAjxAo65O1crAcWbVRpDnt3O5XzUCACuIFcIP TVWA4ttyeV6q0rvGBJFDVc8D9kRcS6y2flaqAit9ESu5R03T9ohUTS4CAIC5JcAzod1796oEeKBJ UqYI7gAAq4nUr18u5f/m8te5/FAuz83lUUn66XekjQV44ndencvFPXrv147xmJOTAA8AAHNOgAcA ABia2P/vo7ncmarAznfn8rA03+nado3wuxeVP/sS5Ll9jMecNOJnBgCAmSPAAwAADFGs6In0sMfm clyq0rZtmeD5jht4fdyQqr0QT9jg79dBnkiRO+10beO8/ilOAQAA5t0hqgAAABioCPJ8LFUrOb6S JgtU7Bh4XcRnf/OIj4kgz3tTP1Y+7Rzx949z+AMAMO8EeAAAgCGLdG0R5PlcqgI+8+ySMR4Tga0r 0/DS2+1w6AMAMO8EeAAAgKH7m1z25HL3hM8z9D187svl2WM87rRcXj3l9/4lhzEAAIxGgAcAABi6 r+ZySy77J3yeY2egLnblcukYj5v2njYfdxgDAMBoBHgAAIChi5Ur/5jLPWmyfXi2zEh9vDyXm0d8 zHUOIwAAGBYBHgAAYFYsTvj4k2ekHu4rn2WUIM8lDh8AABgWAR4AAGDoNudydC6Hp8n20XnmDNVJ pKuLIM9G0rVtS1VQCAAAGBABHgAAYOi25nJ8mjzF2vfOWL1EkOcluTw7l6tW+P+duRyVy54evNdn OowBAGA0m1UBAAAwcLFS5Qlp8gDPaalaAbQ4Y/WzK5fTS/0cUf7tjtSvVTuPdhgDAMBoBHgAAIAh OyZVgZknpipF26Qi0HDrjNbV/lL66LgRf/8qhz4AAPNOijYAAGCoYsLaN6cqBVkEZjY18JzPV61T sWPE379GlQEAMO8EeAAAgCGK4M4pufxgLk9Pk6dnq71K1XZunO/uOtUGAIBOEQAAwLBEWrYI7rwi lzNyeXhqZvVOiHRvEXDYr5o785gxHrNHtQEAMO+s4AEAAIYkAjkvzuX1uZyZquDAoQ2/xhmquVPb x3jMtaoNAIB5J8ADAAAMyWKqVu98T6r23Tm0hdd4o2ru1Dhp8W5XbQAAzDsBHgAAYGh+L5ejU3Np 2ZaLNG1bVXMntpT6HsWlqQr0AQDAXBPgAQAAhqaL9FwvVs2dGCcd3ntUGwAACPAAAADDE6s3zmv5 NS7KZbOqbt046fA+odoAAECABwAAGKa3d/AaL1DNrTopjZ6e7eZcblV1AAAgwAMAAAzTvlTtxdKm C1N7+/yQ0k+M8Zg3qzYAAKgI8AAAAEPVdpq2E3J5oWpuxdZczhnjce9SdQAAUBHgAQAAhmpPLle1 /BofSPbiacNvjfGYnbnsV3UAAFAR4AEAAIbslR28xk+r5kY9PZcdYzzubaoOAAAOEuABAACGLFbx 7Gz5Nc5PVUoxJheroS4f43FXle8aAAAoBHgAAICh+7kOXuODuWxS1RP71VTtbTSqV6o6AAB4IAEe AABg6PblcnbLr3FaLi9U1ROJ1GznjPG4WKFl9Q4AACyzaXFxUS0AAEBHti0sqISW+ja53JTGWx0y ioekKqDEaLbkcpc6Z8h2792rEgCAXrGCBwAAmAUxc+1bO3idzySp2kYVwZ3rx3zsi5LgDgAArEiA BwAAmBW35nJey68RK4Teqqo3LIJh70zjray6KpffV4UAALAyAR4AAGCWXJCqwECbYh+ZM1X1uiK4 895cdoz5+OenamUWAACwAgEeAABglkRA4Ls6eJ0P5HKS6l7VpMGdZyep2QAAYE0CPAAAwKzZn8u2 Dl5nd6r2l+GBJg3uRJq9XaoRAADWJsADAADMoj25nN3B61yfBHmWirq4KY0f3Lk0VWn2AACAdQjw AAAAs+riVK0GadMJSZCndlypixPGfPzNubwy2XcHAAA2RIAHAACYZbEa5NKWX0OQJ6XtuXwxTRbc OTlV6fUAAIANEOABAABmWawGeWkS5GnL5lwuzOWKCZ5DcAcAAMZsjAMAAMyyOsgTdrT4OnWQ56m5 7JuDeo2UbFen8VftBMEdAAAY06bFRemNAQCA2bdtYWFT/uO9qd0gz7+8XC57ZrUfmcubcjl/wuf5 5+DO7r17BXcAAGAMUrQBAABzYffevV2la/vnl8vlNakKhsySp+dyUxLcAQCAqRPgAQAA5kkd5NnZ wWtdlKoVQ7OwL8/WVO2186k0WUq2EAG2EwV3AABgMgI8AADAvIkgz0/mcnYHrxXp4O7KZftA6yr2 bY2VSLflck4Dzxd1/tKymgoAAJiAPXgAAIC5sW1hYfk/RcqxT3X08rFy5bW57BtAVUVg56xUrUJq yqm79+79tKMQAACaYQUPAAAwzyLg8JBU7QnTtljNEythzk1VAKWPtpb3d29qLrhzVS5HlboGAAAa IsADAADMu1hRc2LqZl+ecH6qAiiR+mxrDz5/BJtiJdPHUhWAOr/B535RLs/KxX47AADQMAEeAACA g/vynDriYw6UMk7u61ghEwGV96UqwLKpw89bB3XitSPYFGnqTmvw+WPVTqyMumzMugEAANYhwAMA AHBQpBGLdGJrreb5Wi635PLxXD6cy5/n8vlUrVIZJ5gRqdsiwBKBogtTFXjZ0vDnioDOSbmcmaqV OnVQZ0fDrxOp7p6dy+lpGHsNAQDAYG1aXDSZCgAAmA/bFhZG+fUItFyeywlL/u3OVAVI3p3LJ8vf I3jylFxelstzc3l4am41TgSadqVqpc+15d/uSQ9OeRbv4ejycwSHTk5VQOeUVAV1Tuiges/O5ZJc 7lvtF3bv3esgBACAhgjwAAAAc2PEAM8/95lyeXWq0qnFqpddubw5l8/kckc6uGLnyFTt4/OmXF6Y y7FzVK3n5fLLaY3ATk2ABwAAmiNFGwAAwOoigHNxLofl8spUrVCJlTT/lA7uvRMlVtTszuUduexJ Gwh2zIBYsRPp7N4yJ58XAAB6ZbMqAAAAWFcEMN6TDqZeWykVwv25XJPL9alK2TaL/a3YYydWMF2S BHUAAGCqBHgAAAA2br0c13fl8tVUpXObJVfl8uOpWr0kzzcAAPSAAA8AAEBzIg32llwOnYHPUq/W eX8u+3y1AADQLwI8AAAAzTkyl7tzOXzAn+G8XC7N5YZktQ4AAPTWIaoAAACgMXfmck4uW3M5NZed A3jPsVLn7FyOL33Et+SyJwnuAABAr21aXNRmBwAA5sO2hYVpvXQEfJ6Wy5mlnDDFaoiAzttz+XAu n81lf1cvvHvvXgchAAA0RIAHAACYG1MM8CwX6bIfkcvJuTwzl0endgI/kWrt07l8PJfrc/lKLvdN 60ML8AAAQHMEeAAAgLnRowDPWiL4c3T5+eG5bPRNR/Tkq+Xn21MPU6wJ8AAAQHMEeAAAAAAAAAbm EFUAAAAAAAAwLAI8AAAAAAAAAyPAAwAAAAAAMDACPAAAAAAAAAMjwAMAAAAAADAwAjwAAAAAAAAD I8ADAAAAAAAwMAI8AAAAAAAAAyPAAwAAAAAAMDACPAAAAAAAAAMjwAMAAAAAADAwAjwAAAAAAAAD I8ADAAAAAAAwMAI8AAAAAAAAAyPAAwAAAAAAMDACPAAAAAAAAAMjwAMAAAAAADAwAjwAAAAAAAAD I8ADAAAAAAAwMAI8AAAAAAAAAyPAAwAAAAAAMDACPAAAAAAAAAMjwAMAAAAAADAwAjwAAAAAAAAD I8ADAAAAAAAwMAI8AAAAAAAAAyPAAwAAAAAAMDACPAAAAAAAAAMjwAMAAAAAADAwAjwAAAAAAAAD I8ADAAAAAAAwMAI8AAAAAAAAAyPAAwAAAAAAMDACPAAAAAAAAAMjwAMAAAAAADAwAjwAAAAAAAAD I8ADAAAAAAAwMAI8AAAAAAAAAyPAAwAAAAAAMDACPAAAAAAAAAMjwAMAAAAAADAwAjwAAAAAAAAD I8ADAAAAAAAwMAI8AAAAAAAAAyPAAwAAAAAAMDACPAAAAAAAAAMjwAMAAAAAADAwAjwAAAAAAAAD I8ADAAAAAAAwMAI8AAAAAAAAAyPAAwAAAAAAMDACPAAAAAAAAAMjwAMAAAAAADAwAjwAAAAAAAAD I8ADAAAAAAAwMP9fgAEAV1rYK9/gxw8AAAAASUVORK5CYII= "
       preserveAspectRatio="none"
       height="432"
       width="1656" />
  </g>
</svg>
