<?xml version="1.0" encoding="UTF-8" standalone="no"?>
<!-- Created with Inkscape (http://www.inkscape.org/) -->

<svg
   xmlns:dc="http://purl.org/dc/elements/1.1/"
   xmlns:cc="http://creativecommons.org/ns#"
   xmlns:rdf="http://www.w3.org/1999/02/22-rdf-syntax-ns#"
   xmlns:svg="http://www.w3.org/2000/svg"
   xmlns="http://www.w3.org/2000/svg"
   xmlns:xlink="http://www.w3.org/1999/xlink"
   xmlns:sodipodi="http://sodipodi.sourceforge.net/DTD/sodipodi-0.dtd"
   xmlns:inkscape="http://www.inkscape.org/namespaces/inkscape"
   id="svg2"
   version="1.1"
   inkscape:version="0.92.4 5da689c313, 2019-01-14"
   width="2481"
   height="3503"
   sodipodi:docname="E29P04.svg">
  <metadata
     id="metadata8">
    <rdf:RDF>
      <cc:Work
         rdf:about="">
        <dc:format>image/svg+xml</dc:format>
        <dc:type
           rdf:resource="http://purl.org/dc/dcmitype/StillImage" />
        <dc:title />
      </cc:Work>
    </rdf:RDF>
  </metadata>
  <defs
     id="defs6">
    <filter
       style="color-interpolation-filters:sRGB"
       id="filter4375-4-1-1-1-9"
       inkscape:label="deevad outline effect">
      <feFlood
         id="feFlood4377-7-9-0-8-1"
         flood-opacity="1"
         flood-color="rgb(0,0,0)"
         result="flood" />
      <feComposite
         id="feComposite4379-3-8-8-2-77"
         in2="SourceGraphic"
         in="flood"
         operator="in"
         result="composite1" />
      <feMorphology
         id="feMorphology4393-1-0-49-8-9"
         operator="dilate"
         radius="3.5"
         result="result3" />
      <feComposite
         id="feComposite4385-9-5-7-0-8"
         in2="result3"
         in="SourceGraphic"
         operator="over"
         result="composite2" />
    </filter>
  </defs>
  <sodipodi:namedview
     pagecolor="#ffffff"
     bordercolor="#666666"
     borderopacity="1"
     objecttolerance="10"
     gridtolerance="10"
     guidetolerance="10"
     inkscape:pageopacity="0"
     inkscape:pageshadow="2"
     inkscape:window-width="1920"
     inkscape:window-height="1000"
     id="namedview4"
     showgrid="false"
     inkscape:zoom="0.47935747"
     inkscape:cx="1040.1657"
     inkscape:cy="2296.3519"
     inkscape:window-x="0"
     inkscape:window-y="45"
     inkscape:window-maximized="1"
     inkscape:current-layer="layer3"
     inkscape:snap-global="false" />
  <g
     inkscape:groupmode="layer"
     id="layer2"
     inkscape:label="artwork"
     sodipodi:insensitive="true">
    <image
       sodipodi:absref="/home/midgard/git/peppercarrot/comics/ep29_Destroyer-of-Worlds/lang/kr/../gfx_Pepper-and-Carrot_by-David-Revoy_E29P04.png"
       xlink:href="../gfx_Pepper-and-Carrot_by-David-Revoy_E29P04.png"
       width="2481"
       height="3503"
       id="image10"
       x="0"
       y="0" />
  </g>
  <g
     inkscape:groupmode="layer"
     id="layer3"
     inkscape:label="speechbubbles">
    <path
       style="color:#000000;display:inline;overflow:visible;visibility:visible;fill:#ffffff;fill-opacity:1;fill-rule:nonzero;stroke:none;stroke-width:0.99999994px;marker:none;enable-background:accumulate"
       d="m 1747.0092,129.9164 c 33.7996,-18.8721 474.1459,-30.509914 535.2312,10.2865 38.7625,25.88785 23.5955,123.78943 -25.8983,142.54889 -58.249,22.0779 -383.8083,16.09462 -465.6866,3.78839 -77.8988,-11.70814 -80.7765,-51.8108 -84.7052,-90.76835 -1.6034,-15.90016 7.2592,-46.98327 41.0589,-65.85543 z"
       id="path4040-4-0"
       inkscape:connector-curvature="0"
       sodipodi:nodetypes="zssssz" />
    <path
       style="fill:#ffffff;stroke:none"
       d="m 2131.7915,445.1527 c 52.0797,-62.97217 40.5599,-106.89763 -10.3849,-161.57773 -30.8676,-33.13074 -53.0957,-49.56362 -53.0957,-49.56362 l 44.4365,-11.17106 49.9606,31.26438 c 0,0 89.2487,110.10775 -30.9165,191.04803 z"
       id="path3063"
       inkscape:connector-curvature="0"
       sodipodi:nodetypes="cscccc" />
    <path
       style="color:#000000;display:inline;overflow:visible;visibility:visible;fill:#ffffff;fill-opacity:1;fill-rule:nonzero;stroke:none;stroke-width:0.84346205px;marker:none;enable-background:accumulate"
       d="m 1747.6903,968.65934 c 1.2007,-25.92602 -3.3064,-56.51406 28.6795,-96.78382 22.7724,-28.67018 48.8495,-28.75906 144.6068,-30.72216 88.3426,-4.0937 165.0854,50.91259 140.2517,144.61398 -2.7247,75.91306 -112.7368,68.73446 -135.7261,71.85106 -22.9893,3.1166 -133.2207,2.2091 -155.0062,-22.2852 -13.6373,-15.3326 -22.687,-34.9779 -22.8057,-66.67386 z"
       id="path4546-6"
       inkscape:connector-curvature="0"
       sodipodi:nodetypes="csccssc" />
    <path
       style="color:#000000;display:inline;overflow:visible;visibility:visible;fill:#ffffff;fill-opacity:1;fill-rule:nonzero;stroke:none;stroke-width:1px;marker:none;enable-background:accumulate"
       d="m 2058.949,780.54364 c 9.1284,42.15323 9.9229,57.84514 -32.0252,91.28724 -41.9482,33.44204 -30.1382,47.46229 -30.1382,47.46229 l 35.2785,-4.99268 c 0,0 84.878,-77.03313 26.8849,-133.75685 z"
       id="path3072"
       inkscape:connector-curvature="0" />
    <path
       style="color:#000000;display:inline;overflow:visible;visibility:visible;fill:#ffffff;fill-opacity:1;fill-rule:nonzero;stroke:none;stroke-width:0.87356722px;marker:none;enable-background:accumulate"
       d="m 752.01233,211.31343 c 21.21638,-30.65268 200.30697,-63.92431 263.25087,-0.75556 62.944,63.16876 24.7648,138.97133 -11.3506,163.09025 -36.11532,24.11902 -142.39762,50.53504 -190.8953,29.86163 -48.49779,-20.67342 -86.27446,-51.57616 -88.74059,-114.8523 -1.00651,-25.82553 6.51914,-46.69124 27.73562,-77.34402 z"
       id="path4040"
       inkscape:connector-curvature="0"
       sodipodi:nodetypes="zssssz" />
    <path
       style="color:#000000;display:inline;overflow:visible;visibility:visible;fill:#ffffff;fill-opacity:1;fill-rule:nonzero;stroke:none;stroke-width:1px;marker:none;enable-background:accumulate"
       d="m 927.43282,520.21555 c 19.56717,-37.91334 24.33095,-91.92051 -16.62461,-116.94423 -32.00795,-36.20829 -9.67863,-17.32971 -9.67863,-17.32971 l 32.39871,9.54307 c 0,0 63.63839,61.67926 -6.09547,124.73087 z"
       id="path3072-1"
       inkscape:connector-curvature="0"
       sodipodi:nodetypes="ccccc" />
    <path
       style="fill:#ffffff;fill-opacity:1;fill-rule:evenodd;stroke:none;stroke-width:0.91376573px;stroke-linecap:butt;stroke-linejoin:miter;stroke-opacity:1"
       d="m 473.16411,429.00909 c -9.8379,3.45864 -21.72443,-0.74899 -28.86991,-8.15263 -5.9122,-6.68721 -14.20342,-13.3491 -14.80014,-21.98808 -0.65625,-9.91947 4.96388,-20.77271 -3.10014,-30.02739 -11.24065,-8.53432 -17.9652,-13.91901 -18.31389,-27.44905 -0.41296,-11.53162 4.65816,-22.67415 11.11041,-30.91503 5.39738,-5.69346 2.69848,-13.76292 -1.75269,-19.92549 -4.67902,-9.86661 -8.09617,-22.86862 0.62823,-30.68782 5.65726,-3.72535 11.83997,-5.01355 12.36613,-12.81183 1.46062,-10.85262 -5.15803,-20.78415 -6.25872,-31.53175 -5.31273,-10.72007 -2.3511,-39.81777 3.31629,-48.54931 4.21445,-6.06044 7.92318,-13.78623 17.66939,-13.93988 16.51715,-4.26035 39.35932,-2.23397 48.45994,-14.54687 5.95024,-6.99684 9.7372,-17.02823 20.90649,-18.85348 13.00665,-2.47843 25.78002,10.42367 37.63845,15.18682 11.56496,-10.36049 32.41565,-8.81162 38.7135,1.57953 3.49121,5.86329 19.62891,31.58085 20.54344,38.10889 3.40378,13.01954 -7.06638,35.1769 2.51005,46.49479 10.20251,8.19818 5.86518,27.91799 3.73257,38.44049 -3.05929,8.3406 1.81101,17.01373 2.94865,25.64816 1.99934,9.20505 -4.35455,19.20189 -2.80597,28.40299 4.36878,13.78778 9.2716,26.16521 5.10064,40.43019 -1.62051,12.46165 -2.828,17.57342 -13.52577,24.41239 -3.49818,3.06174 -5.44215,8.81564 -6.37321,13.5487 -3.24986,11.6257 -5.98264,17.31781 -14.27979,27.30395 -7.16003,7.39843 -20.27382,9.1082 -31.23953,5.25094 -8.50672,-1.82229 -17.84459,-8.10109 -26.10916,-5.67643 -10.67481,5.27537 -13.53996,22.49725 -27.41188,20.94606 -7.40907,-0.86603 -12.87807,-6.38555 -20.08265,-7.97123 -3.51926,-1.11979 -7.10829,-2.00888 -10.7206,-2.72723 z"
       id="path4367"
       inkscape:connector-curvature="0"
       sodipodi:nodetypes="ccccccccccccccccccccccccccccccc" />
    <path
       style="fill:#ffffff;stroke:none;stroke-width:1"
       d="m 481.33413,569.27983 c -26.16799,-11.86997 -29.23382,-39.59074 -20.73941,-48.80022 8.49436,-9.2095 12.7305,-19.1347 12.40759,-27.59531 -0.32293,-8.46061 -5.50646,-17.21425 -10.12026,-24.21281 -4.61385,-6.99861 0.88784,-16.71803 5.41776,-24.19003 4.52995,-7.47208 25.74725,-46.21168 25.74725,-46.21168 0,0 -33.81232,12.14437 -40.8764,20.86652 -7.0641,8.72215 -8.88284,16.10827 -10.78771,20.43039 -1.90487,4.32223 -5.43175,20.28888 -2.44001,28.74234 2.99167,8.45347 10.76629,15.12526 14.36709,20.98686 3.60084,5.86151 2.03948,12.29665 -2.9751,20.77153 -5.01458,8.47491 -9.53561,29.71668 2.24235,44.7525 6.98238,8.91376 16.67122,13.76389 27.75685,14.45991 z"
       id="path3023"
       inkscape:connector-curvature="0"
       sodipodi:nodetypes="csssscssssssc"
       inkscape:transform-center-x="-13.368944"
       inkscape:transform-center-y="102.37524" />
    <path
       style="fill:#ffffff;fill-opacity:1;fill-rule:evenodd;stroke:none;stroke-width:1px;stroke-linecap:butt;stroke-linejoin:miter;stroke-opacity:1"
       d="m 150.66487,254.89791 c -5.79206,-8.3218 1.39884,-18.7638 7.13211,-22.4599 6.42753,-6.8744 14.68565,-6.8194 22.40363,-6.3027 7.67766,1.352 13.30603,-5.27 18.29141,-12.1154 7.89065,-8.8817 19.3479,-11.9296 28.65929,-5.4527 6.92028,4.415 14.92276,9.8428 22.50809,4.778 9.04582,-5.1258 20.56004,-9.611 29.29148,-1.1515 6.21125,9.8244 16.52363,5.6471 24.12218,1.7701 9.75981,-4.5481 20.44142,-7.3093 30.52218,-2.8986 6.68399,2.5816 14.9733,3.8416 18.27081,13.568 3.98009,10.6522 8.26193,23.368 17.58319,26.5604 6.59787,2.7568 16.08895,4.4272 17.74994,15.516 -0.19334,9.8954 -3.68675,19.6529 -6.86389,28.2714 -9.39343,11.1665 -23.80101,2.5793 -35.73026,5.6713 -7.8,1.9912 -14.19832,13.88684 -27.23653,15.42663 -18.05433,2.57938 -21.72666,-7.09909 -32.68569,-2.35549 -12.92394,4.4331 -16.45515,-0.91191 -28.70038,7.06989 -13.94377,7.417 -30.3487,5.0132 -42.5837,-6.9075 -5.25111,-5.9244 -17.54194,2.19307 -24.22848,3.32597 -8.93158,0.3998 -13.51391,2.3025 -20.11112,-7.8758 -5.28858,-7.2593 -3.86593,-4.964 -7.3887,-13.0375 -3.68296,-7.9711 -12.23691,-9.7059 -14.80815,-19.1363 -1.96953,-7.794 4.86047,-14.1129 3.80259,-22.2643 z"
       id="path4367-3"
       inkscape:connector-curvature="0"
       sodipodi:nodetypes="ccccccccccccccccccccccc" />
    <path
       style="opacity:1;fill:#ffffff;fill-rule:evenodd;stroke:none;stroke-width:0.99999994px;stroke-linecap:butt;stroke-linejoin:miter;stroke-opacity:1"
       d="m 309.34922,457.71798 c -15.64979,-24.8542 8.77501,-47.91607 8.58626,-62.92677 -0.19481,-15.49635 -40.69805,-21.31418 -41.62679,-35.6781 -0.92874,-14.36402 24.25197,-42.90833 22.3945,-65.352 -1.85748,-22.44378 -33.11728,-22.62637 -30.33094,3.4084 2.78634,26.03475 -20.58525,41.20496 -15.67743,61.79602 8.18516,34.34048 37.35935,31.20382 47.00302,40.86297 6.38476,6.395 -4.2802,22.87728 -1.49386,38.139 2.78634,15.26172 11.14524,19.75048 11.14524,19.75048 z"
       id="path4272"
       inkscape:connector-curvature="0"
       sodipodi:nodetypes="csssssssc" />
    <path
       style="color:#000000;display:inline;overflow:visible;visibility:visible;fill:#ffffff;fill-opacity:1;fill-rule:nonzero;stroke:none;stroke-width:0.85978276px;marker:none;enable-background:accumulate"
       d="m 2028.885,977.5624 c -0.8867,-19.90684 12.6223,-49.7875 38.1428,-62.16141 37.9086,-18.38045 56.7253,-10.91813 88.7912,-10.07251 29.7871,0.78553 77.4598,7.06311 102.4868,29.20545 19.3616,17.12991 31.2718,43.90764 26.8377,64.81982 -4.4338,20.91215 -16.7847,49.05115 -49.9631,54.81995 -35.5841,6.1871 -94.9067,0.9485 -128.8253,2.0701 -30.3361,1.0031 -48.7741,-6.1507 -64.7365,-20.9122 -16.1825,-14.9653 -11.8466,-37.86244 -12.7336,-57.7692 z"
       id="path3373"
       inkscape:connector-curvature="0"
       sodipodi:nodetypes="zsssssssz" />
    <path
       style="fill:#ffffff;fill-rule:evenodd;stroke:none;stroke-width:0.96557015px;stroke-linecap:butt;stroke-linejoin:miter;stroke-opacity:1"
       d="m 912.85591,1223.5898 c 33.05348,3.4907 81.45468,-13.0192 54.73235,-65.5744 52.72544,26.313 95.92164,45.8066 178.76714,-27.7326 -7.0112,81.4659 30.6987,73.8546 64.6951,58.2141 -32.6271,27.4139 25.9397,43.1229 57.4434,44.6628 -66.6431,59.2943 -30.7387,67.3435 -0.8424,76.7065 -60.0388,-3.5532 -54.2003,32.0871 -42.02,52.0996 -56.1841,-42.8941 -135.2307,-17.5824 -126.5953,12.5816 -25.0657,-17.3709 -44.9126,-64.3702 -107.14972,4.554 22.88622,-59.5014 -7.11249,-53.2559 -55.68068,-23.9247 7.61168,-20.2671 52.85143,-51.086 -23.34989,-47.8499 47.59672,-19.2669 57.578,-45.3663 0,-83.737 z"
       id="path4584"
       inkscape:connector-curvature="0"
       sodipodi:nodetypes="cccccccccccc" />
    <path
       style="color:#000000;display:inline;overflow:visible;visibility:visible;fill:#ffffff;fill-opacity:1;fill-rule:nonzero;stroke:none;stroke-width:1px;marker:none;enable-background:accumulate"
       d="m 1284.4552,1484.7539 c -74.0623,-16.7815 -162.4554,-85.4407 -173.3256,-102.2336 5.7646,-4.0191 72.5018,-4.3109 72.5018,-4.3109 -25.8476,-20.7242 -129.727,-70.2911 -122.0213,-64.8466 -4.5243,-14.4638 68.3453,-13.6441 68.3453,-13.6441 0,0 96.3576,81.9196 112.2383,92.2829 -16.3671,10.5299 -65.2194,8.0221 -73.0419,9.9521 2.0894,11.1694 89.3696,76.2156 115.3034,82.8002 z"
       id="path4456"
       inkscape:connector-curvature="0"
       sodipodi:nodetypes="cccccccc" />
  </g>
  <g
     inkscape:groupmode="layer"
     id="layer1"
     inkscape:label="txt">
    <text
       id="text906"
       y="282.38531"
       x="264.11996"
       style="font-style:normal;font-variant:normal;font-weight:normal;font-stretch:normal;font-size:15.95719433px;line-height:100%;font-family:'Nanum Pen Script OTF';-inkscape-font-specification:'Nanum Pen Script OTF';text-align:center;letter-spacing:0px;word-spacing:0px;text-anchor:middle;fill:#000000;fill-opacity:1;stroke:none;stroke-width:1.32976615"
       xml:space="preserve"><tspan
         id="tspan904"
         y="282.38531"
         x="264.11996"
         style="font-style:normal;font-variant:normal;font-weight:normal;font-stretch:normal;font-size:49.64460373px;line-height:100%;font-family:'Nanum Pen Script OTF';-inkscape-font-specification:'Nanum Pen Script OTF';stroke-width:1.32976615"
         sodipodi:role="line">어우 더러워!</tspan></text>
    <text
       id="text918"
       y="204.43744"
       x="518.039"
       style="font-style:normal;font-variant:normal;font-weight:normal;font-stretch:normal;font-size:14.79923534px;line-height:100%;font-family:'Nanum Pen Script OTF';-inkscape-font-specification:'Nanum Pen Script OTF';text-align:center;letter-spacing:0px;word-spacing:0px;text-anchor:middle;fill:#000000;fill-opacity:1;stroke:none;stroke-width:1.23326957"
       xml:space="preserve"><tspan
         id="tspan916"
         y="204.43744"
         x="518.039"
         style="font-style:normal;font-variant:normal;font-weight:normal;font-stretch:normal;font-size:46.04206467px;line-height:100%;font-family:'Nanum Pen Script OTF';-inkscape-font-specification:'Nanum Pen Script OTF';stroke-width:1.23326957"
         sodipodi:role="line">으으으!</tspan><tspan
         y="250.47951"
         x="518.039"
         style="font-style:normal;font-variant:normal;font-weight:normal;font-stretch:normal;font-size:46.04206467px;line-height:100%;font-family:'Nanum Pen Script OTF';-inkscape-font-specification:'Nanum Pen Script OTF';stroke-width:1.23326957"
         sodipodi:role="line"
         id="tspan999">저거</tspan><tspan
         y="296.52158"
         x="518.039"
         style="font-style:normal;font-variant:normal;font-weight:normal;font-stretch:normal;font-size:46.04206467px;line-height:100%;font-family:'Nanum Pen Script OTF';-inkscape-font-specification:'Nanum Pen Script OTF';stroke-width:1.23326957"
         sodipodi:role="line"
         id="tspan1003">누구 입에</tspan><tspan
         y="342.56363"
         x="518.039"
         style="font-style:normal;font-variant:normal;font-weight:normal;font-stretch:normal;font-size:46.04206467px;line-height:100%;font-family:'Nanum Pen Script OTF';-inkscape-font-specification:'Nanum Pen Script OTF';stroke-width:1.23326957"
         sodipodi:role="line"
         id="tspan1009">들어갔던</tspan><tspan
         y="388.60571"
         x="518.039"
         style="font-style:normal;font-variant:normal;font-weight:normal;font-stretch:normal;font-size:46.04206467px;line-height:100%;font-family:'Nanum Pen Script OTF';-inkscape-font-specification:'Nanum Pen Script OTF';stroke-width:1.23326957"
         sodipodi:role="line"
         id="tspan1011">거잖아!</tspan></text>
    <text
       id="text929"
       y="252.51094"
       x="886.30286"
       style="font-style:normal;font-variant:normal;font-weight:normal;font-stretch:normal;font-size:14.96791458px;line-height:100%;font-family:'Nanum Pen Script OTF';-inkscape-font-specification:'Nanum Pen Script OTF';text-align:center;letter-spacing:0px;word-spacing:0px;text-anchor:middle;fill:#000000;fill-opacity:1;stroke:none;stroke-width:1.24732614"
       xml:space="preserve"><tspan
         id="tspan927"
         y="252.51094"
         x="886.30286"
         style="font-style:normal;font-variant:normal;font-weight:normal;font-stretch:normal;font-size:56.12967682px;line-height:100%;font-family:'Nanum Pen Script OTF';-inkscape-font-specification:'Nanum Pen Script OTF';stroke-width:1.24732614"
         sodipodi:role="line">하하,</tspan><tspan
         y="308.64062"
         x="886.30286"
         style="font-style:normal;font-variant:normal;font-weight:normal;font-stretch:normal;font-size:56.12967682px;line-height:100%;font-family:'Nanum Pen Script OTF';-inkscape-font-specification:'Nanum Pen Script OTF';stroke-width:1.24732614"
         sodipodi:role="line"
         id="tspan1049">역시 대단해,</tspan><tspan
         y="364.77032"
         x="886.30286"
         style="font-style:normal;font-variant:normal;font-weight:normal;font-stretch:normal;font-size:56.12967682px;line-height:100%;font-family:'Nanum Pen Script OTF';-inkscape-font-specification:'Nanum Pen Script OTF';stroke-width:1.24732614"
         sodipodi:role="line"
         id="tspan1053">후추!</tspan></text>
    <text
       id="text935"
       y="195.99495"
       x="2005.0779"
       style="font-style:normal;font-variant:normal;font-weight:normal;font-stretch:normal;font-size:14.46408272px;line-height:100%;font-family:'Nanum Pen Script OTF';-inkscape-font-specification:'Nanum Pen Script OTF';text-align:center;letter-spacing:0px;word-spacing:0px;text-anchor:middle;fill:#000000;fill-opacity:1;stroke:none;stroke-width:1.20534027"
       xml:space="preserve"><tspan
         id="tspan933"
         y="195.99495"
         x="2005.0779"
         style="font-style:normal;font-variant:normal;font-weight:normal;font-stretch:normal;font-size:54.24031067px;line-height:100%;font-family:'Nanum Pen Script OTF';-inkscape-font-specification:'Nanum Pen Script OTF';stroke-width:1.20534027"
         sodipodi:role="line">그래 후추야, 네가 해준 &quot;설명&quot;...</tspan><tspan
         y="250.23526"
         x="2005.0779"
         style="font-style:normal;font-variant:normal;font-weight:normal;font-stretch:normal;font-size:54.24031067px;line-height:100%;font-family:'Nanum Pen Script OTF';-inkscape-font-specification:'Nanum Pen Script OTF';stroke-width:1.20534027"
         sodipodi:role="line"
         id="tspan1036">잘 들었어.</tspan></text>
    <text
       id="text943"
       y="907.98749"
       x="1907.5537"
       style="font-style:normal;font-variant:normal;font-weight:normal;font-stretch:normal;font-size:15.01506233px;line-height:100%;font-family:'Nanum Pen Script OTF';-inkscape-font-specification:'Nanum Pen Script OTF';text-align:center;letter-spacing:0px;word-spacing:0px;text-anchor:middle;fill:#000000;fill-opacity:1;stroke:none;stroke-width:1.25125515"
       xml:space="preserve"><tspan
         id="tspan941"
         y="907.98749"
         x="1907.5537"
         style="font-style:normal;font-variant:normal;font-weight:normal;font-stretch:normal;font-size:56.30648422px;line-height:100%;font-family:'Nanum Pen Script OTF';-inkscape-font-specification:'Nanum Pen Script OTF';stroke-width:1.25125515"
         sodipodi:role="line">이제</tspan><tspan
         y="964.29395"
         x="1907.5537"
         style="font-style:normal;font-variant:normal;font-weight:normal;font-stretch:normal;font-size:56.30648422px;line-height:100%;font-family:'Nanum Pen Script OTF';-inkscape-font-specification:'Nanum Pen Script OTF';stroke-width:1.25125515"
         sodipodi:role="line"
         id="tspan1020">자러 가야지,</tspan><tspan
         y="1020.6004"
         x="1907.5537"
         style="font-style:normal;font-variant:normal;font-weight:normal;font-stretch:normal;font-size:56.30648422px;line-height:100%;font-family:'Nanum Pen Script OTF';-inkscape-font-specification:'Nanum Pen Script OTF';stroke-width:1.25125515"
         sodipodi:role="line"
         id="tspan1018">안 그래?</tspan></text>
    <text
       id="text951"
       y="975.80719"
       x="2155.0798"
       style="font-style:normal;font-variant:normal;font-weight:normal;font-stretch:normal;font-size:13.55473709px;line-height:100%;font-family:'Nanum Pen Script OTF';-inkscape-font-specification:'Nanum Pen Script OTF';text-align:center;letter-spacing:0px;word-spacing:0px;text-anchor:middle;fill:#000000;fill-opacity:1;stroke:none;stroke-width:1.27966881"
       xml:space="preserve"><tspan
         y="975.80719"
         x="2155.0798"
         style="font-style:normal;font-variant:normal;font-weight:normal;font-stretch:normal;font-size:47.77430344px;line-height:100%;font-family:'Nanum Pen Script OTF';-inkscape-font-specification:'Nanum Pen Script OTF';stroke-width:1.27966881"
         sodipodi:role="line"
         id="tspan1027">누구는 손도</tspan><tspan
         y="1023.5815"
         x="2155.0798"
         style="font-style:normal;font-variant:normal;font-weight:normal;font-stretch:normal;font-size:47.77430344px;line-height:100%;font-family:'Nanum Pen Script OTF';-inkscape-font-specification:'Nanum Pen Script OTF';stroke-width:1.27966881"
         sodipodi:role="line"
         id="tspan1031">씻어야 되고.</tspan></text>
    <text
       id="text957"
       y="1252.7968"
       x="1084.5341"
       style="font-style:normal;font-variant:normal;font-weight:normal;font-stretch:normal;font-size:15.66879177px;line-height:100%;font-family:'Nanum Pen Script OTF';-inkscape-font-specification:'Nanum Pen Script OTF';text-align:center;letter-spacing:0px;word-spacing:0px;text-anchor:middle;fill:#000000;fill-opacity:1;stroke:none;stroke-width:1.30573261"
       xml:space="preserve"><tspan
         id="tspan955"
         y="1252.7968"
         x="1084.5341"
         style="font-style:normal;font-variant:normal;font-weight:normal;font-stretch:normal;font-size:58.7579689px;line-height:100%;font-family:'Nanum Pen Script OTF';-inkscape-font-specification:'Nanum Pen Script OTF';stroke-width:1.30573261"
         sodipodi:role="line">얘들아!</tspan><tspan
         y="1311.5547"
         x="1084.5341"
         style="font-style:normal;font-variant:normal;font-weight:normal;font-stretch:normal;font-size:58.7579689px;line-height:100%;font-family:'Nanum Pen Script OTF';-inkscape-font-specification:'Nanum Pen Script OTF';stroke-width:1.30573261"
         sodipodi:role="line"
         id="tspan1057">기다려!</tspan></text>
    <text
       transform="matrix(0.79017753,-0.5292546,0.38466968,1.0078897,0,0)"
       id="text961"
       y="2199.2183"
       x="1387.7393"
       style="font-style:normal;font-variant:normal;font-weight:normal;font-stretch:normal;font-size:20.65113449px;line-height:100%;font-family:'Nanum Pen Script OTF';-inkscape-font-specification:'Nanum Pen Script OTF';text-align:center;letter-spacing:0px;word-spacing:0px;text-anchor:middle;fill:#ffffff;fill-opacity:0.78431373;stroke:none;stroke-width:1.41219187"
       xml:space="preserve"><tspan
         id="tspan959"
         y="2199.2183"
         x="1387.7393"
         style="font-style:normal;font-variant:normal;font-weight:normal;font-stretch:normal;font-size:82.60453796px;line-height:100%;font-family:'Nanum Pen Script OTF';-inkscape-font-specification:'Nanum Pen Script OTF';fill:#ffffff;fill-opacity:0.78431373;stroke-width:1.1588434"
         sodipodi:role="line">휙!</tspan></text>
    <text
       transform="matrix(0.80236382,-0.52121629,0.39060214,0.99258189,0,0)"
       id="text965"
       y="2446.7163"
       x="-536.17694"
       style="font-style:normal;font-variant:normal;font-weight:normal;font-stretch:normal;font-size:19.82090759px;line-height:100%;font-family:'Nanum Pen Script OTF';-inkscape-font-specification:'Nanum Pen Script OTF';text-align:center;letter-spacing:0px;word-spacing:0px;text-anchor:middle;fill:#ffffff;fill-opacity:0.78431373;stroke:none;stroke-width:1.68049228"
       xml:space="preserve"><tspan
         id="tspan963"
         y="2446.7163"
         x="-536.17694"
         style="font-style:normal;font-variant:normal;font-weight:normal;font-stretch:normal;font-size:79.28363037px;line-height:100%;font-family:'Nanum Pen Script OTF';-inkscape-font-specification:'Nanum Pen Script OTF';fill:#ffffff;fill-opacity:0.78431373;stroke-width:1.37901044"
         sodipodi:role="line">탁!</tspan></text>
    <text
       transform="matrix(0.80236382,-0.52121629,0.39060214,0.99258189,0,0)"
       id="text969"
       y="2541.8252"
       x="-362.77628"
       style="font-style:normal;font-variant:normal;font-weight:normal;font-stretch:normal;font-size:21.73858452px;line-height:100%;font-family:'Nanum Pen Script OTF';-inkscape-font-specification:'Nanum Pen Script OTF';text-align:center;letter-spacing:0px;word-spacing:0px;text-anchor:middle;fill:#ffffff;fill-opacity:0.78431373;stroke:none;stroke-width:1.84308028"
       xml:space="preserve"><tspan
         id="tspan967"
         y="2541.8252"
         x="-362.77628"
         style="font-style:normal;font-variant:normal;font-weight:normal;font-stretch:normal;font-size:86.95433807px;line-height:100%;font-family:'Nanum Pen Script OTF';-inkscape-font-specification:'Nanum Pen Script OTF';fill:#ffffff;fill-opacity:0.78431373;stroke-width:1.51243007"
         sodipodi:role="line">탁!</tspan></text>
    <text
       transform="matrix(1.6025472,-1.5865139,0.52876752,2.5230305,-891.84735,-102.49149)"
       id="text977"
       y="1584.5073"
       x="787.65729"
       style="font-style:normal;font-variant:normal;font-weight:normal;font-stretch:normal;line-height:100%;font-family:'Nanum Pen Script OTF';-inkscape-font-specification:'Nanum Pen Script OTF';letter-spacing:0px;word-spacing:0px;fill:#000000;fill-opacity:1;stroke:none;stroke-width:0;stroke-miterlimit:4;stroke-dasharray:none;stroke-opacity:1;filter:url(#filter4375-4-1-1-1-9)"
       xml:space="preserve"><tspan
         style="font-style:normal;font-variant:normal;font-weight:normal;font-stretch:normal;font-size:70px;line-height:100%;font-family:'Nanum Pen Script OTF';-inkscape-font-specification:'Nanum Pen Script OTF';fill:#ffffff;stroke:none;stroke-width:0;stroke-miterlimit:4;stroke-dasharray:none"
         y="1584.5073"
         x="787.65729"
         id="tspan975"
         sodipodi:role="line">팍!</tspan></text>
    <text
       transform="matrix(0.98943475,-0.09116349,0.01957156,1.0088748,0,0)"
       id="text981"
       y="2500.4126"
       x="1882.0327"
       style="font-style:normal;font-variant:normal;font-weight:normal;font-stretch:normal;font-size:25.90910912px;line-height:100%;font-family:'Nanum Pen Script OTF';-inkscape-font-specification:'Nanum Pen Script OTF';text-align:center;letter-spacing:0px;word-spacing:0px;text-anchor:middle;opacity:1;fill:#ffffff;fill-opacity:0.84180789;stroke:none;stroke-width:1.64477956"
       xml:space="preserve"><tspan
         id="tspan979"
         y="2500.4126"
         x="1882.0327"
         style="font-style:normal;font-variant:normal;font-weight:normal;font-stretch:normal;font-size:103.63643646px;line-height:100%;font-family:'Nanum Pen Script OTF';-inkscape-font-specification:'Nanum Pen Script OTF';fill:#ffffff;fill-opacity:0.84180789;stroke-width:1.34970462"
         sodipodi:role="line">?</tspan></text>
  </g>
</svg>
