<?xml version="1.0" encoding="UTF-8" standalone="no"?>
<!-- Created with Inkscape (http://www.inkscape.org/) -->

<svg
   xmlns:dc="http://purl.org/dc/elements/1.1/"
   xmlns:cc="http://creativecommons.org/ns#"
   xmlns:rdf="http://www.w3.org/1999/02/22-rdf-syntax-ns#"
   xmlns:svg="http://www.w3.org/2000/svg"
   xmlns="http://www.w3.org/2000/svg"
   xmlns:xlink="http://www.w3.org/1999/xlink"
   xmlns:sodipodi="http://sodipodi.sourceforge.net/DTD/sodipodi-0.dtd"
   xmlns:inkscape="http://www.inkscape.org/namespaces/inkscape"
   id="svg2"
   version="1.1"
   inkscape:version="0.91 r13725"
   width="2481"
   height="3503"
   sodipodi:docname="E27P02.svg">
  <metadata
     id="metadata8">
    <rdf:RDF>
      <cc:Work
         rdf:about="">
        <dc:format>image/svg+xml</dc:format>
        <dc:type
           rdf:resource="http://purl.org/dc/dcmitype/StillImage" />
        <dc:title />
      </cc:Work>
    </rdf:RDF>
  </metadata>
  <defs
     id="defs6" />
  <sodipodi:namedview
     pagecolor="#ffffff"
     bordercolor="#666666"
     borderopacity="1"
     objecttolerance="10"
     gridtolerance="10"
     guidetolerance="10"
     inkscape:pageopacity="0"
     inkscape:pageshadow="2"
     inkscape:window-width="1366"
     inkscape:window-height="715"
     id="namedview4"
     showgrid="false"
     inkscape:zoom="0.4574026"
     inkscape:cx="1187.3423"
     inkscape:cy="866.58456"
     inkscape:window-x="-8"
     inkscape:window-y="-8"
     inkscape:window-maximized="1"
     inkscape:current-layer="layer1"
     inkscape:snap-global="false" />
  <g
     inkscape:groupmode="layer"
     id="layer2"
     inkscape:label="artwork"
     sodipodi:insensitive="true">
    <image
       sodipodi:absref="D:\Pepper&amp;Carrot translation\ep27_Coriander-s-Invention_lang-pack\lang\cn\..\gfx_Pepper-and-Carrot_by-David-Revoy_E27P02.png"
       xlink:href="../gfx_Pepper-and-Carrot_by-David-Revoy_E27P02.png"
       width="2481"
       height="3503"
       id="image10"
       x="0"
       y="0" />
  </g>
  <g
     inkscape:groupmode="layer"
     id="layer3"
     inkscape:label="speechbubbles">
    <path
       style="fill:#ffffff;fill-rule:evenodd;stroke:none;stroke-width:0.95494342px;stroke-linecap:butt;stroke-linejoin:miter;stroke-opacity:1"
       d="m 477.49729,179.74646 c 5.528,1.50923 57.64924,0 62.38752,-0.75461 4.73829,-0.75462 40.27549,-6.79155 48.96237,-5.28231 8.68688,1.50923 68.70525,9.81 79.76128,10.56462 11.056,0.75461 63.96695,2.26384 73.44353,6.79154 9.4766,4.52769 22.11205,9.05539 29.21949,16.60156 7.10745,7.54616 17.37374,30.93926 16.58403,36.22157 -0.78972,5.28231 -11.84575,41.50388 -18.16346,46.78619 -6.31773,5.28231 -28.42976,22.63848 -34.74749,24.90233 -6.31773,2.26385 -20.5326,8.30077 -27.64005,10.56462 -7.10744,2.26385 -168.20941,4.52769 -187.9523,5.28232 -19.74289,0.75461 -96.3453,-4.5277 -109.77047,-5.28232 -13.42516,-0.75462 -45.01379,1.50924 -65.54638,-6.03693 -20.53262,-7.54615 -34.74751,-35.46695 -41.06522,-40.74927 -6.31773,-5.28231 -17.37375,-27.92079 -16.58402,-36.22156 0.7897,-8.30078 16.58402,-27.92079 24.48116,-30.18464 7.89716,-2.26385 40.27551,-21.12925 59.22867,-24.90233 18.95318,-3.77308 64.75668,-12.82847 73.44355,-12.07386 11.89065,1.51627 10.64143,0.15054 33.95779,3.77308 z"
       id="path1323"
       inkscape:connector-curvature="0"
       sodipodi:nodetypes="ccsscscsscsssccsscc" />
    <path
       style="fill:#ffffff;fill-rule:evenodd;stroke:none;stroke-width:1.02273285px;stroke-linecap:butt;stroke-linejoin:miter;stroke-opacity:1"
       d="m 149.51056,163.77351 c 12.79345,-19.15682 35.98157,-29.0442 47.9754,-31.51605 11.99386,-2.47185 31.98362,3.08981 43.17789,1.85389 11.19425,-1.23593 53.57253,-12.35924 69.56434,-11.74128 15.99179,0.61796 63.16762,4.32573 78.35984,4.9437 15.19219,0.61796 52.77295,3.0898 66.36598,9.88738 13.59305,6.79758 28.78524,14.21312 31.18402,21.0107 2.39876,6.79758 7.9959,19.77478 2.39876,30.89809 -5.59712,11.12331 -19.19015,30.28013 -36.78113,32.13401 -17.59099,1.85389 -104.74633,8.65147 -123.93649,8.0335 -19.19016,-0.61796 -71.96312,0 -84.75656,0 -12.79345,0 -59.16967,-4.32573 -72.76271,-12.35923 -13.59303,-8.0335 -23.9877,-24.10051 -25.58688,-33.9879 -1.59919,-9.88738 4.79754,-19.15681 4.79754,-19.15681 z"
       id="path1325"
       inkscape:connector-curvature="0" />
    <path
       style="fill:#ffffff;fill-rule:evenodd;stroke:none;stroke-width:1px;stroke-linecap:butt;stroke-linejoin:miter;stroke-opacity:1"
       d="m 550.98307,291.50935 c 6.17962,25.33643 -4.94369,76.0093 4.32573,89.60445 9.26943,13.59516 11.12331,11.74128 19.15682,18.53886 -12.35924,15.44904 -17.92089,33.36993 -16.68497,42.63936 1.23592,9.26942 4.32573,33.36993 35.84178,44.49324 -27.19032,-19.15681 -24.71847,-38.31363 -23.48255,-43.87528 1.23593,-5.56166 6.17962,-34.60586 21.62867,-42.0214 C 576.3195,389.14731 568.286,376.17011 568.286,368.75457 c 0,-7.41554 8.65146,-82.80688 8.65146,-82.80688 z"
       id="path1327"
       inkscape:connector-curvature="0" />
    <path
       style="fill:#ffffff;fill-rule:evenodd;stroke:none;stroke-width:1px;stroke-linecap:butt;stroke-linejoin:miter;stroke-opacity:1"
       d="m 1028.778,94.455609 c -32.42456,13.243931 -62.38624,24.083541 -66.70952,43.507951 -4.32327,19.42442 -16.21228,35.31713 -17.2931,48.56105 -1.08082,13.24393 7.26449,61.56049 14.83022,79.21905 7.56573,17.65856 48.6369,58.27325 54.0409,61.80497 5.4041,3.5317 41.0712,15.00977 58.3643,20.30734 17.2931,5.29757 155.6379,8.82928 180.4967,11.47806 24.8589,2.64879 91.8696,-12.36099 109.1628,-18.54148 17.2931,-6.1805 41.0711,-8.82929 51.8793,-19.42442 10.8082,-10.59513 35.667,-38.84883 39.9903,-51.20982 4.3232,-12.361 4.3232,-54.74155 4.3232,-63.57083 0,-8.82929 -1.0808,-47.67812 -21.6163,-64.45375 -20.5356,-16.77563 -55.1218,-39.73177 -82.1423,-46.795191 -27.0205,-7.063425 -190.2241,-17.658563 -208.598,-18.541491 -18.374,-0.882928 -116.7285,17.658561 -116.7285,17.658561 z"
       id="path1329"
       inkscape:connector-curvature="0"
       sodipodi:nodetypes="cssscsscscscssc" />
    <path
       style="fill:#ffffff;fill-rule:evenodd;stroke:none;stroke-width:0.83407217px;stroke-linecap:butt;stroke-linejoin:miter;stroke-opacity:1"
       d="m 1053.049,312.02964 c -23.5293,14.36798 -49.7736,27.83798 -55.20346,37.71597 -5.42982,9.87799 -12.66963,36.81796 -9.04979,49.38996 3.61997,12.57199 15.38465,64.65595 28.95925,74.53394 13.5746,9.87799 57.0136,40.40997 78.733,40.40997 21.7194,0 91.4025,11.67399 103.1673,10.77599 11.7646,-0.898 87.7826,9.87799 107.6922,0.898 19.9094,-8.98 45.2487,-25.14398 60.6334,-30.53198 15.3844,-5.38799 52.4885,-8.08199 63.3482,-27.83798 10.8598,-19.75598 15.7192,-55.03303 7.2399,-80.81994 -8.2009,-24.93996 -25.3393,-46.69595 -52.4887,-60.16595 -27.1492,-13.46998 -114.027,-43.10396 -114.027,-43.10396 l -130.3165,-11.67399 c 0,0 -20.8145,8.08199 -42.534,19.75598 -21.7194,11.67399 -46.1538,20.65399 -46.1538,20.65399 z"
       id="path1331"
       inkscape:connector-curvature="0"
       sodipodi:nodetypes="csccsccccasccsc" />
    <path
       style="fill:#ffffff;fill-rule:evenodd;stroke:none;stroke-width:1px;stroke-linecap:butt;stroke-linejoin:miter;stroke-opacity:1"
       d="m 1308.2562,520.86842 c 0,0 45.2301,34.89828 59.7036,58.16381 14.4737,23.26551 45.2301,56.50197 37.9932,117.98941 18.092,-79.7675 18.092,-103.03301 -34.3747,-179.47685 -52.4669,-76.44387 -63.3221,3.32363 -63.3221,3.32363 z"
       id="path1333"
       inkscape:connector-curvature="0" />
    <path
       style="fill:#ffffff;fill-rule:evenodd;stroke:none;stroke-width:1.04007399px;stroke-linecap:butt;stroke-linejoin:miter;stroke-opacity:1"
       d="m 1604.7755,194.8768 c 12.1011,-32.74271 16.1347,-51.84263 44.3704,-63.66639 28.2357,-11.82376 143.8676,-21.82847 160.0023,-22.73799 16.1347,-0.90952 64.5387,2.72856 87.3962,2.72856 22.8575,0 141.1785,-1.81904 160.0023,-1.81904 18.8238,0 95.4636,0 115.632,1.81904 20.1683,1.81904 91.4298,12.73327 103.5309,20.91896 12.101,8.18567 47.0594,42.74742 48.404,65.48542 1.3446,22.73799 -1.3446,60.02831 -25.5466,74.58062 -24.202,14.55231 -80.6735,32.74271 -118.3211,38.19983 -37.6475,5.45712 -221.8519,11.82375 -243.3647,11.82375 -21.513,0 -112.9428,2.72856 -157.3132,-1.81903 -44.3704,-4.5476 -92.7745,-18.1904 -115.6319,-30.92367 -22.8575,-12.73329 -51.0933,-21.82848 -59.1606,-46.38552 -8.0673,-24.55703 0,-48.20454 0,-48.20454 z"
       id="path1335"
       inkscape:connector-curvature="0" />
    <path
       style="fill:#ffffff;fill-rule:evenodd;stroke:none;stroke-width:1px;stroke-linecap:butt;stroke-linejoin:miter;stroke-opacity:1"
       d="m 1748.7389,337.77502 c 27.5116,26.61792 42.8588,47.56076 -11.4058,80.71719 49.1355,-0.72812 43.5728,20.05383 34.2174,45.56614 66.8976,-20.5973 113.7421,-7.40942 120.3948,32.54725 43.9171,-32.2476 50.5645,-26.46532 83.6426,-1.30189 39.6321,-49.89404 62.6056,-15.54139 91.2465,-10.41512 -5.8821,-23.03081 13.5288,-43.92498 62.4748,-10.21797 -17.5693,-18.88765 -10.6126,-65.99877 56.6527,-69.19731 -30.151,-10.89059 -73.1985,-22.51429 -22.8117,-69.00017 -77.6206,-8.98442 -39.9485,-27.33589 -51.9598,-41.66048 l -112.7909,-13.0189 -114.0581,7.81134 -58.2964,5.20756 c -1.4105,20.45876 4.4806,42.79545 -77.3061,42.96236 z"
       id="path1337"
       inkscape:connector-curvature="0"
       sodipodi:nodetypes="cccccccccccccc" />
    <path
       style="fill:#ffffff;fill-rule:evenodd;stroke:none;stroke-width:1px;stroke-linecap:butt;stroke-linejoin:miter;stroke-opacity:1"
       d="m 2048.8389,472.64077 c 39.971,31.16426 92.1073,102.1495 88.6315,148.89588 17.3787,-62.3285 -27.806,-155.82127 -50.3983,-180.06013 -22.5925,-24.23887 -38.2332,31.16425 -38.2332,31.16425 z"
       id="path1339"
       inkscape:connector-curvature="0" />
    <path
       style="fill:#ffffff;fill-rule:evenodd;stroke:none;stroke-width:1.08426356px;stroke-linecap:butt;stroke-linejoin:miter;stroke-opacity:1"
       d="m 835.58514,1420.9414 c 13.64091,-24.6522 40.92275,-36.4425 77.94812,-42.8734 37.02534,-6.431 134.46044,1.0718 159.79354,1.0718 25.3332,0 126.6658,5.3591 140.3067,13.9339 13.6409,8.5747 46.7689,26.7959 37.0253,46.0889 -9.7435,19.2931 -21.4357,38.5861 -74.0507,49.3044 -52.6151,10.7184 -101.3324,0 -120.8197,1.0719 -19.487,1.0718 -44.82,6.431 -99.38368,1.0718 -54.56368,-5.3591 -124.71703,-33.2269 -120.81958,-69.6693 z"
       id="path1341"
       inkscape:connector-curvature="0" />
    <path
       style="fill:#ffffff;fill-rule:evenodd;stroke:none;stroke-width:1px;stroke-linecap:butt;stroke-linejoin:miter;stroke-opacity:1"
       d="m 1321.8416,1549.9601 c -25.1103,-26.3097 -29.3743,-46.7563 -36.94,-53.2412 -7.5658,-6.4849 -52.768,-40.79 -87.3542,-44.0325 -34.5862,-3.2424 -28.1013,24.8589 -28.1013,24.8589 0,0 36.7479,1.0808 51.8793,5.4041 15.1315,4.3232 48.6369,20.5355 54.041,24.8588 5.4041,4.3233 19.4547,27.0205 46.4752,42.1519 z"
       id="path1343"
       inkscape:connector-curvature="0"
       sodipodi:nodetypes="cccccsc" />
    <path
       style="fill:#ffffff;fill-rule:evenodd;stroke:none;stroke-width:1px;stroke-linecap:butt;stroke-linejoin:miter;stroke-opacity:1"
       d="m 1847.0115,1634.8585 c 65.8759,-41.0171 79.5483,-53.4465 129.266,-55.9324 49.7176,-2.4859 59.6612,-29.8306 59.6612,-29.8306 0,0 -34.8024,-1.243 -72.0906,6.2147 -37.2883,7.4576 -95.7066,37.2882 -116.8366,79.5483 z"
       id="path1345"
       inkscape:connector-curvature="0" />
    <path
       style="fill:#ffffff;fill-rule:evenodd;stroke:none;stroke-width:0.99999988px;stroke-linecap:butt;stroke-linejoin:miter;stroke-opacity:1"
       d="m 1980.1886,1519.225 c 17.7997,-20.9727 63.5703,-43.2562 91.5412,-47.1886 27.9708,-3.9323 116.9692,5.2432 136.0403,17.0403 19.071,11.7972 58.4846,20.9728 57.2132,58.9858 -1.2715,38.013 5.0856,55.0534 -24.1567,76.026 -29.2423,20.9728 -132.2261,15.7296 -155.1113,14.4188 -22.8854,-1.3107 -66.1131,-6.5539 -88.9984,-30.1483 -22.8853,-23.5942 -33.0565,-48.4993 -16.5283,-89.134 z"
       id="path1347"
       inkscape:connector-curvature="0" />
    <path
       style="fill:#ffffff;fill-rule:evenodd;stroke:none;stroke-width:1px;stroke-linecap:butt;stroke-linejoin:miter;stroke-opacity:1"
       d="m 2013.5657,1644.9129 c 19.8871,-26.6414 68.3618,-36.1562 79.5483,-36.1562 11.1865,0 98.1924,5.7088 114.3506,5.7088 16.1583,0 49.7177,-5.7088 68.3618,-3.8058 18.6442,1.9029 53.4465,0 68.3618,19.0295 14.9153,19.0296 26.1018,60.8947 22.373,78.9728 -3.7288,18.0781 4.9718,41.865 -11.1865,69.4579 -16.1582,27.5929 -22.3729,38.0592 -45.9888,46.6225 -23.6159,8.5633 -135.4807,4.7574 -160.3395,1.903 -24.8589,-2.8545 -73.3336,0 -94.4636,-4.7574 -21.13,-4.7575 -54.6894,-20.9326 -49.7177,-40.9136 4.9718,-19.9811 -8.7006,-38.0592 -2.4859,-72.3124 6.2148,-34.2533 11.1865,-63.7491 11.1865,-63.7491 z"
       id="path1349"
       inkscape:connector-curvature="0" />
    <path
       style="fill:#ffffff;fill-rule:evenodd;stroke:none;stroke-width:1.12449646px;stroke-linecap:butt;stroke-linejoin:miter;stroke-opacity:1"
       d="m 110.82753,2399.1151 c 0,-35.8207 32.71576,-41.7908 54.05211,-41.7908 21.33637,0 91.03513,-4.7762 100.99211,-4.7762 9.95697,0 83.92302,7.1642 96.72483,13.1343 12.80182,5.9701 32.71574,10.7462 29.87091,32.2386 -2.84485,21.4925 0,33.4327 -28.44847,39.4028 -28.44849,5.9702 -139.39757,8.3582 -159.31151,7.1642 -19.91392,-1.194 -49.78483,-10.7463 -64.00908,-17.9104 -14.22424,-7.1641 -32.71576,-9.5522 -29.8709,-27.4625 z"
       id="path1351"
       inkscape:connector-curvature="0" />
    <path
       style="fill:#ffffff;fill-rule:evenodd;stroke:none;stroke-width:0.96320325px;stroke-linecap:butt;stroke-linejoin:miter;stroke-opacity:1"
       d="m 309.11422,2414.8756 c 48.15781,-8.4464 82.20391,-6.4428 96.44438,-5.1897 14.9867,1.3188 52.96013,9.1079 64.84914,15.9341 11.889,6.8262 27.05014,20.6562 25.96932,28.8477 -1.08082,8.1915 6.91442,30.6993 5.8336,41.6213 -1.08082,10.9219 -12.59967,48.4848 -20.1654,64.1851 -7.56574,15.7003 -25.93966,34.1311 -107.00108,37.5443 -81.06142,3.4131 -130.77909,2.0478 -162.12284,-3.4132 -31.34375,-5.4609 -71.33406,-8.874 -82.14225,-34.8137 -10.80819,-25.9396 -14.05064,-55.2924 -10.80819,-67.5796 3.24246,-12.2872 6.48492,-39.5921 10.80819,-44.3704 4.32328,-4.7784 17.38212,-23.3867 27.10949,-27.4824 9.72737,-4.0957 151.22564,-5.2835 151.22564,-5.2835 z"
       id="path1353"
       inkscape:connector-curvature="0"
       sodipodi:nodetypes="csssscscsscsc" />
    <path
       style="fill:#ffffff;fill-rule:evenodd;stroke:none;stroke-width:1px;stroke-linecap:butt;stroke-linejoin:miter;stroke-opacity:1"
       d="m 526.28497,2532.8088 c 1.08082,-17.3473 14.05064,-49.1508 33.50539,-54.9332 19.45474,-5.7824 73.49568,-5.7824 84.30387,-2.8912 10.80819,2.8912 28.1013,24.0934 32.42457,32.7671 4.32328,8.6737 16.21229,39.5134 -3.24245,52.0419 -19.45474,12.5287 -38.90949,22.1661 -59.44505,21.2023 -20.53556,-0.9637 -61.60668,-7.7099 -71.33405,-19.2747 -9.72737,-11.565 -16.21228,-28.9122 -16.21228,-28.9122 z"
       id="path1355"
       inkscape:connector-curvature="0" />
    <path
       style="fill:#ffffff;fill-rule:evenodd;stroke:none;stroke-width:1px;stroke-linecap:butt;stroke-linejoin:miter;stroke-opacity:1"
       d="m 331.68086,2585.7323 c 0,0 10.62431,6.5049 12.25882,20.9603 1.63451,14.4555 -0.81725,31.0793 -13.89333,48.4259 28.60391,-28.911 43.31449,-49.1486 34.32469,-73.7229 -8.9898,-24.5743 -32.69018,4.3367 -32.69018,4.3367 z"
       id="path1357"
       inkscape:connector-curvature="0" />
    <path
       style="fill:#ffffff;fill-rule:evenodd;stroke:none;stroke-width:1px;stroke-linecap:butt;stroke-linejoin:miter;stroke-opacity:1"
       d="m 609.41023,2578.6689 c 0,0 17.16235,24.5177 9.80706,38.411 -7.35529,13.8933 -8.9898,18.7968 -25.33489,35.1419 26.9694,-17.9796 37.5937,-31.0556 40.86272,-43.3145 3.26902,-12.2588 5.72078,-35.9592 5.72078,-42.4972 0,-6.538 -31.05567,12.2588 -31.05567,12.2588 z"
       id="path1359"
       inkscape:connector-curvature="0" />
    <path
       style="fill:#ffffff;fill-rule:evenodd;stroke:none;stroke-width:1.03840244px;stroke-linecap:butt;stroke-linejoin:miter;stroke-opacity:1"
       d="m 721.7991,2510.6937 c -9.39843,-42.5634 -7.51874,-84.1134 4.69921,-95.2608 4.75927,-26.065 60.0674,-65.3013 81.7663,-59.7915 16.91717,-4.0536 108.0819,-25.3353 125.93891,-23.3084 17.85701,2.0267 118.32618,4.6109 137.12298,22.8524 18.7969,18.2414 34.2573,28.5276 45.5355,47.7825 11.2781,19.2548 17.716,57.2071 23.3551,63.2875 5.639,6.0806 3.5713,36.3309 -1.1279,53.5589 -4.6992,17.2281 -21.6164,31.4159 -46.0523,37.4963 -24.4359,6.0806 -57.3304,14.1878 -78.9468,15.2013 -21.61634,1.0134 -71.428,1.0134 -109.0217,-2.0268 -44.76237,-9.5027 -72.61993,-9.7453 -117.26947,-14.0847 -8.45859,-1.0133 -64.12015,-18.3446 -65.99983,-45.7067 z"
       id="path1361"
       inkscape:connector-curvature="0"
       sodipodi:nodetypes="ccccccccccccc" />
    <path
       style="fill:#ffffff;fill-rule:evenodd;stroke:none;stroke-width:1px;stroke-linecap:butt;stroke-linejoin:miter;stroke-opacity:1"
       d="m 1048.8643,2539.6614 c 40.4132,37.5937 65.789,69.5483 47.932,102.4428 29.1351,-35.714 14.0976,-69.5483 -24.4359,-117.4803 -38.5336,-47.932 -23.4961,15.0375 -23.4961,15.0375 z"
       id="path1363"
       inkscape:connector-curvature="0" />
    <path
       style="fill:#ffffff;fill-rule:evenodd;stroke:none;stroke-width:1px;stroke-linecap:butt;stroke-linejoin:miter;stroke-opacity:1"
       d="m 1362.7766,2499.8218 c -0.8172,-27.7867 20.4314,-32.6902 31.8729,-34.3247 11.4416,-1.6345 58.8423,-9.807 76.8219,3.269 17.9796,13.0761 22.8832,35.142 14.7106,43.3145 -8.1725,8.1726 -34.3247,20.4314 -50.6698,21.2486 -16.345,0.8173 -51.487,-4.0862 -62.9285,-15.5278 -11.4416,-11.4416 -9.8071,-17.9796 -9.8071,-17.9796 z"
       id="path1365"
       inkscape:connector-curvature="0" />
    <path
       style="fill:#ffffff;fill-rule:evenodd;stroke:none;stroke-width:1px;stroke-linecap:butt;stroke-linejoin:miter;stroke-opacity:1"
       d="m 1445.7231,2523.112 c 0,0 19.6141,10.6243 24.5176,19.6141 4.9035,8.9898 13.0761,31.0556 8.9898,45.7662 13.0761,-26.1521 8.1725,-42.4972 4.9035,-49.8525 -3.269,-7.3553 -23.7004,-34.3247 -23.7004,-34.3247 z"
       id="path1367"
       inkscape:connector-curvature="0" />
    <path
       style="fill:#ffffff;fill-rule:evenodd;stroke:none;stroke-width:1px;stroke-linecap:butt;stroke-linejoin:miter;stroke-opacity:1"
       d="m 1839.6771,2441.5127 c 3.9525,-52.9602 28.6554,-69.1724 45.4535,-76.7382 16.7979,-7.5657 85.9661,-18.3739 109.681,-17.2931 23.7147,1.0808 111.6573,11.889 126.479,12.9698 14.8218,1.0809 52.3702,25.9397 55.3345,32.4246 2.9644,6.4849 15.8099,23.778 11.8575,43.2328 -3.9525,19.4547 -26.6792,45.3944 -48.4179,55.1217 -21.7386,9.7274 -108.6927,17.2931 -125.4908,15.1315 -16.798,-2.1616 -45.4533,-5.4041 -62.2514,-5.4041 -16.798,0 -70.1563,-1.0808 -83.99,-12.9698 -13.8336,-11.889 -28.6554,-46.4752 -28.6554,-46.4752 z"
       id="path1369"
       inkscape:connector-curvature="0" />
    <path
       style="fill:#ffffff;fill-rule:evenodd;stroke:none;stroke-width:1.05092192px;stroke-linecap:butt;stroke-linejoin:miter;stroke-opacity:1"
       d="m 1975.3627,2507.5657 c 17.314,24.1512 6.8068,34.5534 -22.4952,35.6671 22.6629,9.9586 50.9517,15.5923 44.9903,47.556 25.161,-0.375 41.0782,-19.937 81.2324,10.8082 23.7449,-25.3561 47.4896,-13.281 71.2346,-2.1617 11.3889,-11.3113 32.3579,-12.0311 76.2336,-6.4849 -3.3881,-25.0109 24.1456,-36.1565 49.9892,-44.3136 -21.882,-13.1763 -41.592,-27.5479 -27.4941,-60.5258 -31.7986,7.2773 -58.5389,6.6803 -73.734,-11.889 -31.5478,4.157 -55.2449,21.8927 -98.7288,5.4041 -23.4161,19.9279 -49.5158,21.2885 -76.2336,18.3739 6.0887,17.7643 -1.0985,21.4958 -24.9944,7.5657 z"
       id="path1371"
       inkscape:connector-curvature="0"
       sodipodi:nodetypes="cccccccccccc" />
    <path
       style="fill:#ffffff;fill-rule:evenodd;stroke:none;stroke-width:1px;stroke-linecap:butt;stroke-linejoin:miter;stroke-opacity:1"
       d="m 2142.1832,2571.3341 c -3.2425,28.1012 8.6465,79.9806 34.5862,113.4859 -3.2425,16.2123 1.0808,33.5054 15.1315,47.5561 -12.9699,-29.1821 -7.5658,-36.7479 -1.0809,-50.7985 -12.9698,-20.5356 -31.3437,-69.1724 -34.5862,-109.1627 -3.2424,-39.9903 -14.0506,-1.0808 -14.0506,-1.0808 z"
       id="path1373"
       inkscape:connector-curvature="0" />
  </g>
  <g
     inkscape:groupmode="layer"
     id="layer1"
     inkscape:label="txt">
    <text
       xml:space="preserve"
       style="font-style:normal;font-variant:normal;font-weight:normal;font-stretch:normal;line-height:0%;font-family:'WenQuanYi Micro Hei';-inkscape-font-specification:'WenQuanYi Micro Hei';text-align:center;letter-spacing:0px;word-spacing:0px;text-anchor:middle;fill:#000000;fill-opacity:1;stroke:none"
       x="318.61392"
       y="193.67375"
       id="text4246"
       sodipodi:linespacing="0%"><tspan
         sodipodi:role="line"
         style="font-style:normal;font-variant:normal;font-weight:normal;font-stretch:normal;font-size:45px;line-height:1.20000005;font-family:'WenQuanYi Micro Hei';-inkscape-font-specification:'WenQuanYi Micro Hei'"
         x="318.61392"
         y="193.67375"
         id="tspan4252">实话和你们说…</tspan></text>
    <text
       xml:space="preserve"
       style="font-style:normal;font-variant:normal;font-weight:normal;font-stretch:normal;line-height:0%;font-family:'WenQuanYi Micro Hei';-inkscape-font-specification:'WenQuanYi Micro Hei';text-align:center;letter-spacing:0px;word-spacing:0px;text-anchor:middle;fill:#000000;fill-opacity:1;stroke:none"
       x="528.04688"
       y="265.45801"
       id="text4246-3"
       sodipodi:linespacing="0%"><tspan
         sodipodi:role="line"
         style="font-style:normal;font-variant:normal;font-weight:normal;font-stretch:normal;font-size:45px;line-height:1.20000005;font-family:'WenQuanYi Micro Hei';-inkscape-font-specification:'WenQuanYi Micro Hei'"
         x="528.04688"
         y="265.45801"
         id="tspan899">我还在担心安全问题…</tspan></text>
    <text
       xml:space="preserve"
       style="font-style:normal;font-variant:normal;font-weight:normal;font-stretch:normal;line-height:0%;font-family:'WenQuanYi Micro Hei';-inkscape-font-specification:'WenQuanYi Micro Hei';text-align:center;letter-spacing:0px;word-spacing:0px;text-anchor:middle;fill:#000000;fill-opacity:1;stroke:none"
       x="1203.0967"
       y="169.41882"
       id="text4246-3-7"
       sodipodi:linespacing="0%"><tspan
         sodipodi:role="line"
         style="font-style:normal;font-variant:normal;font-weight:normal;font-stretch:normal;font-size:45px;line-height:1.20000005;font-family:'WenQuanYi Micro Hei';-inkscape-font-specification:'WenQuanYi Micro Hei'"
         x="1203.0967"
         y="169.41882"
         id="tspan937">历史上很多年轻的</tspan><tspan
         sodipodi:role="line"
         style="font-style:normal;font-variant:normal;font-weight:normal;font-stretch:normal;font-size:45px;line-height:1.20000005;font-family:'WenQuanYi Micro Hei';-inkscape-font-specification:'WenQuanYi Micro Hei'"
         x="1203.0967"
         y="223.41882"
         id="tspan3429">女王和国王都是在</tspan><tspan
         sodipodi:role="line"
         style="font-style:normal;font-variant:normal;font-weight:normal;font-stretch:normal;font-size:45px;line-height:1.20000005;font-family:'WenQuanYi Micro Hei';-inkscape-font-specification:'WenQuanYi Micro Hei'"
         x="1203.0967"
         y="277.41882"
         id="tspan3431">登基大典上被刺杀的。</tspan></text>
    <text
       xml:space="preserve"
       style="font-style:normal;font-variant:normal;font-weight:normal;font-stretch:normal;line-height:0%;font-family:'WenQuanYi Micro Hei';-inkscape-font-specification:'WenQuanYi Micro Hei';text-align:center;letter-spacing:0px;word-spacing:0px;text-anchor:middle;fill:#000000;fill-opacity:1;stroke:none"
       x="1227.3801"
       y="423.24155"
       id="text4246-3-7-7"
       sodipodi:linespacing="0%"><tspan
         sodipodi:role="line"
         style="font-style:normal;font-variant:normal;font-weight:normal;font-stretch:normal;font-size:45px;line-height:1.20000005;font-family:'WenQuanYi Micro Hei';-inkscape-font-specification:'WenQuanYi Micro Hei'"
         x="1227.3801"
         y="423.24155"
         id="tspan903">我的家族也遭过此劫。</tspan></text>
    <text
       xml:space="preserve"
       style="font-style:normal;font-variant:normal;font-weight:normal;font-stretch:normal;line-height:0%;font-family:'WenQuanYi Micro Hei';-inkscape-font-specification:'WenQuanYi Micro Hei';text-align:center;letter-spacing:0px;word-spacing:0px;text-anchor:middle;fill:#000000;fill-opacity:1;stroke:none"
       x="1961.5282"
       y="176.76515"
       id="text4246-3-7-7-6"
       sodipodi:linespacing="0%"><tspan
         sodipodi:role="line"
         style="font-style:normal;font-variant:normal;font-weight:normal;font-stretch:normal;font-size:45px;line-height:1.20000005;font-family:'WenQuanYi Micro Hei';-inkscape-font-specification:'WenQuanYi Micro Hei'"
         x="1961.5282"
         y="176.76515"
         id="tspan972">眼下，再过几个小时，</tspan><tspan
         sodipodi:role="line"
         style="font-style:normal;font-variant:normal;font-weight:normal;font-stretch:normal;font-size:45px;line-height:1.20000005;font-family:'WenQuanYi Micro Hei';-inkscape-font-specification:'WenQuanYi Micro Hei'"
         x="1961.5282"
         y="230.76515"
         id="tspan3449">我就会成为世界各地聚来的</tspan><tspan
         sodipodi:role="line"
         style="font-style:normal;font-variant:normal;font-weight:normal;font-stretch:normal;font-size:45px;line-height:1.20000005;font-family:'WenQuanYi Micro Hei';-inkscape-font-specification:'WenQuanYi Micro Hei'"
         x="1961.5282"
         y="284.76517"
         id="tspan3451">万千众人的焦点。</tspan></text>
    <text
       xml:space="preserve"
       style="font-style:normal;font-variant:normal;font-weight:normal;font-stretch:normal;line-height:0%;font-family:'WenQuanYi Micro Hei';-inkscape-font-specification:'WenQuanYi Micro Hei';text-align:center;letter-spacing:0px;word-spacing:0px;text-anchor:middle;fill:#000000;fill-opacity:1;stroke:none"
       x="1059.3418"
       y="1445.7167"
       id="text4246-3-7-7-6-7"
       sodipodi:linespacing="0%"><tspan
         sodipodi:role="line"
         style="font-style:normal;font-variant:normal;font-weight:normal;font-stretch:normal;font-size:45px;line-height:1.20000005;font-family:'WenQuanYi Micro Hei';-inkscape-font-specification:'WenQuanYi Micro Hei'"
         x="1059.3418"
         y="1445.7167"
         id="tspan1007">不要担心，香菜叶。</tspan></text>
    <text
       xml:space="preserve"
       style="font-style:normal;font-variant:normal;font-weight:normal;font-stretch:normal;line-height:0%;font-family:'WenQuanYi Micro Hei';-inkscape-font-specification:'WenQuanYi Micro Hei';text-align:center;letter-spacing:0px;word-spacing:0px;text-anchor:middle;fill:#000000;fill-opacity:1;stroke:none"
       x="1970.4427"
       y="372.27335"
       id="text4246-3-7-7-6-7-7"
       sodipodi:linespacing="0%"><tspan
         sodipodi:role="line"
         style="font-style:normal;font-variant:normal;font-weight:normal;font-stretch:normal;font-size:45px;line-height:1.20000005;font-family:'WenQuanYi Micro Hei';-inkscape-font-specification:'WenQuanYi Micro Hei'"
         x="1970.4427"
         y="372.27335"
         id="tspan990">我真的真的</tspan><tspan
         sodipodi:role="line"
         style="font-style:normal;font-variant:normal;font-weight:normal;font-stretch:normal;font-size:45px;line-height:1.20000005;font-family:'WenQuanYi Micro Hei';-inkscape-font-specification:'WenQuanYi Micro Hei'"
         x="1970.4427"
         y="426.27338"
         id="tspan3455">好害怕！</tspan></text>
    <text
       xml:space="preserve"
       style="font-style:normal;font-variant:normal;font-weight:normal;font-stretch:normal;line-height:0%;font-family:'WenQuanYi Micro Hei';-inkscape-font-specification:'WenQuanYi Micro Hei';text-align:center;letter-spacing:0px;word-spacing:0px;text-anchor:middle;fill:#000000;fill-opacity:1;stroke:none"
       x="2121.4336"
       y="1547.2563"
       id="text4246-3-7-7-6-7-2"
       sodipodi:linespacing="0%"><tspan
         sodipodi:role="line"
         style="font-style:normal;font-variant:normal;font-weight:normal;font-stretch:normal;font-size:45px;line-height:1.20000005;font-family:'WenQuanYi Micro Hei';-inkscape-font-specification:'WenQuanYi Micro Hei'"
         x="2121.4336"
         y="1547.2563"
         id="tspan1011">我们按计划</tspan><tspan
         sodipodi:role="line"
         style="font-style:normal;font-variant:normal;font-weight:normal;font-stretch:normal;font-size:45px;line-height:1.20000005;font-family:'WenQuanYi Micro Hei';-inkscape-font-specification:'WenQuanYi Micro Hei'"
         x="2121.4336"
         y="1601.2563"
         id="tspan3461">行事就好。</tspan></text>
    <text
       xml:space="preserve"
       style="font-style:normal;font-variant:normal;font-weight:normal;font-stretch:normal;line-height:0%;font-family:'WenQuanYi Micro Hei';-inkscape-font-specification:'WenQuanYi Micro Hei';text-align:center;letter-spacing:0px;word-spacing:0px;text-anchor:middle;fill:#000000;fill-opacity:1;stroke:none"
       x="2182.6404"
       y="1691.4915"
       id="text4246-3-7-7-6-7-2-9"
       sodipodi:linespacing="0%"><tspan
         sodipodi:role="line"
         style="font-style:normal;font-variant:normal;font-weight:normal;font-stretch:normal;font-size:45px;line-height:1.20000005;font-family:'WenQuanYi Micro Hei';-inkscape-font-specification:'WenQuanYi Micro Hei'"
         x="2182.6404"
         y="1691.4915"
         id="tspan3469">七味粉和我就是</tspan><tspan
         sodipodi:role="line"
         style="font-style:normal;font-variant:normal;font-weight:normal;font-stretch:normal;font-size:45px;line-height:1.20000005;font-family:'WenQuanYi Micro Hei';-inkscape-font-specification:'WenQuanYi Micro Hei'"
         x="2182.6404"
         y="1745.4915"
         id="tspan3473">你的贴身保镖，</tspan><tspan
         sodipodi:role="line"
         style="font-style:normal;font-variant:normal;font-weight:normal;font-stretch:normal;font-size:45px;line-height:1.20000005;font-family:'WenQuanYi Micro Hei';-inkscape-font-specification:'WenQuanYi Micro Hei'"
         x="2182.6404"
         y="1799.4915"
         id="tspan3471">不是嘛？</tspan></text>
    <text
       xml:space="preserve"
       style="font-style:normal;font-variant:normal;font-weight:normal;font-stretch:normal;line-height:0%;font-family:'WenQuanYi Micro Hei';-inkscape-font-specification:'WenQuanYi Micro Hei';text-align:center;letter-spacing:0px;word-spacing:0px;text-anchor:middle;fill:#000000;fill-opacity:1;stroke:none"
       x="254.1396"
       y="2407.7466"
       id="text4246-3-7-7-6-7-2-9-6"
       sodipodi:linespacing="0%"><tspan
         sodipodi:role="line"
         style="font-style:normal;font-variant:normal;font-weight:normal;font-stretch:normal;font-size:45px;line-height:1.20000005;font-family:'WenQuanYi Micro Hei';-inkscape-font-specification:'WenQuanYi Micro Hei'"
         x="254.1396"
         y="2407.7466"
         id="tspan1121-3">完全同意。</tspan></text>
    <text
       xml:space="preserve"
       style="font-style:normal;font-variant:normal;font-weight:normal;font-stretch:normal;line-height:0%;font-family:'WenQuanYi Micro Hei';-inkscape-font-specification:'WenQuanYi Micro Hei';text-align:center;letter-spacing:0px;word-spacing:0px;text-anchor:middle;fill:#000000;fill-opacity:1;stroke:none"
       x="323.91031"
       y="2490.3303"
       id="text4246-3-7-7-6-7-2-9-6-1"
       sodipodi:linespacing="0%"><tspan
         sodipodi:role="line"
         style="font-style:normal;font-variant:normal;font-weight:normal;font-stretch:normal;font-size:45px;line-height:1.20000005;font-family:'WenQuanYi Micro Hei';-inkscape-font-specification:'WenQuanYi Micro Hei'"
         x="323.91031"
         y="2490.3303"
         id="tspan1050">你应该休息一下，</tspan><tspan
         sodipodi:role="line"
         style="font-style:normal;font-variant:normal;font-weight:normal;font-stretch:normal;font-size:45px;line-height:1.20000005;font-family:'WenQuanYi Micro Hei';-inkscape-font-specification:'WenQuanYi Micro Hei'"
         x="323.91031"
         y="2544.3303"
         id="tspan3483">不要继续担心了。</tspan></text>
    <text
       xml:space="preserve"
       style="font-style:normal;font-variant:normal;font-weight:normal;font-stretch:normal;line-height:0%;font-family:'WenQuanYi Micro Hei';-inkscape-font-specification:'WenQuanYi Micro Hei';text-align:center;letter-spacing:0px;word-spacing:0px;text-anchor:middle;fill:#000000;fill-opacity:1;stroke:none"
       x="616.78357"
       y="2542.2996"
       id="text4246-3-7-7-6-7-2-9-6-1-4"
       sodipodi:linespacing="0%"><tspan
         sodipodi:role="line"
         style="font-style:normal;font-variant:normal;font-weight:normal;font-stretch:normal;font-size:45px;line-height:1.20000005;font-family:'WenQuanYi Micro Hei';-inkscape-font-specification:'WenQuanYi Micro Hei'"
         x="616.78357"
         y="2542.2996"
         id="tspan1183-0">也好。</tspan></text>
    <text
       xml:space="preserve"
       style="font-style:normal;font-variant:normal;font-weight:normal;font-stretch:normal;line-height:0%;font-family:'WenQuanYi Micro Hei';-inkscape-font-specification:'WenQuanYi Micro Hei';text-align:center;letter-spacing:0px;word-spacing:0px;text-anchor:middle;fill:#000000;fill-opacity:1;stroke:none"
       x="923.54181"
       y="2428.8777"
       id="text4246-3-7-7-6-7-2-9-6-1-4-3"
       sodipodi:linespacing="0%"><tspan
         sodipodi:role="line"
         style="font-style:normal;font-variant:normal;font-weight:normal;font-stretch:normal;font-size:45px;line-height:1.20000005;font-family:'WenQuanYi Micro Hei';-inkscape-font-specification:'WenQuanYi Micro Hei'"
         x="923.54181"
         y="2428.8777"
         id="tspan1063">嘿！我还没给你们</tspan><tspan
         sodipodi:role="line"
         style="font-style:normal;font-variant:normal;font-weight:normal;font-stretch:normal;font-size:45px;line-height:1.20000005;font-family:'WenQuanYi Micro Hei';-inkscape-font-specification:'WenQuanYi Micro Hei'"
         x="923.54181"
         y="2482.8777"
         id="tspan3489">展示我最新的</tspan><tspan
         sodipodi:role="line"
         style="font-style:normal;font-variant:normal;font-weight:normal;font-stretch:normal;font-size:45px;line-height:1.20000005;font-family:'WenQuanYi Micro Hei';-inkscape-font-specification:'WenQuanYi Micro Hei'"
         x="923.54181"
         y="2536.8777"
         id="tspan3491">小发明呢吧？</tspan></text>
    <text
       xml:space="preserve"
       style="font-style:normal;font-variant:normal;font-weight:normal;font-stretch:normal;line-height:0%;font-family:'WenQuanYi Micro Hei';-inkscape-font-specification:'WenQuanYi Micro Hei';text-align:center;letter-spacing:0px;word-spacing:0px;text-anchor:middle;fill:#000000;fill-opacity:1;stroke:none;"
       x="1429.6105"
       y="2501.0703"
       id="text4246-3-7-7-6-7-2-9-6-1-4-3-1"><tspan
         sodipodi:role="line"
         style="font-size:45px;line-height:1.20000005;-inkscape-font-specification:'WenQuanYi Micro Hei';font-family:'WenQuanYi Micro Hei';font-weight:normal;font-style:normal;font-stretch:normal;font-variant:normal;"
         x="1429.6105"
         y="2501.0703"
         id="tspan1249-3">...</tspan></text>
    <text
       xml:space="preserve"
       style="font-style:normal;font-variant:normal;font-weight:normal;font-stretch:normal;line-height:0%;font-family:'WenQuanYi Micro Hei';-inkscape-font-specification:'WenQuanYi Micro Hei';text-align:center;letter-spacing:0px;word-spacing:0px;text-anchor:middle;fill:#000000;fill-opacity:1;stroke:none"
       x="2014.7648"
       y="2425.7151"
       id="text4246-3-7-7-6-7-2-9-6-1-4-3-1-2"
       sodipodi:linespacing="0%"><tspan
         sodipodi:role="line"
         style="font-style:normal;font-variant:normal;font-weight:normal;font-stretch:normal;font-size:45px;line-height:1.20000005;font-family:'WenQuanYi Micro Hei';-inkscape-font-specification:'WenQuanYi Micro Hei'"
         x="2014.7648"
         y="2425.7151"
         id="tspan1076">就在楼下我的</tspan><tspan
         sodipodi:role="line"
         style="font-style:normal;font-variant:normal;font-weight:normal;font-stretch:normal;font-size:45px;line-height:1.20000005;font-family:'WenQuanYi Micro Hei';-inkscape-font-specification:'WenQuanYi Micro Hei'"
         x="2014.7648"
         y="2479.7151"
         id="tspan3495">车间里。</tspan></text>
    <text
       xml:space="preserve"
       style="font-style:normal;font-variant:normal;font-weight:normal;font-stretch:normal;line-height:0%;font-family:'WenQuanYi Micro Hei';-inkscape-font-specification:'WenQuanYi Micro Hei';text-align:center;letter-spacing:0px;word-spacing:0px;text-anchor:middle;fill:#000000;fill-opacity:1;stroke:none"
       x="2133.4033"
       y="2551.3362"
       id="text4246-3-7-7-6-7-2-9-6-1-4-3-1-2-6"
       sodipodi:linespacing="0%"><tspan
         sodipodi:role="line"
         style="font-style:normal;font-variant:normal;font-weight:normal;font-stretch:normal;font-size:45px;line-height:1.20000005;font-family:'WenQuanYi Micro Hei';-inkscape-font-specification:'WenQuanYi Micro Hei'"
         x="2133.4033"
         y="2551.3362"
         id="tspan1298-5">跟我来。</tspan></text>
  </g>
</svg>
