<?xml version="1.0" encoding="UTF-8" standalone="no"?>
<!-- Created with Inkscape (http://www.inkscape.org/) -->

<svg
   xmlns:dc="http://purl.org/dc/elements/1.1/"
   xmlns:cc="http://creativecommons.org/ns#"
   xmlns:rdf="http://www.w3.org/1999/02/22-rdf-syntax-ns#"
   xmlns:svg="http://www.w3.org/2000/svg"
   xmlns="http://www.w3.org/2000/svg"
   xmlns:xlink="http://www.w3.org/1999/xlink"
   xmlns:sodipodi="http://sodipodi.sourceforge.net/DTD/sodipodi-0.dtd"
   xmlns:inkscape="http://www.inkscape.org/namespaces/inkscape"
   id="svg2"
   version="1.1"
   inkscape:version="0.92.2 (unknown)"
   width="2481"
   height="3503"
   sodipodi:docname="E24P02.svg">
  <metadata
     id="metadata8">
    <rdf:RDF>
      <cc:Work
         rdf:about="">
        <dc:format>image/svg+xml</dc:format>
        <dc:type
           rdf:resource="http://purl.org/dc/dcmitype/StillImage" />
        <dc:title />
      </cc:Work>
    </rdf:RDF>
  </metadata>
  <defs
     id="defs6">
    <filter
       style="color-interpolation-filters:sRGB"
       id="filter4375-4-1-1-1-9"
       inkscape:label="deevad outline effect">
      <feFlood
         id="feFlood4377-7-9-0-8-1"
         flood-opacity="1"
         flood-color="rgb(0,0,0)"
         result="flood" />
      <feComposite
         id="feComposite4379-3-8-8-2-77"
         in2="SourceGraphic"
         in="flood"
         operator="in"
         result="composite1" />
      <feMorphology
         id="feMorphology4393-1-0-49-8-9"
         operator="dilate"
         radius="4"
         result="result3" />
      <feComposite
         id="feComposite4385-9-5-7-0-8"
         in2="result3"
         in="SourceGraphic"
         operator="over"
         result="composite2" />
    </filter>
    <filter
       style="color-interpolation-filters:sRGB"
       id="filter4375-4-1-1-1-9-3"
       inkscape:label="deevad outline effect">
      <feFlood
         id="feFlood4377-7-9-0-8-1-6"
         flood-opacity="1"
         flood-color="rgb(0,0,0)"
         result="flood" />
      <feComposite
         id="feComposite4379-3-8-8-2-77-7"
         in2="SourceGraphic"
         in="flood"
         operator="in"
         result="composite1" />
      <feMorphology
         id="feMorphology4393-1-0-49-8-9-5"
         operator="dilate"
         radius="4"
         result="result3" />
      <feComposite
         id="feComposite4385-9-5-7-0-8-3"
         in2="result3"
         in="SourceGraphic"
         operator="over"
         result="composite2" />
    </filter>
  </defs>
  <sodipodi:namedview
     pagecolor="#ffffff"
     bordercolor="#666666"
     borderopacity="1"
     objecttolerance="10"
     gridtolerance="10"
     guidetolerance="10"
     inkscape:pageopacity="0"
     inkscape:pageshadow="2"
     inkscape:window-width="1855"
     inkscape:window-height="1056"
     id="namedview4"
     showgrid="false"
     inkscape:zoom="1.2235627"
     inkscape:cx="2163.5672"
     inkscape:cy="359.58943"
     inkscape:window-x="65"
     inkscape:window-y="24"
     inkscape:window-maximized="1"
     inkscape:current-layer="g1211"
     inkscape:snap-global="false"
     showguides="true" />
  <g
     inkscape:groupmode="layer"
     id="layer2"
     inkscape:label="artwork"
     sodipodi:insensitive="true">
    <image
       sodipodi:absref="/home/thomas/peppercarrot/webcomics/ep24_The-Unity-Tree/lang/no/../gfx_Pepper-and-Carrot_by-David-Revoy_E24P02.png"
       xlink:href="../gfx_Pepper-and-Carrot_by-David-Revoy_E24P02.png"
       width="2481"
       height="3503"
       id="image10"
       x="0"
       y="0" />
  </g>
  <g
     inkscape:groupmode="layer"
     id="layer3"
     inkscape:label="speechbubbles" />
  <g
     inkscape:groupmode="layer"
     id="layer1"
     inkscape:label="txt"
     style="display:inline">
    <flowRoot
       xml:space="preserve"
       id="flowRoot1245"
       style="font-style:normal;font-variant:normal;font-weight:normal;font-stretch:normal;font-size:0.66666669px;line-height:318.00000668%;font-family:Neuropolitical;-inkscape-font-specification:Neuropolitical;text-align:center;letter-spacing:0px;word-spacing:0px;writing-mode:lr-tb;text-anchor:middle;fill:#000000;fill-opacity:1;stroke:none;stroke-width:1px;stroke-linecap:butt;stroke-linejoin:miter;stroke-opacity:1"><flowRegion
         id="flowRegion1247"><rect
           id="rect1249"
           width="13.224999"
           height="3.3062499"
           x="790.19373"
           y="2848.3625" /></flowRegion><flowPara
         id="flowPara1251" /></flowRoot>    <g
       id="g1211"
       transform="translate(-2638.69,32.303341)">
      <path
         sodipodi:nodetypes="csssssssc"
         inkscape:connector-curvature="0"
         id="path3286-5"
         d="m 3652.365,944.39267 c 66.7846,-8.3585 124.6091,2.64527 139.8805,10.79944 15.2714,8.15417 30.4649,23.90227 39.0915,30.01622 28.7973,20.40957 27.1416,116.14997 14.2467,145.53237 -10.1188,23.0568 -23.252,31.0254 -63.9938,40.183 -40.7418,9.1577 -115.6983,13.464 -140.7432,4.9601 -25.045,-8.5039 -102.8614,-3.0865 -106.8828,-61.3897 -7.2191,-104.663 12.1507,-136.10944 59.2595,-154.03867 26.5573,-10.10749 59.1416,-16.06276 59.1416,-16.06276 z"
         style="fill:#ffffff;stroke:none;stroke-width:1" />
      <path
         sodipodi:nodetypes="cscccsc"
         inkscape:connector-curvature="0"
         id="path3365-6"
         d="m 4905.1222,1332.9077 c -166.3352,-2.9996 -220.2828,-11.4827 -212.7392,-167.961 7.4558,-154.6564 62.36,-194.30634 151.8783,-197.39464 86.9037,-3.08819 154.5086,16.01507 172.0646,58.90884 20.2832,45.8237 12.8475,98.6049 18.9072,139.7183 9.3188,35.253 5.1904,108.8256 -13.0419,128.7713 -18.1675,19.875 -83.1753,38.8089 -117.069,37.9572 z"
         style="color:#000000;display:inline;overflow:visible;visibility:visible;fill:#ffffff;fill-opacity:1;fill-rule:nonzero;stroke:none;stroke-width:1px;marker:none;enable-background:accumulate" />
      <path
         inkscape:connector-curvature="0"
         id="path5002-2"
         d="m 3860.3641,1293.2646 c -70.0617,-6.5837 -91.3329,-16.7984 -111.4751,-72.4567 -20.1421,-55.6582 0.6832,-59.9839 0.6832,-59.9839 0,0 10.9679,110.8571 110.7919,132.4406 z"
         style="color:#000000;display:inline;overflow:visible;visibility:visible;fill:#ffffff;fill-opacity:1;fill-rule:nonzero;stroke:none;stroke-width:1px;marker:none;enable-background:accumulate" />
      <path
         sodipodi:nodetypes="csccc"
         inkscape:connector-curvature="0"
         id="path3072-9"
         d="m 4720.6945,1357.7928 c 37.4574,14.4492 67.4988,-7.5666 86.7222,-51.9063 19.2234,-44.3397 35.3495,-35.8085 35.3495,-35.8085 l 5.0926,33.3889 c 0,0 -35.4044,96.209 -127.1643,54.3259 z"
         style="color:#000000;display:inline;overflow:visible;visibility:visible;fill:#ffffff;fill-opacity:1;fill-rule:nonzero;stroke:none;stroke-width:1px;marker:none;enable-background:accumulate" />
      <path
         sodipodi:nodetypes="cssssc"
         inkscape:connector-curvature="0"
         id="path4546-1"
         d="m 2735.3217,2336.5878 c -10.231,-126.8877 -118.9059,-208.2012 256.3684,-218.3971 101.2488,-2.7508 261.7472,5.8498 277.8913,191.5831 16.1439,185.7331 -190.7303,177.1658 -223.7626,185.7935 -33.0322,8.628 -189.3075,10.624 -241.3705,-37.2555 -29.2418,-26.892 -64.7011,-82.5873 -69.1266,-121.724 z"
         style="color:#000000;display:inline;overflow:visible;visibility:visible;fill:#ffffff;fill-opacity:1;fill-rule:nonzero;stroke:none;stroke-width:1px;marker:none;enable-background:accumulate" />
      <path
         sodipodi:nodetypes="cccccsc"
         inkscape:connector-curvature="0"
         id="path3970-2"
         d="m 3604.987,2657.2923 c -73.2697,4.1556 -181.1847,11.3943 -214.2067,-41.7542 -33.0218,-53.1483 -54.1538,-153.0258 -19.722,-192.2613 34.4316,-39.2356 106.1481,-69.0859 170.1908,-70.2849 64.0426,-1.1992 155.0066,10.0938 186.0551,59.9793 31.0486,49.8852 57.0667,178.9897 -17.4217,216.1016 -74.4885,37.1119 -104.8955,28.2195 -104.8955,28.2195 z"
         style="color:#000000;display:inline;overflow:visible;visibility:visible;fill:#ffffff;fill-opacity:1;fill-rule:nonzero;stroke:none;stroke-width:0.94762748px;marker:none;enable-background:accumulate" />
      <path
         sodipodi:nodetypes="cscccsc"
         inkscape:connector-curvature="0"
         id="path3970-4-7"
         d="m 3637.9173,2970.9486 c -51.7479,3.1643 -151.383,-4.8231 -174.7052,-45.2931 -23.3222,-40.4698 -31.2753,-95.1476 -6.9574,-125.0235 24.3179,-29.8759 91.4156,-60.48 136.6467,-61.393 45.231,-0.9132 122.8553,16.1037 144.7837,54.0891 21.9286,37.9851 27.5229,127.2922 -25.0856,155.551 -52.6086,28.2589 -74.6822,22.0695 -74.6822,22.0695 z"
         style="color:#000000;display:inline;overflow:visible;visibility:visible;fill:#ffffff;fill-opacity:1;fill-rule:nonzero;stroke:none;stroke-width:0.99999994px;marker:none;enable-background:accumulate" />
      <path
         sodipodi:nodetypes="cccc"
         inkscape:connector-curvature="0"
         id="path4278-0"
         d="m 3016.4895,2597.7315 c -63.2798,-44.5839 -68.7917,-98.8369 -22.9954,-144.2951 18.9077,-28.5006 -29.4914,-44.6932 -49.4681,0.8803 2.5232,18.0735 -60.406,94.8559 72.4635,143.4148 z"
         style="fill:#ffffff;fill-rule:evenodd;stroke:none;stroke-width:1px;stroke-linecap:butt;stroke-linejoin:miter;stroke-opacity:1" />
      <path
         inkscape:connector-curvature="0"
         id="path3072-5-9"
         d="m 3429.9034,2714.3081 c 40.5621,-7.5931 54.447,-12.612 63.6788,-60.0495 9.2317,-47.4376 26.8159,-42.5763 26.8159,-42.5763 l 12.1581,31.5107 c 0,0 -26.7461,99.3801 -102.6528,71.1151 z"
         style="color:#000000;display:inline;overflow:visible;visibility:visible;fill:#ffffff;fill-opacity:1;fill-rule:nonzero;stroke:none;stroke-width:1px;marker:none;enable-background:accumulate" />
      <path
         sodipodi:nodetypes="cccccc"
         inkscape:connector-curvature="0"
         id="path4538-3"
         d="m 3370.4308,2767.117 c 13.5375,25.922 17.1106,27.7378 31.3654,24.668 14.2547,-3.0698 33.6091,-12.0109 55.9747,2.2648 85.0159,12.9082 80.7353,107.8259 -11.6295,20.8012 -13.9443,-12.1116 -41.4305,-1.2204 -54.3516,-8.5806 -12.9211,-7.3602 -17.6517,-25.6325 -21.359,-39.1534 z"
         style="color:#000000;display:inline;overflow:visible;visibility:visible;fill:#ffffff;fill-opacity:1;fill-rule:nonzero;stroke:none;stroke-width:1px;marker:none;enable-background:accumulate" />
      <path
         sodipodi:nodetypes="cccccccccccccccccccccccccccccccccccccccccccccccccccccccccccccccccc"
         inkscape:connector-curvature="0"
         id="path1504-6"
         d="m 3958.0269,3081.0386 c 0.5813,12.9911 -0.1155,29.3109 -10.1477,37.2763 -12.2245,6.4063 -24.7468,-3.8764 -34.5489,-11.6501 -3.2136,-3.3987 0.567,4.1739 0.3075,6.0844 2.3757,11.4983 3.7029,26.9623 -5.0769,35.1359 -10.8307,7.9162 -24.4937,1.1236 -34.7257,-3.9217 4.2332,13.0498 9.3878,29.445 2.1813,42.3496 -4.7404,6.0283 -12.7854,5.8775 -18.7845,4.6123 4.7176,9.6574 5.305,25.4396 -4.4616,30.9538 -4.4232,3.0988 -11.1969,2.4753 -14.9846,2.6426 8.2788,10.1986 15.8713,26.4789 9.2605,40.2527 -3.6256,6.9583 -9.7281,11.4756 -15.9414,14.6443 9.693,1.8155 21.9469,8.5541 22.0215,21.9512 0.3191,7.6951 -5.0941,15.7171 -7.8821,20.2188 11.292,-4.5356 25.095,-9.9936 36.1463,-2.0917 5.0124,5.3798 6.2581,14.0405 5.3869,21.6623 11.5882,-8.3658 23.682,-3.8489 37.6304,2.3149 8.5164,5.2942 12.9879,16.3379 15.1174,26.9649 15.1154,-12.7815 33.2964,-27.6199 52.8611,-21.7444 13.8582,4.7287 22.4233,19.7003 31.1496,32.1356 4.2429,-13.5432 12.1251,-29.2527 25.5454,-30.6448 13.3223,1.1076 19.5972,17.537 25.8994,29.1065 1.224,5.8753 4.4561,10.3795 5.6983,7.7673 5.5996,-14.142 13.2048,-30.4664 26.9723,-34.5812 14.3851,-0.8844 24.1397,14.5875 31.9334,26.6433 3.2616,-14.8272 9.9277,-32.4533 23.9879,-35.8104 13.9866,-0.4583 22.8029,15.1826 29.2864,27.6779 2.961,4.9625 5.3771,10.3418 8.2763,15.3523 2.2869,-12.9929 7.4917,-38.945 20.0578,-39.2519 11.7461,0.052 20.9604,10.1312 29.556,18.2764 0.1001,-14.5872 12.806,-28.1749 25.1618,-23.2676 15.8127,3.9522 30.4893,2.4187 43.8765,12.0825 -3.9128,-10.9655 -7.2106,-27.2794 2.215,-35.7131 5.3029,-3.9448 11.9885,-3.3813 17.8276,-1.7378 -5.5296,-11.6939 -4.8601,-29.4604 5.9685,-36.5257 5.8918,-4.6904 13.0441,-6.1483 19.7224,-8.5013 -12.0176,-10.0611 -30.7399,-22.9831 -27.2901,-41.7022 1.1764,-8.3917 13.7111,-19.9055 16.6406,-25.6178 -31.7212,12.507 -30.1408,-5.8848 -10.4701,-26.0199 2.3972,-5.0786 1.3422,-4.9948 -2.6561,-1.5723 -10.8675,7.345 -22.6153,16.4165 -35.5788,15.5457 -9.5179,-4.9276 -6.7622,-30.5608 -0.3655,-38.6152 -14.6385,6.7275 -30.8964,14.9361 -46.7999,9.5906 -10.3394,-7.8892 -9.0972,-25.4399 -4.1707,-36.9146 1.7964,-4.6952 -0.6153,-1.5878 -2.8536,0.6108 -8.5315,8.1455 -18.4495,17.5474 -29.8955,17.2619 -10.6727,-4.0479 -12.8124,-20.5351 -9.1594,-31.5247 0.031,-2.7486 2.7116,-10.5548 -0.8219,-5.0259 -6.8593,8.0724 -18.5035,28.815 -28.8956,26.118 -5.0555,-2.3691 -5.7486,-19.4672 -7.3013,-25.3751 -4.9597,9.421 -16.1364,30.0565 -26.5499,26.0952 -9.6126,-5.1211 -10.9581,-19.2923 -11.2543,-30.2607 -3.4549,10.1119 -10.159,17.8605 -20.8402,18.3579 -11.1475,-1.1515 -15.9071,-43.457 -18.4137,-54.5183 -0.7748,-3.4327 -3.9334,-10.9956 -2.4613,5.4623 -3.0816,9.5415 -9.7221,48.8833 -19.5196,45.9381 -11.945,-4.8503 -13.4087,-14.5478 -16.9483,-26.9425 -2.9509,10.9983 -10.1927,24.3151 -21.2903,22.9935 -13.6655,-2.9839 -19.0043,-21.1641 -24.9428,-33.28 -1.0086,14.1137 -4.2124,31.677 -16.1078,38.266 -12.0754,3.4563 -21.7304,-9.2767 -27.5434,-20.1288 -4.3604,-6.7516 -8.2524,-13.9032 -12.0889,-21.0789 l 0.064,1.2742 z m 181.5579,298.0828 c 0,0.018 0.013,-0.062 0,0 z"
         style="fill:#ffffff;fill-rule:evenodd;stroke:none;stroke-width:1.12599003px;stroke-linecap:butt;stroke-linejoin:miter;stroke-opacity:1" />
      <path
         sodipodi:nodetypes="csssscssssssc"
         inkscape:connector-curvature="0"
         id="path3023-0"
         d="m 4122.6378,2930.2307 c 13.6365,51.0487 1.8285,73.4399 -12.8291,87.351 -14.6575,13.9112 -29.2574,24.6287 -30.4169,39.0049 -1.1585,14.3763 4.3679,32.4449 9.991,45.1906 5.6233,12.7459 -8.7567,28.7391 -16.1641,41.0823 -7.4074,12.3434 -32.4176,87.9891 -32.4176,87.9891 0,0 45.6605,-29.3056 57.0155,-43.5686 11.3552,-14.2629 -1.5936,-24.3112 1.6003,-31.5097 3.1938,-7.1984 16.2252,-28.4819 13.3417,-43.3703 -2.8832,-14.8884 -6.8861,-37.3598 -11.1969,-47.9831 -4.3108,-10.6233 8.1814,-20.8918 17.4263,-34.2439 9.2448,-13.3519 26.0549,-36.6775 19.2727,-60.0623 -6.7821,-23.3848 -15.6229,-39.88 -15.6229,-39.88 z"
         style="fill:#ffffff;stroke:none;stroke-width:0.99999994" />
      <path
         sodipodi:nodetypes="zsssssssz"
         inkscape:connector-curvature="0"
         id="path3373-6"
         d="m 4475.1126,2297.9153 c -1.7851,-38.0564 -1.1108,-75.183 73.8621,-100.0361 74.9731,-24.8531 206.044,-12.5854 233.8709,-10.8732 45.4203,2.7946 165.0863,9.9363 191.8623,37.8962 26.7761,27.9597 30.7956,61.2059 28.085,91.3412 -2.4971,27.7618 -14.3082,67.5414 -46.4395,76.8613 -32.1314,9.32 -262.0499,23.1758 -299.5364,16.9626 -37.4865,-6.2132 -95.3203,-14.9135 -127.4513,-33.5534 -32.5747,-18.897 -52.4681,-40.5422 -54.2531,-78.5986 z"
         style="color:#000000;display:inline;overflow:visible;visibility:visible;fill:#ffffff;fill-opacity:1;fill-rule:nonzero;stroke:none;stroke-width:1px;marker:none;enable-background:accumulate" />
      <path
         sodipodi:nodetypes="csccc"
         inkscape:connector-curvature="0"
         id="path3072-1-2"
         d="m 4701.7285,2488.9085 c 30.9235,-44.7181 56.4448,-90.7801 41.0641,-127.8508 -21.7419,-52.4025 -15.1545,-27.3052 -15.1545,-27.3052 l 48.1596,27.1477 c 4.0617,-2.2231 16.5042,46.8286 -74.0692,128.0083 z"
         style="color:#000000;display:inline;overflow:visible;visibility:visible;fill:#ffffff;fill-opacity:1;fill-rule:nonzero;stroke:none;stroke-width:1px;marker:none;enable-background:accumulate" />
      <path
         sodipodi:nodetypes="scccccs"
         inkscape:connector-curvature="0"
         id="path3008-6"
         d="m 4439.247,3238.9148 c 3.8546,-82.4794 41.3235,-122.0071 95.0114,-142.1316 53.6879,-20.1246 370.1638,-14.5343 434.2911,7.8264 64.1269,22.3607 69.3441,79.8897 71.6455,143.2494 0.8717,73.3656 -74.5044,104.2317 -111.7878,113.1759 -37.2831,8.9443 -360.2233,16.077 -440.1927,-16.8413 -35.806,-20.1883 -51.6279,-48.3531 -48.9675,-105.2788 z"
         style="display:inline;fill:#ffffff;stroke:none;stroke-width:0.99999994" />
      <path
         inkscape:transform-center-y="119.77252"
         inkscape:transform-center-x="86.439437"
         sodipodi:nodetypes="ccscc"
         inkscape:connector-curvature="0"
         id="path4064-1"
         d="m 4716.3703,3119.4571 c 31.2021,-26.3616 74.0861,-59.4473 33.587,-95.3422 1.3128,2.6276 75.7675,26.7026 -7.7455,112.4393 -83.5133,85.7365 -101.538,90.3039 -101.538,90.3039 z"
         style="color:#000000;display:inline;overflow:visible;visibility:visible;fill:#ffffff;fill-opacity:1;fill-rule:nonzero;stroke:none;stroke-width:1px;marker:none;enable-background:accumulate" />
      <g
         style="display:inline;fill:#ffffff;stroke-width:0.82700133"
         transform="matrix(-1.943999,-0.03507888,0.02110171,-1.1694129,5484.6774,4691.0481)"
         id="g5381-8">
        <path
           sodipodi:nodetypes="cscccccccccccccssccccccsssssscssccc"
           style="color:#000000;display:inline;overflow:visible;visibility:visible;fill:#ffffff;fill-opacity:1;fill-rule:nonzero;stroke:none;stroke-width:0.82700133px;marker:none;enable-background:accumulate"
           d="m 1231.4261,3164.2107 c -4.7051,-6.6655 -8.3522,-20.2367 -8.3522,-21.805 0,-1.5684 0.3921,-7.4497 0.3921,-7.4497 l -3.1367,-1.1763 2.7446,-5.0971 -3.1367,0.3921 c 0,0 8.4753,-16.4011 10.0436,-19.1457 1.5684,-2.7446 4.313,-9.018 4.313,-9.018 0,0 11.2013,-0.9423 14.338,-2.1186 3.1367,-1.1762 12.5468,-11.3705 12.5468,-11.3705 0,0 11.3706,5.4892 15.6836,6.2734 4.3129,0.7842 24.3095,1.9604 27.8383,0 3.5288,-1.9605 7.0576,-4.7051 7.0576,-4.7051 0,0 9.018,-0.7841 11.3705,-1.9604 2.3526,-1.1763 6.6655,-3.9209 6.6655,-3.9209 0,0 7.4497,0.7842 10.5864,0.3921 3.1367,-0.3921 17.644,0 19.2124,0 1.5683,0 12.5468,6.6655 12.5468,6.6655 l 7.0576,6.6655 c 0,0 5.8813,-0.3921 8.626,-1.1763 2.7446,-0.7841 5.0971,3.1367 5.0971,3.1367 0,0 10.3649,28.9788 11.9333,33.6838 1.5683,4.7051 2.3525,14.1152 2.3525,14.1152 0,0 -4.313,7.4497 -6.6655,10.5864 -2.3525,3.1367 -9.018,10.5864 -12.5468,13.331 -3.5288,2.7446 -7.8418,7.0576 -12.1548,4.313 -4.313,-2.7446 -8.6259,-2.3525 -10.1943,-0.3921 -1.5684,1.9604 -12.9389,15.6836 -16.8598,14.1152 -3.9209,-1.5684 -17.2519,-3.9209 -21.1728,-7.4497 -3.9209,-3.5288 -10.1943,4.7051 -12.9389,2.3525 -2.7446,-2.3525 -6.6655,-6.6655 -9.4102,-6.6655 -2.7446,0 -40.639,11.3296 -44.5599,9.7612 -3.9209,-1.5684 -13.5936,-9.7859 -15.9461,-11.3542 -2.3526,-1.5684 -8.2339,-10.9785 -8.2339,-10.9785 z"
           id="path5263-7"
           inkscape:connector-curvature="0" />
      </g>
      <path
         sodipodi:nodetypes="cccccccccc"
         inkscape:connector-curvature="0"
         id="path4448-7-9"
         d="m 2884.7473,1011.6689 c 6.8044,0.878 -13.0137,58.3529 -13.0137,58.3529 0,0 37.5799,20.9895 40.5767,25.605 -3.1203,14.3994 -21.4485,49.3771 -21.4485,49.3771 l 47.969,66.5041 -32.2731,-66.6621 30.2253,-55.2358 -42.6407,-25.4823 18.4892,-41.6529 z"
         style="color:#000000;display:inline;overflow:visible;visibility:visible;fill:#ffffff;fill-opacity:1;fill-rule:nonzero;stroke:none;stroke-width:1px;marker:none;enable-background:accumulate" />
      <path
         sodipodi:nodetypes="ccccccccccccccc"
         inkscape:connector-curvature="0"
         id="path3549-3-78-2"
         d="m 3851.2601,1245.9083 c -13.8665,-3.5055 -55.1437,-19.0159 -6.106,-17.5657 -59.3797,-25.0538 -32.5866,-43.8491 -10.6916,-63.0001 -18.1994,-6.138 -47.6034,-8.1294 -37.3738,-24.7898 -19.517,1.4993 -31.4964,-4.8263 -36.7506,-18.1339 -14.8623,16.6729 -27.349,19.2808 -33.8988,-13.2573 -5.9732,24.2527 -19.7877,28.8493 -57.7987,-1.6874 -2.7979,8.899 11.5979,29.2427 -92.8673,14.4217 31.062,16.9622 71.3389,54.7798 -4.0211,72.0652 26.9384,7.6306 44.1175,17.9678 2.133,34.3899 27.2039,5.1866 25.2378,27.2561 17.9789,35.0755 34.4562,-14.845 53.7779,-13.3862 52.4848,8.8739 63.6065,-34.4878 49.1991,-4.5663 62.3294,2.0745 25.1052,-28.2285 46.7116,-14.0788 69.7714,-7.7794 7.3512,-33.4408 43.8059,-20.6979 74.8104,-20.6871 z"
         style="color:#000000;display:inline;overflow:visible;visibility:visible;fill:#ffffff;fill-opacity:1;fill-rule:nonzero;stroke:none;stroke-width:1px;marker:none;enable-background:accumulate" />
      <text
         transform="matrix(0.99628009,-0.49104872,-0.18392799,1.3011878,4063.5307,-1206.3033)"
         id="text4580-0"
         y="1584.5073"
         x="787.65729"
         style="font-style:normal;font-variant:normal;font-weight:normal;font-stretch:normal;line-height:0%;font-family:Lavi;-inkscape-font-specification:Lavi;letter-spacing:0px;word-spacing:0px;fill:#000000;fill-opacity:1;stroke:#000000;stroke-width:1.03244162;stroke-miterlimit:4;stroke-dasharray:none;stroke-opacity:1;filter:url(#filter4375-4-1-1-1-9-3)"
         xml:space="preserve"><tspan
           style="font-size:70px;line-height:1.25;fill:#ffffff;stroke-width:1.03244162"
           y="1584.5073"
           x="787.65729"
           id="tspan4582-2"
           sodipodi:role="line"><tspan
             id="tspan4617-3"
             style="font-size:80.40014648px;stroke-width:1.03244162">Slamre!</tspan></tspan></text>
      <text
         id="text4246-7-6-2-04-75"
         y="1016.8446"
         x="3693.3796"
         style="font-style:normal;font-variant:normal;font-weight:normal;font-stretch:normal;line-height:0%;font-family:Lavi;-inkscape-font-specification:Lavi;text-align:center;letter-spacing:0px;word-spacing:0px;text-anchor:middle;fill:#000000;fill-opacity:1;stroke:none;stroke-width:1.60000002;stroke-miterlimit:4;stroke-dasharray:none"
         xml:space="preserve"><tspan
           id="tspan1010-9"
           y="1016.8446"
           x="3693.3796"
           style="font-size:45px;line-height:1.25;stroke:none;stroke-width:1.60000002;stroke-miterlimit:4;stroke-dasharray:none;stroke-opacity:1"
           sodipodi:role="line">En vinter</tspan><tspan
           id="tspan906"
           y="1073.0946"
           x="3693.3796"
           style="font-size:45px;line-height:1.25;stroke:none;stroke-width:1.60000002;stroke-miterlimit:4;stroke-dasharray:none;stroke-opacity:1"
           sodipodi:role="line">UTEN</tspan><tspan
           id="tspan908"
           y="1129.3446"
           x="3693.3796"
           style="font-size:45px;line-height:1.25;stroke:none;stroke-width:1.60000002;stroke-miterlimit:4;stroke-dasharray:none;stroke-opacity:1"
           sodipodi:role="line">vennskapstre?!</tspan></text>
      <text
         id="text4246-7-6-2-04-3-2"
         y="1041.676"
         x="4866.5757"
         style="font-style:normal;font-variant:normal;font-weight:normal;font-stretch:normal;line-height:0%;font-family:Lavi;-inkscape-font-specification:Lavi;text-align:center;letter-spacing:0px;word-spacing:0px;text-anchor:middle;fill:#000000;fill-opacity:1;stroke:none;stroke-width:1.60000002;stroke-miterlimit:4;stroke-dasharray:none"
         xml:space="preserve"><tspan
           id="tspan936"
           y="1041.676"
           x="4866.5757"
           style="font-size:45px;line-height:1.25;stroke:none;stroke-width:1.60000002;stroke-miterlimit:4;stroke-dasharray:none;stroke-opacity:1"
           sodipodi:role="line">Kanskje jeg</tspan><tspan
           id="tspan940"
           y="1097.926"
           x="4866.5757"
           style="font-size:45px;line-height:1.25;stroke:none;stroke-width:1.60000002;stroke-miterlimit:4;stroke-dasharray:none;stroke-opacity:1"
           sodipodi:role="line">skal lage mitt</tspan><tspan
           id="tspan942"
           y="1154.176"
           x="4866.5757"
           style="font-size:45px;line-height:1.25;stroke:none;stroke-width:1.60000002;stroke-miterlimit:4;stroke-dasharray:none;stroke-opacity:1"
           sodipodi:role="line">eget tre fra</tspan><tspan
           id="tspan944"
           y="1210.426"
           x="4866.5757"
           style="font-size:45px;line-height:1.25;stroke:none;stroke-width:1.60000002;stroke-miterlimit:4;stroke-dasharray:none;stroke-opacity:1"
           sodipodi:role="line">bunnen av ved</tspan><tspan
           id="tspan954"
           y="1266.676"
           x="4866.5757"
           style="font-size:45px;line-height:1.25;stroke:none;stroke-width:1.60000002;stroke-miterlimit:4;stroke-dasharray:none;stroke-opacity:1"
           sodipodi:role="line">hjelp av magi?!</tspan></text>
      <text
         id="text4246-7-6-2-04-3-5-2"
         y="2238.5654"
         x="2999.7085"
         style="font-style:normal;font-variant:normal;font-weight:normal;font-stretch:normal;line-height:0%;font-family:Lavi;-inkscape-font-specification:Lavi;text-align:center;letter-spacing:0px;word-spacing:0px;text-anchor:middle;fill:#000000;fill-opacity:1;stroke:none;stroke-width:1.60000002;stroke-miterlimit:4;stroke-dasharray:none"
         xml:space="preserve"><tspan
           id="tspan999"
           y="2238.5654"
           x="2999.7085"
           style="font-size:45px;line-height:1.25;stroke:none;stroke-width:1.60000002;stroke-miterlimit:4;stroke-dasharray:none;stroke-opacity:1"
           sodipodi:role="line">Ja! Kanskje jeg til og</tspan><tspan
           id="tspan1009"
           y="2294.8154"
           x="2999.7085"
           style="font-size:45px;line-height:1.25;stroke:none;stroke-width:1.60000002;stroke-miterlimit:4;stroke-dasharray:none;stroke-opacity:1"
           sodipodi:role="line">med kan kombinere</tspan><tspan
           id="tspan1001"
           y="2351.0654"
           x="2999.7085"
           style="font-size:45px;line-height:1.25;stroke:none;stroke-width:1.60000002;stroke-miterlimit:4;stroke-dasharray:none;stroke-opacity:1"
           sodipodi:role="line">Hippia- og Kaosiamagi</tspan><tspan
           id="tspan1003"
           y="2407.3154"
           x="2999.7085"
           style="font-size:45px;line-height:1.25;stroke:none;stroke-width:1.60000002;stroke-miterlimit:4;stroke-dasharray:none;stroke-opacity:1"
           sodipodi:role="line">for første gang</tspan><tspan
           id="tspan1005"
           y="2463.5654"
           x="2999.7085"
           style="font-size:45px;line-height:1.25;stroke:none;stroke-width:1.60000002;stroke-miterlimit:4;stroke-dasharray:none;stroke-opacity:1"
           sodipodi:role="line">noensinne!</tspan><tspan
           id="tspan1139-89"
           y="2482.0989"
           x="2999.7085"
           style="font-size:45px;line-height:1.25;stroke:none;stroke-width:1.60000002;stroke-miterlimit:4;stroke-dasharray:none;stroke-opacity:1"
           sodipodi:role="line" /></text>
      <text
         id="text4246-7-6-2-04-3-5-0-73"
         y="2423.761"
         x="3561.1292"
         style="font-style:normal;font-variant:normal;font-weight:normal;font-stretch:normal;line-height:0%;font-family:Lavi;-inkscape-font-specification:Lavi;text-align:center;letter-spacing:0px;word-spacing:0px;text-anchor:middle;fill:#000000;fill-opacity:1;stroke:none;stroke-width:1.60000002;stroke-miterlimit:4;stroke-dasharray:none"
         xml:space="preserve"><tspan
           id="tspan1263-6"
           y="2423.761"
           x="3561.1292"
           style="font-size:45px;line-height:1.25;stroke:none;stroke-width:1.60000002;stroke-miterlimit:4;stroke-dasharray:none;stroke-opacity:1"
           sodipodi:role="line">Et digert</tspan><tspan
           id="tspan1030"
           y="2480.011"
           x="3561.1292"
           style="font-size:45px;line-height:1.25;stroke:none;stroke-width:1.60000002;stroke-miterlimit:4;stroke-dasharray:none;stroke-opacity:1"
           sodipodi:role="line">grønt tre opplyst</tspan><tspan
           id="tspan1034"
           y="2536.261"
           x="3561.1292"
           style="font-size:45px;line-height:1.25;stroke:none;stroke-width:1.60000002;stroke-miterlimit:4;stroke-dasharray:none;stroke-opacity:1"
           sodipodi:role="line">av ministjerner og</tspan><tspan
           id="tspan1038"
           y="2592.511"
           x="3561.1292"
           style="font-size:45px;line-height:1.25;stroke:none;stroke-width:1.60000002;stroke-miterlimit:4;stroke-dasharray:none;stroke-opacity:1"
           sodipodi:role="line">mini solsystemer!</tspan></text>
      <text
         transform="scale(1.0118702,0.98826905)"
         id="text4246-7-6-2-04-3-5-0-7-1"
         y="2850.2188"
         x="3553.3296"
         style="font-style:normal;font-variant:normal;font-weight:normal;font-stretch:normal;font-size:10.77101231px;line-height:0%;font-family:Lavi;-inkscape-font-specification:Lavi;text-align:center;letter-spacing:0px;word-spacing:0px;text-anchor:middle;fill:#000000;fill-opacity:1;stroke:none;stroke-width:1.60000002;stroke-miterlimit:4;stroke-dasharray:none"
         xml:space="preserve"><tspan
           id="tspan1139-8-9-2"
           y="2850.2188"
           x="3553.3296"
           style="font-size:40.39129639px;line-height:1.25;stroke:none;stroke-width:1.60000002;stroke-miterlimit:4;stroke-dasharray:none;stroke-opacity:1"
           sodipodi:role="line">Ååååh</tspan><tspan
           id="tspan1257-9"
           y="2900.7078"
           x="3553.3296"
           style="font-size:40.39129639px;line-height:1.25;stroke:none;stroke-width:1.60000002;stroke-miterlimit:4;stroke-dasharray:none;stroke-opacity:1"
           sodipodi:role="line">Det hadde vært</tspan><tspan
           id="tspan1046"
           y="2951.197"
           x="3553.3296"
           style="font-size:40.39129639px;line-height:1.25;stroke:none;stroke-width:1.60000002;stroke-miterlimit:4;stroke-dasharray:none;stroke-opacity:1"
           sodipodi:role="line">helt nydelig!</tspan></text>
      <text
         id="text4246-3"
         y="3183.1091"
         x="4080.092"
         style="font-style:normal;font-variant:normal;font-weight:normal;font-stretch:normal;line-height:0%;font-family:Lavi;-inkscape-font-specification:Lavi;text-align:center;letter-spacing:0px;word-spacing:0px;text-anchor:middle;fill:#000000;fill-opacity:1;stroke:none"
         xml:space="preserve"><tspan
           id="tspan4252-19"
           y="3183.1091"
           x="4080.092"
           style="font-size:45px;line-height:1.25"
           sodipodi:role="line">Dessuten hadde</tspan><tspan
           id="tspan1050"
           y="3239.3591"
           x="4080.092"
           style="font-size:45px;line-height:1.25"
           sodipodi:role="line">det vært</tspan></text>
      <text
         transform="skewX(-14.861122)"
         id="text4246-6-4"
         y="3317.6145"
         x="4955.7173"
         style="font-style:normal;font-variant:normal;font-weight:normal;font-stretch:normal;line-height:0%;font-family:Lavi;-inkscape-font-specification:Lavi;text-align:center;letter-spacing:0px;word-spacing:0px;text-anchor:middle;fill:#000000;fill-opacity:1;stroke:none"
         xml:space="preserve"><tspan
           id="tspan4252-1-7"
           y="3317.6145"
           x="4955.7173"
           style="font-size:74.66666412px;line-height:1.25"
           sodipodi:role="line">kreativt!</tspan></text>
      <text
         id="text4246-2-8"
         y="2267.3374"
         x="4736.6138"
         style="font-style:normal;font-variant:normal;font-weight:normal;font-stretch:normal;line-height:0%;font-family:Lavi;-inkscape-font-specification:Lavi;text-align:center;letter-spacing:0px;word-spacing:0px;text-anchor:middle;fill:#000000;fill-opacity:1;stroke:none"
         xml:space="preserve"><tspan
           id="tspan1426-4"
           y="2267.3374"
           x="4736.6138"
           style="font-size:45px;line-height:1.25"
           sodipodi:role="line">Men det lar seg umulig</tspan><tspan
           id="tspan1094"
           y="2323.5874"
           x="4736.6138"
           style="font-size:45px;line-height:1.25"
           sodipodi:role="line">gjøre å utføre denslags</tspan><tspan
           id="tspan1096"
           y="2379.8374"
           x="4736.6138"
           style="font-size:45px;line-height:1.25"
           sodipodi:role="line">magi her...</tspan></text>
      <text
         id="text4246-2-3-5"
         y="3150.2039"
         x="4727.7271"
         style="font-style:normal;font-variant:normal;font-weight:normal;font-stretch:normal;line-height:0%;font-family:Lavi;-inkscape-font-specification:Lavi;text-align:center;letter-spacing:0px;word-spacing:0px;text-anchor:middle;fill:#000000;fill-opacity:1;stroke:none"
         xml:space="preserve"><tspan
           id="tspan1436-0"
           y="3150.2039"
           x="4727.7271"
           style="font-size:45px;line-height:1.25"
           sodipodi:role="line">...gudmødrene mine</tspan><tspan
           id="tspan1071"
           y="3168.7373"
           x="4727.7271"
           style="font-size:45px;line-height:1.25"
           sodipodi:role="line" /><tspan
           id="tspan1073"
           y="3206.4539"
           x="4727.7271"
           style="font-size:45px;line-height:1.25"
           sodipodi:role="line">merker umiddelbart om</tspan><tspan
           id="tspan1075"
           y="3262.7039"
           x="4727.7271"
           style="font-size:45px;line-height:1.25"
           sodipodi:role="line">jeg ikke studerer mine</tspan><tspan
           id="tspan1064"
           y="3318.9539"
           x="4727.7271"
           style="font-size:45px;line-height:1.25"
           sodipodi:role="line">&quot;Formler for knusemagi&quot;.</tspan></text>
      <text
         transform="matrix(1.0148684,-0.23351779,-0.23771225,1.0400462,0,0)"
         id="text4246-8-36"
         y="1598.0092"
         x="4496.2017"
         style="font-style:normal;font-variant:normal;font-weight:normal;font-stretch:normal;font-size:9.86460209px;line-height:0%;font-family:Lavi;-inkscape-font-specification:Lavi;text-align:center;letter-spacing:0px;word-spacing:0px;text-anchor:middle;opacity:0.553;fill:#ffffff;fill-opacity:1;stroke:#ffffff;stroke-width:0.41015577;stroke-miterlimit:4;stroke-dasharray:none;stroke-opacity:1"
         xml:space="preserve"><tspan
           id="tspan4150-8-1"
           y="1598.0092"
           x="4496.2017"
           style="font-size:25.28764343px;line-height:1.25;fill:#ffffff;stroke:#ffffff;stroke-width:0.41015577;stroke-miterlimit:4;stroke-dasharray:none;stroke-opacity:1"
           sodipodi:role="line">tapp</tspan></text>
      <text
         transform="matrix(1.0294788,0.15704104,-0.60436617,0.87917276,0,0)"
         id="text4246-8-3-0"
         y="78.030945"
         x="2995.3801"
         style="font-style:normal;font-variant:normal;font-weight:normal;font-stretch:normal;font-size:9.86460209px;line-height:0%;font-family:Lavi;-inkscape-font-specification:Lavi;text-align:center;letter-spacing:0px;word-spacing:0px;text-anchor:middle;opacity:0.553;fill:#ffffff;fill-opacity:1;stroke:#ffffff;stroke-width:0.41015577;stroke-miterlimit:4;stroke-dasharray:none;stroke-opacity:1"
         xml:space="preserve"><tspan
           id="tspan4150-8-6-6"
           y="78.030945"
           x="2995.3801"
           style="font-size:25.28764343px;line-height:1.25;fill:#ffffff;stroke:#ffffff;stroke-width:0.41015577;stroke-miterlimit:4;stroke-dasharray:none;stroke-opacity:1"
           sodipodi:role="line">Ffff</tspan></text>
      <text
         transform="skewX(-10.479117)"
         id="text4246-7-6-2-04-7-3"
         y="1178.8876"
         x="3931.6199"
         style="font-style:normal;font-variant:normal;font-weight:normal;font-stretch:normal;font-size:13.87211895px;line-height:0%;font-family:Lavi;-inkscape-font-specification:Lavi;text-align:center;letter-spacing:0px;word-spacing:0px;text-anchor:middle;fill:#000000;fill-opacity:1;stroke:#000000;stroke-width:1.60000002;stroke-miterlimit:4;stroke-dasharray:none;stroke-opacity:1"
         xml:space="preserve"><tspan
           id="tspan1006-5-2"
           y="1182.9196"
           x="3931.6199"
           style="font-size:52.02044678px;line-height:1.25;stroke:#000000;stroke-width:1.60000002;stroke-miterlimit:4;stroke-dasharray:none;stroke-opacity:1"
           sodipodi:role="line" /><tspan
           id="tspan1008-6-0"
           y="1182.9196"
           x="3931.6199"
           style="font-size:52.02044678px;line-height:1.25;stroke:#000000;stroke-width:1.60000002;stroke-miterlimit:4;stroke-dasharray:none;stroke-opacity:1"
           sodipodi:role="line" /><tspan
           id="tspan1010-2-6"
           y="1226.5201"
           x="3931.6199"
           style="font-size:52.02044678px;line-height:1.25;stroke:#000000;stroke-width:1.60000002;stroke-miterlimit:4;stroke-dasharray:none;stroke-opacity:1"
           sodipodi:role="line">Aldri!</tspan></text>
      <text
         transform="skewX(-26.235822)"
         id="text4246-7-6-2-1"
         y="991.90063"
         x="3472.1885"
         style="font-style:normal;font-variant:normal;font-weight:normal;font-stretch:normal;line-height:0%;font-family:Lavi;-inkscape-font-specification:Lavi;text-align:center;letter-spacing:0px;word-spacing:0px;text-anchor:middle;display:inline;fill:#000000;fill-opacity:1;stroke:#000000;stroke-width:1.10000002;stroke-miterlimit:4;stroke-dasharray:none;stroke-opacity:1"
         xml:space="preserve"><tspan
           id="tspan1069-6-5"
           y="991.90063"
           x="3472.1885"
           style="font-size:45px;line-height:1.25;stroke:#000000;stroke-width:1.10000002;stroke-miterlimit:4;stroke-dasharray:none;stroke-opacity:1"
           sodipodi:role="line">Grrrrr....!!!</tspan></text>
    </g>
  </g>
</svg>
