<?xml version="1.0" encoding="UTF-8" standalone="no"?>
<!-- Created with Inkscape (http://www.inkscape.org/) -->

<svg
   xmlns:dc="http://purl.org/dc/elements/1.1/"
   xmlns:cc="http://creativecommons.org/ns#"
   xmlns:rdf="http://www.w3.org/1999/02/22-rdf-syntax-ns#"
   xmlns:svg="http://www.w3.org/2000/svg"
   xmlns="http://www.w3.org/2000/svg"
   xmlns:xlink="http://www.w3.org/1999/xlink"
   xmlns:sodipodi="http://sodipodi.sourceforge.net/DTD/sodipodi-0.dtd"
   xmlns:inkscape="http://www.inkscape.org/namespaces/inkscape"
   id="svg2"
   version="1.1"
   inkscape:version="0.92.4 (5da689c313, 2019-01-14)"
   width="2481"
   height="663"
   sodipodi:docname="E13P00.svg">
  <metadata
     id="metadata8">
    <rdf:RDF>
      <cc:Work
         rdf:about="">
        <dc:format>image/svg+xml</dc:format>
        <dc:type
           rdf:resource="http://purl.org/dc/dcmitype/StillImage" />
        <dc:title />
      </cc:Work>
    </rdf:RDF>
  </metadata>
  <defs
     id="defs6">
    <linearGradient
       id="linearGradient4561"
       inkscape:collect="always">
      <stop
         id="stop4563"
         offset="0"
         style="stop-color:#774e33;stop-opacity:1" />
      <stop
         id="stop4565"
         offset="1"
         style="stop-color:#ffd42a;stop-opacity:1" />
    </linearGradient>
    <linearGradient
       inkscape:collect="always"
       id="linearGradient4290">
      <stop
         style="stop-color:#e80000;stop-opacity:1"
         offset="0"
         id="stop4292" />
      <stop
         id="stop4298"
         offset="0.5"
         style="stop-color:#9e1900;stop-opacity:1;" />
      <stop
         style="stop-color:#2b0000;stop-opacity:1"
         offset="1"
         id="stop4294" />
    </linearGradient>
    <filter
       inkscape:menu-tooltip="Transparent plastic with deep colors"
       inkscape:menu="Bevels"
       inkscape:label="Pepper-title-style"
       style="color-interpolation-filters:sRGB;"
       id="filter4268">
      <feGaussianBlur
         in="SourceGraphic"
         result="result6"
         stdDeviation="0.20000000000000001"
         id="feGaussianBlur4270" />
      <feComposite
         in2="SourceGraphic"
         in="result6"
         operator="xor"
         id="feComposite4272" />
      <feGaussianBlur
         result="result2"
         stdDeviation="6.0001843317972341"
         id="feGaussianBlur4274" />
      <feComposite
         in2="SourceGraphic"
         operator="atop"
         result="result91"
         id="feComposite4276"
         stdDeviation="6" />
      <feComposite
         result="result4"
         in="result2"
         operator="xor"
         in2="result91"
         id="feComposite4278"
         stdDeviation="3.7000000000000002" />
      <feGaussianBlur
         in="result4"
         result="result3"
         stdDeviation="3.6962672811059902"
         id="feGaussianBlur4280" />
      <feSpecularLighting
         lighting-color="rgb(216,189,109)"
         in="result3"
         result="result5"
         specularExponent="35"
         specularConstant="3"
         surfaceScale="12"
         id="feSpecularLighting4282">
        <feDistantLight
           elevation="45"
           azimuth="235"
           id="feDistantLight4284" />
      </feSpecularLighting>
      <feComposite
         in2="result5"
         in="SourceGraphic"
         k3="0.7"
         k2="0.8"
         operator="arithmetic"
         result="result7"
         id="feComposite4286" />
      <feComposite
         in="result7"
         operator="in"
         in2="SourceGraphic"
         id="feComposite4288" />
    </filter>
    <linearGradient
       inkscape:collect="always"
       xlink:href="#linearGradient4290"
       id="linearGradient4327-3"
       gradientUnits="userSpaceOnUse"
       x1="1243.5789"
       y1="254.0174"
       x2="1240.9818"
       y2="421.95773"
       gradientTransform="translate(-300.09377,-152.28618)" />
    <filter
       inkscape:menu-tooltip="Transparent plastic with deep colors"
       inkscape:menu="Bevels"
       inkscape:label="Pepper-title-style"
       style="color-interpolation-filters:sRGB"
       id="filter4268-0">
      <feGaussianBlur
         in="SourceGraphic"
         result="result6"
         stdDeviation="0.20000000000000001"
         id="feGaussianBlur4270-9" />
      <feComposite
         in2="SourceGraphic"
         in="result6"
         operator="xor"
         id="feComposite4272-3" />
      <feGaussianBlur
         result="result2"
         stdDeviation="6.0001843317972341"
         id="feGaussianBlur4274-4" />
      <feComposite
         in2="SourceGraphic"
         operator="atop"
         result="result91"
         id="feComposite4276-3"
         stdDeviation="6" />
      <feComposite
         result="result4"
         in="result2"
         operator="xor"
         in2="result91"
         id="feComposite4278-2"
         stdDeviation="3.7000000000000002" />
      <feGaussianBlur
         in="result4"
         result="result3"
         stdDeviation="3.6962672811059902"
         id="feGaussianBlur4280-5" />
      <feSpecularLighting
         lighting-color="#d8bd6d"
         in="result3"
         result="result5"
         specularExponent="35"
         specularConstant="3"
         surfaceScale="12"
         id="feSpecularLighting4282-0">
        <feDistantLight
           elevation="45"
           azimuth="235"
           id="feDistantLight4284-6" />
      </feSpecularLighting>
      <feComposite
         k4="0"
         k1="0"
         in2="result5"
         in="SourceGraphic"
         k3="0.7"
         k2="0.8"
         operator="arithmetic"
         result="result7"
         id="feComposite4286-6" />
      <feComposite
         in="result7"
         operator="in"
         in2="SourceGraphic"
         id="feComposite4288-4" />
    </filter>
    <filter
       id="filter4140"
       style="color-interpolation-filters:sRGB;"
       inkscape:label="Dark And Glow"
       inkscape:menu="Shadows and Glows"
       inkscape:menu-tooltip="Darkens the edge with an inner blur and adds a flexible glow"
       height="1.5"
       y="-0.25">
      <feGaussianBlur
         id="feGaussianBlur4142"
         result="result6"
         stdDeviation="4.6710210876803542" />
      <feComposite
         stdDeviation="4.7000000000000002"
         id="feComposite4144"
         in2="result6"
         operator="atop"
         in="SourceGraphic"
         result="result8" />
      <feComposite
         id="feComposite4146"
         in="result8"
         in2="SourceAlpha"
         operator="over"
         result="result9" />
      <feColorMatrix
         id="feColorMatrix4148"
         result="result10"
         values="1 0 0 0 0 0 1 0 0 0 0 0 1 0 0 0 0 0 1 0 " />
      <feBlend
         id="feBlend4150"
         in2="result6"
         mode="normal"
         in="result10" />
    </filter>
    <linearGradient
       inkscape:collect="always"
       xlink:href="#linearGradient4290"
       id="linearGradient2304"
       x1="1529.4971"
       y1="-175.39542"
       x2="1532.4559"
       y2="103.37798"
       gradientUnits="userSpaceOnUse"
       gradientTransform="translate(-345.60354,349.17422)" />
    <linearGradient
       gradientTransform="translate(-39.490417,616.80075)"
       inkscape:collect="always"
       xlink:href="#linearGradient4561"
       id="linearGradient4559-6"
       gradientUnits="userSpaceOnUse"
       x1="1224.7605"
       y1="-120.70979"
       x2="1227.4819"
       y2="-294.11374" />
    <filter
       inkscape:menu-tooltip="Transparent plastic with deep colors"
       inkscape:menu="Bevels"
       inkscape:label="Pepper-title-style"
       style="color-interpolation-filters:sRGB"
       id="filter4268-09">
      <feGaussianBlur
         in="SourceGraphic"
         result="result6"
         stdDeviation="0.20000000000000001"
         id="feGaussianBlur4270-6" />
      <feComposite
         in2="SourceGraphic"
         in="result6"
         operator="xor"
         id="feComposite4272-0" />
      <feGaussianBlur
         result="result2"
         stdDeviation="6.0001843317972341"
         id="feGaussianBlur4274-1" />
      <feComposite
         in2="SourceGraphic"
         operator="atop"
         result="result91"
         id="feComposite4276-4"
         stdDeviation="6" />
      <feComposite
         result="result4"
         in="result2"
         operator="xor"
         in2="result91"
         id="feComposite4278-8"
         stdDeviation="3.7000000000000002" />
      <feGaussianBlur
         in="result4"
         result="result3"
         stdDeviation="3.6962672811059902"
         id="feGaussianBlur4280-7" />
      <feSpecularLighting
         lighting-color="#d8bd6d"
         in="result3"
         result="result5"
         specularExponent="35"
         specularConstant="3"
         surfaceScale="12"
         id="feSpecularLighting4282-2">
        <feDistantLight
           elevation="45"
           azimuth="235"
           id="feDistantLight4284-8" />
      </feSpecularLighting>
      <feComposite
         k4="0"
         k1="0"
         in2="result5"
         in="SourceGraphic"
         k3="0.7"
         k2="0.8"
         operator="arithmetic"
         result="result7"
         id="feComposite4286-1" />
      <feComposite
         in="result7"
         operator="in"
         in2="SourceGraphic"
         id="feComposite4288-2" />
    </filter>
    <linearGradient
       inkscape:collect="always"
       xlink:href="#linearGradient4290"
       id="linearGradient4327"
       gradientUnits="userSpaceOnUse"
       x1="1243.5789"
       y1="254.0174"
       x2="1240.9818"
       y2="421.95773"
       gradientTransform="translate(-10.435182,-4.30511)" />
    <filter
       inkscape:menu-tooltip="Transparent plastic with deep colors"
       inkscape:menu="Bevels"
       inkscape:label="Pepper-title-style"
       style="color-interpolation-filters:sRGB"
       id="filter4268-6">
      <feGaussianBlur
         in="SourceGraphic"
         result="result6"
         stdDeviation="0.20000000000000001"
         id="feGaussianBlur4270-0" />
      <feComposite
         in2="SourceGraphic"
         in="result6"
         operator="xor"
         id="feComposite4272-5" />
      <feGaussianBlur
         result="result2"
         stdDeviation="6.0001843317972341"
         id="feGaussianBlur4274-9" />
      <feComposite
         in2="SourceGraphic"
         operator="atop"
         result="result91"
         id="feComposite4276-5"
         stdDeviation="6" />
      <feComposite
         result="result4"
         in="result2"
         operator="xor"
         in2="result91"
         id="feComposite4278-20"
         stdDeviation="3.7000000000000002" />
      <feGaussianBlur
         in="result4"
         result="result3"
         stdDeviation="3.6962672811059902"
         id="feGaussianBlur4280-9" />
      <feSpecularLighting
         lighting-color="#d8bd6d"
         in="result3"
         result="result5"
         specularExponent="35"
         specularConstant="3"
         surfaceScale="12"
         id="feSpecularLighting4282-3">
        <feDistantLight
           elevation="45"
           azimuth="235"
           id="feDistantLight4284-0" />
      </feSpecularLighting>
      <feComposite
         k4="0"
         k1="0"
         in2="result5"
         in="SourceGraphic"
         k3="0.7"
         k2="0.8"
         operator="arithmetic"
         result="result7"
         id="feComposite4286-7" />
      <feComposite
         in="result7"
         operator="in"
         in2="SourceGraphic"
         id="feComposite4288-5" />
    </filter>
  </defs>
  <sodipodi:namedview
     pagecolor="#ffffff"
     bordercolor="#666666"
     borderopacity="1"
     objecttolerance="10"
     gridtolerance="10"
     guidetolerance="10"
     inkscape:pageopacity="0"
     inkscape:pageshadow="2"
     inkscape:window-width="1920"
     inkscape:window-height="977"
     id="namedview4"
     showgrid="false"
     inkscape:zoom="0.36745568"
     inkscape:cx="821.27108"
     inkscape:cy="212.24159"
     inkscape:window-x="0"
     inkscape:window-y="62"
     inkscape:window-maximized="1"
     inkscape:current-layer="layer1" />
  <g
     inkscape:groupmode="layer"
     id="layer2"
     inkscape:label="artwork"
     sodipodi:insensitive="true">
    <image
       sodipodi:absref="/felles/omsetting/pepper-carrot/webcomics/ep13_The-Pyjama-Party/lang/nn/../gfx_Pepper-and-Carrot_by-David-Revoy_E13P00.png"
       xlink:href="../gfx_Pepper-and-Carrot_by-David-Revoy_E13P00.png"
       y="0"
       x="0"
       id="image10"
       height="663"
       width="2481" />
  </g>
  <g
     inkscape:groupmode="layer"
     id="layer1"
     inkscape:label="txt"
     style="display:inline">
    <path
       inkscape:connector-curvature="0"
       id="path4544-7"
       style="display:inline;fill:url(#linearGradient4559-6);fill-opacity:1;stroke:#774e33;stroke-width:5.4000001;stroke-miterlimit:4;stroke-dasharray:none;stroke-opacity:1;filter:url(#filter4268-09)"
       d="m 1179.454,389.19132 7.7925,-6.6489 1.9463,-3.192 1.9464,-3.192 v -3.2028 -3.2029 l -2.5028,-2.9745 -2.5029,-2.9745 -3.0316,-1.2557 -3.0316,-1.2558 -3.4886,0.6545 -3.4886,0.6545 -2.7372,3.2459 c -1.5054,1.7853 -3.3495,4.7076 -4.0981,6.4939 l -1.3616,3.2479 v 3.9093 3.9093 l 1.4294,4.7493 c 1.4196,4.7171 3.1941,7.6835 4.5962,7.6835 0.4024,0 4.2383,-2.9921 8.5242,-6.649 z m 5.3994,62.03241 4.4373,-2.148 0.4942,-1.2879 0.4942,-1.28791 -10.4164,-10.1838 -10.4165,-10.1839 -1.2186,-0.01 -1.2187,-0.01 -2.8186,3.7153 c -1.5503,2.0434 -4.2948,5.0793 -6.099,6.7463 l -3.2803,3.031 v 1.365 1.365 l 4.2896,4.3767 c 2.3593,2.40721 5.198,4.87491 6.3083,5.48391 l 2.0187,1.1072 6.4942,0.031 6.4943,0.031 4.4373,-2.1481 z m -24.4911,24.42559 c -2.7757,-0.9893 -7.3585,-2.9708 -10.1841,-4.4034 l -5.1375,-2.6046 -3.1833,-3.62549 c -1.7508,-1.994 -4.193,-5.5432 -5.4273,-7.8871 l -2.244,-4.2616 -0.033,-7.56991 -0.033,-7.5699 3.1865,-6.7259 3.1865,-6.7258 7.8321,-8.1978 7.8321,-8.1977 -2.8354,-5.9323 -2.8353,-5.9322 0.6055,-3.0276 0.6055,-3.0276 -1.4446,-1.1989 -1.4445,-1.1989 1.5666,-3.0294 1.5666,-3.0295 -2.24,-2.3843 -2.24,-2.3843 0.6401,-4.6695 0.64,-4.6694 2.0103,-4.5447 2.0104,-4.5448 4.2924,-5.1269 4.2924,-5.1268 4.4309,-2.8099 4.4309,-2.81 5.4663,-1.2234 5.4663,-1.2232 5.255,1.6601 5.2549,1.6601 5.762,3.6087 5.762,3.6087 3.6768,6.0527 3.6769,6.0528 0.5164,3.8503 0.5165,3.8504 -2.2282,7.06 -2.2282,7.06 -3.8778,4.938 c -2.1329,2.7159 -5.5453,7.4361 -7.5832,10.4893 -2.0379,3.0532 -5.0652,6.7583 -6.7273,8.2336 l -3.0219,2.6822 0.8594,1.466 c 0.4726,0.8063 4.995,5.8566 10.0497,11.2228 l 9.1904,9.7568 1.2054,-1.4524 1.2054,-1.4524 0.2022,-2.8641 0.2021,-2.8641 -3.7799,-0.3129 -3.7798,-0.313 -2.5284,-3.3149 -2.5285,-3.315 v -2.1036 -2.1036 l 1.4459,-1.4459 1.4459,-1.4459 8.395,-2.6099 c 4.6173,-1.4354 10.666,-3.1259 13.4417,-3.7566 l 5.0466,-1.1467 12.1119,-0.3982 c 6.6616,-0.219 14.4965,-0.6682 17.4109,-0.9982 l 5.2989,-0.6 -5e-4,1.3343 -5e-4,1.3343 -7.1781,6.5606 c -3.9479,3.6084 -8.6032,7.9788 -10.345,9.7121 l -3.167,3.1515 -4.9233,0.7147 c -2.7079,0.3931 -5.5467,0.9538 -6.3083,1.2461 l -1.385,0.5315 v 4.9008 4.9007 l -2.1535,5.7557 -2.1535,5.7557 2.9001,2.10441 c 1.595,1.1575 4.7215,3.5063 6.9478,5.2197 l 4.0477,3.1151 -0.1874,1.4268 c -0.1031,0.7848 -0.8155,3.1266 -1.5831,5.204 l -1.3956,3.7772 -2.3778,2.53109 -2.3779,2.5311 h -3.1044 -3.1044 l -3.3047,-2.0149 c -1.8176,-1.1076 -3.9138,-2.0143 -4.6582,-2.0143 -0.7444,0 -2.5083,-0.90839 -3.9198,-2.01869 -1.4115,-1.1102 -3.176,-2.007 -3.9211,-1.9928 -0.7451,0.014 -3.8529,1.6206 -6.9061,3.5698 l -5.5513,3.54409 -9.5484,2.9907 -9.5485,2.9908 -5.0867,-0.074 -5.0868,-0.074 -5.0466,-1.7988 z" />
    <text
       xml:space="preserve"
       style="font-style:normal;font-variant:normal;font-weight:normal;font-stretch:normal;line-height:0%;font-family:Arial;-inkscape-font-specification:Arial;letter-spacing:0px;word-spacing:0px;display:inline;fill:#2b1100;fill-opacity:1;stroke:#000000;stroke-width:2;stroke-miterlimit:4;stroke-dasharray:none;stroke-opacity:1"
       x="789.55212"
       y="582.47577"
       id="episode-title"><tspan
         sodipodi:role="line"
         id="tspan4180"
         style="font-style:normal;font-variant:normal;font-weight:normal;font-stretch:normal;font-size:72.5px;line-height:1.25;font-family:Lavi;-inkscape-font-specification:Lavi;fill:#2b1100;stroke:none"
         x="789.55212"
         y="582.47577">Episode 13: Pysjamasfesten</tspan></text>
    <flowRoot
       transform="translate(-286.66777,-1591.47)"
       xml:space="preserve"
       id="flowRoot2987-3"
       style="font-style:normal;font-variant:normal;font-weight:normal;font-stretch:normal;line-height:0.01%;font-family:Lavi;-inkscape-font-specification:Lavi;letter-spacing:0px;word-spacing:0px;fill:#000000;fill-opacity:1;stroke:none;stroke-width:1px;stroke-linecap:butt;stroke-linejoin:miter;stroke-opacity:1"><flowRegion
         id="flowRegion2989-5"><rect
           id="rect2991-6"
           width="721.75812"
           height="55.156185"
           x="502.10858"
           y="-1050.8098"
           style="font-style:normal;font-variant:normal;font-weight:normal;font-stretch:normal;font-family:Lavi;-inkscape-font-specification:Lavi" /></flowRegion><flowPara
         id="flowPara2993-2"
         style="font-size:8.52000046px;line-height:1.25"> </flowPara></flowRoot>    <path
       style="display:inline;opacity:1;fill:url(#linearGradient2304);fill-opacity:1;stroke:#774e33;stroke-width:5.4000001;stroke-linecap:butt;stroke-miterlimit:4;stroke-dasharray:none;stroke-opacity:1;paint-order:normal;filter:url(#filter4268);enable-background:new"
       d="m 747.23386,508.75454 c -5.4351,-5.43514 -5.8109,-6.14566 -5.8109,-10.9887 0,-6.49275 2.0814,-9.54477 7.5054,-11.00528 2.4056,-0.64777 4.7973,-2.15476 5.5638,-3.50558 0.9642,-1.69963 1.4501,-10.85347 1.7186,-32.38251 l 0.3744,-30.01317 -6.2446,-1.36556 c -8.605,-1.88171 -15.3328,-4.95777 -15.3328,-7.01043 0,-0.9336 -0.7217,-1.97444 -1.6038,-2.3129 -0.8821,-0.33851 -1.6038,-1.30748 -1.6038,-2.15331 0,-1.20647 0.864,-1.3655 4.0095,-0.73806 5.8328,1.16345 8.0781,0.87861 14.6955,-1.86411 l 5.9364,-2.4605 -0.3876,-39.62066 c -0.2131,-21.79137 -0.7584,-41.17249 -1.2115,-43.06917 -0.976,-4.08451 -3.7814,-4.92054 -16.8915,-5.03363 -10.3066,-0.0889 -10.7748,-1.5546 -2.6759,-8.3766 6.3714,-5.36676 8.177,-6.40073 21.9111,-12.54723 6.8878,-3.08254 10.6138,-4.20097 12.2958,-3.69084 3.4452,1.04494 7.176,4.73593 8.8673,8.77247 l 1.4558,3.4749 h 12.2952 c 18.8265,0 32.0343,4.63454 48.4417,16.99793 13.1239,9.88909 17.4239,17.68547 17.4239,31.59107 0,9.18452 -2.0484,16.68622 -7.3151,26.78967 -5.0415,9.67136 -20.191,25.14243 -30.7076,31.35933 -7.6599,4.52821 -31.8387,14.08169 -35.6392,14.08169 -5.5371,0 -5.459,-0.34727 -5.459,24.24169 0,13.69152 0.444,23.77323 1.1009,25.00077 1.2808,2.39299 6.4298,5.28677 9.4072,5.28677 1.1333,0 2.6379,0.69564 3.3435,1.54586 0.9202,1.10884 1.9858,1.27861 3.7692,0.60054 1.461,-0.55547 5.4319,-0.5282 9.6285,0.0661 5.901,0.83567 7.7854,0.7062 10.8439,-0.74516 2.6951,-1.27892 5.3165,-1.58995 9.6394,-1.14379 3.2657,0.33705 7.1599,0.14809 8.6538,-0.41989 3.3298,-1.26598 4.0063,-0.72979 2.5387,2.0123 -1.1814,2.20752 -6.5342,3.90016 -6.5342,2.06624 0,-0.58697 -2.3851,1.16372 -5.3002,3.89049 -2.9151,2.72673 -6.0082,4.9577 -6.8734,4.9577 -0.8653,0 -2.3125,0.73921 -3.216,1.64268 -2.1047,2.10473 -7.651,4.41585 -14.0254,5.84441 -2.7601,0.61854 -6.5459,2.28978 -8.413,3.71385 -3.9879,3.04181 -12.1385,6.11285 -22.5819,8.50868 -4.1164,0.94435 -7.6447,2.18855 -7.8408,2.76489 -0.196,0.57635 -2.5128,1.04791 -5.1484,1.04791 -4.376,0 -5.2966,-0.50455 -10.6029,-5.81087 z m 46.3952,-112.31912 c 17.547,-8.4092 34.8228,-24.0231 41.4771,-37.48712 3.4568,-6.99442 3.8311,-8.54719 3.3777,-14.01441 -0.4722,-5.69361 -0.8763,-6.48018 -5.4632,-10.63299 -6.132,-5.55161 -12.6533,-7.39802 -25.8418,-7.31673 -10.3664,0.0639 -22.1844,2.62018 -25.3475,5.48283 -1.7612,1.59383 -1.9172,4.31251 -1.9172,33.43141 0,32.57925 0.209,34.26255 4.2536,34.26255 0.928,0 5.1856,-1.67651 9.4613,-3.72554 z m 581.82994,54.37586 c -9.5485,-1.88997 -19.6816,-5.42247 -25.7259,-8.96829 -17.1512,-10.06161 -28.9049,-21.84934 -36.231,-36.33604 -4.721,-9.33528 -6.4681,-15.02201 -10.0438,-32.69362 -2.467,-12.19106 -2.5336,-13.447 -1.1908,-22.45322 3.4298,-23.00466 11.4516,-52.07341 18.5819,-67.33629 8.897,-19.04458 27.9524,-46.47882 42.3137,-60.91972 11.3108,-11.37334 19.3023,-17.34234 31.2528,-23.3433 l 9.8688,-4.95559 11.5153,0.006 c 10.8769,0.005 12.1248,0.24269 22.5108,4.2768 14.7893,5.7443 14.8193,5.74022 15.733,-2.13176 0.4493,-3.87219 1.5968,-7.4882 2.9036,-9.14942 2.0151,-2.56165 2.5668,-2.69722 8.1829,-2.01098 7.0192,0.85766 17.364,5.67583 22.3275,10.39901 2.9497,2.80695 3.4679,4.04255 3.4283,8.17565 -0.087,9.06789 -1.6139,13.91213 -5.7074,18.10427 -4.4674,4.5751 -5.0475,7.60245 -1.463,7.63788 1.3231,0.0131 3.5588,0.91044 4.9684,1.99414 l 2.5626,1.97038 -1.7645,19.13729 c -3.13,33.94713 -13.938,80.58683 -18.6745,80.58683 -1.2897,0 -2.3283,-5.32127 -2.3283,-11.92919 0,-2.88569 -0.6753,-6.86266 -1.5004,-8.83771 -0.8429,-2.01707 -1.8435,-9.85168 -2.2831,-17.8748 -0.7135,-13.01842 -1.203,-15.5129 -5.5275,-28.15957 -9.1456,-26.74551 -19.1828,-42.27122 -27.3121,-42.24675 -8.5767,0.0259 -23.1274,9.59398 -37.8651,24.89914 -8.4814,8.80785 -11.3471,11.1648 -13.0374,10.72276 -1.4279,-0.37345 -3.0985,0.36527 -4.8999,2.16674 -2.9339,2.93392 -3.3581,5.01139 -1.6679,8.16936 1.4368,2.68472 0.3285,5.15615 -2.4923,5.55797 -1.7489,0.24914 -2.3479,1.11448 -2.4487,3.53741 -0.073,1.76419 -4.1099,11.62755 -8.9702,21.91862 -11.1093,23.52206 -19.8195,49.36257 -20.9034,62.01366 -0.6162,7.1907 -1.3182,9.79748 -3.3626,12.48539 -2.4367,3.20362 -2.4909,3.57714 -0.9509,6.55516 0.8982,1.73686 3.0179,4.32315 4.7103,5.7473 1.6925,1.42412 4.4318,4.96969 6.0873,7.87905 4.1913,7.36606 11.8586,15.12537 18.1111,18.32839 5.0176,2.57048 5.9483,2.68048 18.711,2.21214 12.2995,-0.45132 14.4665,-0.85794 25.7266,-4.82739 6.7627,-2.384 14.0847,-5.10314 16.271,-6.0425 2.1863,-0.93935 5.2908,-1.70792 6.8988,-1.70792 1.7252,0 4.2598,-1.23704 6.1824,-3.01754 1.7921,-1.65966 6.6907,-4.32648 10.8859,-5.92632 4.1949,-1.5998 8.524,-3.89971 9.6201,-5.11092 1.0962,-1.21116 3.2747,-2.86499 4.8414,-3.67507 3.3372,-1.72576 3.1065,-4.25205 -0.7707,-8.43552 -2.358,-2.54415 -3.1338,-2.70306 -13.1996,-2.70306 -8.9651,0 -11.8693,-0.45186 -17.9602,-2.79438 -17.9055,-6.88641 -21.2903,-7.84294 -27.8478,-7.87 -3.6754,-0.0151 -6.6659,-0.38848 -6.6454,-0.82954 0.02,-0.44104 4.6045,-3.85944 10.1873,-7.59648 5.9261,-3.9669 12.6643,-9.6402 16.1909,-13.6323 3.3222,-3.76075 6.6241,-6.83773 7.3374,-6.83773 0.7132,0 5.7909,2.95101 11.2838,6.55778 l 9.9869,6.55774 9.1085,-0.6992 c 5.0096,-0.38458 12.172,-1.36314 15.9163,-2.17461 6.4265,-1.3927 7.2169,-1.33629 14.1062,1.007 4.0144,1.3653 8.2824,2.22511 9.4846,1.91072 3.211,-0.8397 3.7656,1.93733 1.6556,8.28987 -1.4865,4.47586 -2.4931,5.77049 -5.445,7.00389 -4.1133,1.71869 -4.3366,2.92591 -1.8406,9.95367 l 1.7807,5.01405 -5.9819,10.65794 c -8.2396,14.68049 -21.367,27.1804 -28.5452,27.1804 -1.6098,0 -2.9852,1.59475 -5.1082,5.92348 -2.6994,5.50412 -3.7609,6.44984 -14.9929,13.35771 -8.357,5.1397 -15.6244,8.62186 -23.5459,11.28212 -10.4901,3.52273 -12.6779,3.87875 -25.8924,4.21301 -7.9389,0.2008 -15.6371,0.12701 -17.1072,-0.16399 z M 487.63454,431.81829 c -8.0812,-3.03407 -14.1738,-11.33068 -15.2993,-20.83388 -0.5099,-4.30516 -0.2163,-5.51473 1.9501,-8.03327 2.076,-2.41351 3.7965,-3.11191 9.2502,-3.75496 9.453,-1.11457 10.2866,-2.24566 10.7378,-14.56959 0.359,-9.80596 0.4422,-10.09744 2.7198,-9.5258 1.574,0.39508 3.0249,-0.15669 4.3961,-1.67188 2.4373,-2.69316 1.4757,-4.88592 -3.3042,-7.53448 l -3.1128,-1.72482 -0.2825,-32.57844 -0.2824,-32.57843 3.6255,0.42326 c 2.8699,0.33504 3.9942,-0.0993 5.3941,-2.08402 1.6564,-2.34825 1.6461,-2.60904 -0.1619,-4.11111 -1.0618,-0.88209 -3.5569,-3.87952 -5.5448,-6.66096 l -3.6142,-5.05718 0.9038,-17.39603 c 0.4971,-9.56784 0.9326,-21.80876 0.9677,-27.20204 0.058,-8.87537 -0.1752,-10.06021 -2.4545,-12.48466 -1.3851,-1.47329 -5.2343,-3.75208 -8.5536,-5.06402 -3.3194,-1.31193 -7.0789,-3.31913 -8.3545,-4.46044 -3.6694,-3.28307 -6.8528,-11.92362 -7.0529,-19.14345 -0.1671,-6.02849 0.057,-6.69391 3.1984,-9.50087 7.3079,-6.52957 41.0827,-14.42257 66.9786,-15.65252 14.3011,-0.67925 32.5435,0.70359 46.1152,3.49569 9.95,2.04702 27.3626,10.76824 34.8839,17.47186 9.7758,8.71301 22.0834,28.10191 28.2673,44.5312 12.21452,32.45081 -2.6485,64.70294 -41.8882,90.89593 -14.2835,9.53448 -47.7106,24.15625 -64.6115,28.26264 -12.4125,3.01581 -14.8473,4.11626 -15.5817,7.04222 -1.0099,4.02399 0.013,29.07239 1.2374,30.29601 0.6123,0.61196 3.3962,1.53915 6.1865,2.06045 2.7902,0.52127 5.9357,1.72834 6.9899,2.6824 1.328,1.20179 3.9243,1.73466 8.452,1.73466 3.5944,0 6.7686,0.37765 7.0539,0.83926 0.6486,1.04949 32.9568,0.89082 34.6737,-0.17029 0.6918,-0.42759 2.9446,-0.31172 5.0061,0.25748 2.1504,0.59378 3.9973,0.63181 4.3326,0.0892 0.5089,-0.82353 6.7195,-0.2587 7.871,0.71582 1.1441,0.96828 -2.6939,3.64188 -6.1404,4.27743 -2.1461,0.39579 -5.5429,1.59207 -7.5484,2.65843 -2.0055,1.06637 -4.0172,1.70972 -4.4703,1.42968 -0.4531,-0.28004 -2.0213,0.60066 -3.4849,1.95706 -1.5278,1.41594 -6.4542,3.50608 -11.5678,4.90784 -4.8987,1.3429 -10.4867,3.12779 -12.4179,3.96643 -1.9311,0.83864 -4.9897,1.52481 -6.7969,1.52481 -1.8072,0 -6.2414,1.38977 -9.8538,3.08838 -13.685,6.43487 -49.2405,10.7786 -58.8122,7.18493 z m 72.0243,-116.09148 c 2.6463,-0.72919 7.8623,-2.70856 11.5913,-4.39855 6.1156,-2.77172 7.0584,-2.93048 9.6228,-1.62059 5.2721,2.69301 9.6672,-1.10808 8.1716,-7.06714 -0.9342,-3.72177 3.0133,-7.17247 6.0415,-5.2813 3.1505,1.96748 5.5914,-0.30216 4.7656,-4.43115 -0.5342,-2.6714 0.2153,-4.02508 5.3616,-9.68268 7.2375,-7.95668 14.8484,-20.54904 17.1395,-28.35744 2.3557,-8.02849 1.589,-18.30072 -1.935,-25.92745 -8.4364,-18.25811 -26.0118,-25.49827 -53.3293,-21.96897 -12.2829,1.58691 -15.9832,1.16632 -15.9832,-1.81667 0,-0.76204 -1.2545,-2.05691 -2.7878,-2.87752 -2.5701,-1.37545 -2.9529,-1.28827 -4.8995,1.11568 -1.3288,1.64099 -1.9521,3.69401 -1.6814,5.53815 0.3486,2.37557 -0.1171,3.15713 -2.4594,4.12736 -4.6271,1.9166 -8.6665,6.90344 -9.6617,11.92793 -1.1602,5.85721 -2.6217,88.19507 -1.6352,92.12551 0.4047,1.61232 1.7245,3.29725 2.933,3.7443 2.0533,0.75954 17.0529,-1.92748 28.7456,-5.14947 z m 108.52392,113.62593 c -15.70182,-2.08257 -21.53622,-7.22072 -28.31162,-24.93321 -4.5474,-11.88797 -4.7106,-12.73431 -5.1427,-26.66986 -0.8315,-26.81866 4.5018,-45.00575 18.8246,-64.19397 9.43942,-12.64593 15.17362,-17.7664 25.38022,-22.66385 15.5723,-7.4721 20.7851,-6.88091 33.7704,3.82993 7.6802,6.33506 12.7405,14.5827 14.7035,23.96524 1.4975,7.1576 1.5354,31.5223 0.057,36.8449 -1.4551,5.2397 -4.1107,6.84035 -13.8426,8.34375 -11.3525,1.75376 -53.5436,12.76281 -56.1449,14.65008 -2.6041,1.88923 -3.25692,7.09228 -1.5049,11.99322 2.7096,7.57954 3.367,8.86562 6.0997,11.93256 6.4187,7.2039 15.3422,6.87505 31.5185,-1.16155 16.5973,-8.24573 21.98,-11.26794 24.8191,-13.93508 1.5692,-1.47423 3.2772,-2.16962 4.3335,-1.76431 2.0737,0.79577 1.4833,4.76286 -1.894,12.72587 -1.6705,3.93885 -2.5931,4.96955 -4.0377,4.51105 -2.3242,-0.73768 -7.7518,5.33072 -7.0478,7.87987 0.2658,0.96217 0.7958,2.8363 1.1778,4.16482 0.6282,2.18449 -0.2582,2.87523 -9.2707,7.22445 -13.1767,6.35881 -23.4574,8.58641 -33.4876,7.25608 z m 8.019,-78.42153 c 18.9703,-4.23953 27.434,-7.08967 29.4036,-9.90157 1.2082,-1.72502 1.5906,-5.32546 1.5518,-14.61415 -0.062,-14.87599 -1.7022,-19.61441 -6.968,-20.12967 -7.8879,-0.77184 -28.1376,18.00285 -37.0671,34.3672 -2.7834,5.10085 -5.3803,10.54753 -5.7709,12.10377 -0.6491,2.58626 -0.4897,2.76808 1.8531,2.11487 1.4098,-0.39305 9.0587,-2.16627 16.9975,-3.94045 z m 269.4386,76.29454 c -3.1573,-1.20837 -5.3728,-3.94783 -6.461,-7.98899 -0.6082,-2.25884 -1.7034,-4.107 -2.4336,-4.107 -0.7303,0 -5.4029,1.71934 -10.3835,3.8208 -37.5538,15.84472 -63.8074,6.99495 -61.7158,-20.80375 1.0149,-13.4889 9.1333,-26.9055 21.0907,-34.85478 10.4448,-6.94365 27.9551,-15.00923 38.2222,-17.60579 4.8352,-1.22283 10.0686,-2.70896 11.6298,-3.30253 l 2.8385,-1.07919 -0.7216,-8.79571 c -0.8468,-10.32314 -3.1349,-19.1861 -5.4489,-21.10655 -0.9039,-0.7502 -2.9536,-1.33047 -4.5549,-1.28947 -1.6012,0.041 -5.23,0.12759 -8.064,0.19246 -6.5338,0.14952 -18.0255,5.62416 -28.4051,13.53219 -4.1554,3.16593 -8.0028,5.75626 -8.5498,5.75626 -0.547,0 -2.7801,2.48547 -4.9626,5.52328 -3.405,4.73958 -4.1145,5.26163 -5.0001,3.67912 -1.1811,-2.11047 2.5458,-12.42273 7.8659,-21.76476 6.333,-11.1208 23.4014,-22.69201 36.6539,-24.84893 14.2311,-2.31617 29.0002,4.81799 35.3352,17.0686 3.9017,7.54498 6.8791,32.20464 6.9422,57.49741 0.022,8.7776 0.692,10.27483 3.2297,7.21713 0.732,-0.88211 2.0553,-1.60379 2.9405,-1.60379 2.4232,0 0.9189,7.74914 -2.9609,15.25171 -2.8787,5.56689 -4.1922,11.47829 -2.5504,11.47829 0.3503,0 1.914,-0.89942 3.4749,-1.99869 1.5609,-1.09925 5.7249,-3.29699 9.2533,-4.88387 3.5283,-1.58684 7.6923,-3.5743 9.2531,-4.41652 1.5609,-0.84222 3.1246,-1.53133 3.475,-1.53133 1.6315,0 0.2799,3.59483 -3.489,9.2799 -4.5203,6.81831 -5.7035,9.77702 -6.0263,15.06902 -0.2878,4.72046 -3.6005,7.95105 -12.6928,12.3786 -7.6021,3.70182 -14.7397,5.40224 -17.7846,4.23688 z m -37.6443,-24.45608 c 13.767,-2.78654 27.4145,-10.16559 30.7575,-16.63022 3.6318,-7.02317 0.3551,-16.9853 -5.5868,-16.9853 -1.7963,0 -2.882,-0.71339 -3.2547,-2.13842 -0.6732,-2.57454 -2.1718,-2.71996 -4.6759,-0.45375 -1.0238,0.92655 -2.5051,1.79879 -3.2918,1.93833 -6.0464,1.0725 -13.7249,4.2602 -15.914,6.60658 -1.4429,1.54663 -5.3916,4.75989 -8.7748,7.14061 -7.7831,5.47669 -12.9515,12.89019 -12.0789,17.32569 0.3414,1.73497 1.2148,3.53186 1.941,3.99313 2.1534,1.3678 12.0506,0.99012 20.8784,-0.79665 z m 612.74714,23.18696 c -2.7161,-0.95627 -7.0465,-3.48546 -9.6228,-5.62046 -3.8052,-3.1534 -5.0355,-5.10081 -6.5554,-10.37841 -2.2686,-7.87694 -2.3812,-13.99061 -0.3472,-18.85859 0.838,-2.00593 2.0747,-7.4033 2.7479,-11.99417 0.6731,-4.59087 1.8832,-12.43676 2.6892,-17.43529 1.4175,-8.79269 1.962,-14.96351 3.3747,-38.25676 0.3669,-6.04567 1.068,-11.24017 1.5586,-11.54334 0.4906,-0.30317 1.8874,-0.0184 3.1042,0.63276 1.8636,0.99733 2.8009,0.66715 5.9463,-2.09462 3.2852,-2.88448 4.275,-3.20292 8.2345,-2.64918 2.4754,0.34618 5.102,0.81475 5.837,1.04131 2.2652,0.6981 1.5194,9.20579 -1.7874,20.38749 -1.7182,5.81005 -3.4524,14.65342 -3.8539,19.65194 -0.4013,4.99851 -1.8656,14.62132 -3.2538,21.384 -2.9609,14.42343 -4.2089,25.49829 -3.2875,29.16992 1.8556,7.39351 23.0874,5.71188 40.5095,-3.20858 5.1416,-2.63261 10.4801,-6.13151 11.8633,-7.77534 2.5646,-3.0478 4.1547,-10.34257 5.6542,-25.9377 0.3814,-3.9694 1.1086,-7.2171 1.6155,-7.2171 1.3693,0 1.1165,-6.16839 -0.2883,-7.0366 -1.5124,-0.93472 -0.5901,-30.12104 1.1327,-35.84168 l 1.16,-3.85249 11.3717,-0.73521 c 10.7904,-0.6976 11.5007,-0.61411 13.8927,1.63315 3.0698,2.88379 3.2142,6.17211 0.4269,9.71564 -1.7114,2.17578 -2.2075,4.98699 -2.7128,15.3803 -0.3402,6.99485 -1.0436,15.60473 -1.5632,19.13309 -0.5196,3.52836 -1.2749,11.70774 -1.6782,18.17643 -0.4555,7.30595 -1.5,13.78632 -2.7572,17.10722 -2.4526,6.47869 -2.5266,8.01899 -0.3856,8.01899 1.8791,0 11.4238,-4.65328 15.633,-7.62152 1.561,-1.1007 4.0871,-2.00127 5.6133,-2.00127 3.8557,0 3.6558,3.25186 -0.6078,9.89617 -1.8606,2.89962 -3.7505,7.59685 -4.1998,10.4383 -0.449,2.84145 -1.6244,6.39929 -2.612,7.90634 -3.5586,5.43124 -18.9024,12.35222 -27.4401,12.37724 -3.2352,0.01 -4.4513,-0.63911 -6.6825,-3.56428 -1.5,-1.96669 -2.7274,-4.31348 -2.7274,-5.21507 0,-3.8708 -2.6833,-4.13435 -10.2705,-1.00876 -14.7741,6.08628 -24.1248,8.52662 -34.6358,9.03933 -7.66,0.37366 -11.3718,0.068 -15.096,-1.2432 z m -530.01254,-3.28069 c -2.4025,-2.47561 -4.6865,-5.54712 -5.0755,-6.82555 -0.3891,-1.27844 -1.3076,-3.04616 -2.0411,-3.92823 -2.2705,-2.73032 -2.8427,-7.1791 -1.142,-8.87977 1.2119,-1.21197 3.6336,-1.43122 11.1038,-1.00529 l 9.55384,0.54473 0.4078,-22.55771 c 0.2891,-15.99324 0.7918,-22.94181 1.7275,-23.87751 0.9349,-0.93499 1.3198,-6.22132 1.3198,-18.13109 0,-16.19213 -0.095,-16.92385 -2.5698,-19.86538 -1.783,-2.11888 -2.4069,-3.90621 -2.0377,-5.83728 0.7029,-3.67731 -1.2476,-4.71608 -4.65884,-2.48099 -2.1017,1.37708 -3.2978,1.54375 -5.0317,0.70124 -1.251,-0.60789 -4.0789,-1.6572 -6.2841,-2.33186 -4.7174,-1.44316 -5.007,-2.97933 -1.2665,-6.71979 3.1554,-3.15534 19.02674,-9.22235 26.12544,-9.98669 9.9222,-1.0684 16.0333,5.40305 16.0364,16.98221 8e-4,3.38135 0.3974,6.1479 0.881,6.1479 0.4836,0 3.6383,-3.12311 7.0104,-6.94023 7.5443,-8.54009 13.9087,-12.47253 20.3431,-12.56979 6.6633,-0.10073 11.2449,1.95322 10.5221,4.71715 -0.4872,1.86298 -0.1175,2.10829 2.7274,1.80989 4.7037,-0.49341 8.0644,3.12606 13.673,14.72601 5.2747,10.90948 5.368,11.41322 3.116,16.80308 -0.8821,2.11113 -1.6038,5.77846 -1.6038,8.14957 0,3.18073 -0.4345,4.31114 -1.6569,4.31114 -2.3703,0 -8.0453,3.02679 -11.2035,5.9754 -2.4858,2.32084 -3.0444,2.42191 -6.9498,1.25731 -2.3357,-0.69649 -4.4874,-1.5262 -4.7813,-1.84384 -0.2941,-0.3176 -1.497,-1.10583 -2.6731,-1.7516 -3.1634,-1.737 -4.9089,-5.73408 -3.5845,-8.20868 0.9962,-1.8614 1.2396,-1.73142 2.8711,1.53295 1.8888,3.77937 4.0325,4.71404 8.3348,3.63424 2.8827,-0.72351 6.8129,-8.25192 6.8129,-13.05051 0,-3.73153 -2.0041,-7.0712 -3.8243,-6.37275 -0.9864,0.37856 -1.5218,-0.12911 -1.5218,-1.44327 0,-3.3973 -5.0243,-6.46107 -10.5689,-6.44465 -2.714,0.009 -6.0404,0.31084 -7.3922,0.67292 -2.6533,0.71069 -6.2367,6.91498 -10.388,17.98561 -3.0761,8.20334 -8.0097,37.42747 -8.1195,48.09465 -0.1007,9.79665 1.4194,12.70032 8.225,15.71069 3.2579,1.44115 4.7212,2.73571 4.7212,4.1768 0,2.50721 2.406,2.73877 4.3328,0.417 1.2581,-1.51565 1.4744,-1.51565 2.3225,0 1.1658,2.083 4.4322,2.16769 6.1,0.1582 1.5058,-1.81446 7.389,-0.51889 9.2813,2.04389 0.6528,0.88424 2.2165,1.6077 3.4749,1.6077 2.7098,0 3.0019,2.35308 0.5451,4.39203 -2.263,1.87812 -12.9117,5.19479 -16.7436,5.21503 -1.6406,0.009 -5.0086,1.06631 -7.4845,2.35033 -3.4705,1.79989 -7.3175,2.51146 -16.7973,3.10683 -6.7627,0.42478 -16.6844,1.12256 -22.0483,1.55066 l -9.75264,0.77836 z m 717.64814,2.3186 c -3.6011,-2.92234 -8.952,-11.03201 -8.952,-13.56737 0,-3.34558 5.2002,-7.77133 10.1575,-8.64498 8.442,-1.48773 8.019,0.79935 8.019,-43.36397 0,-24.15584 -0.4462,-41.42229 -1.156,-44.7312 -1.2987,-6.05663 -4.1395,-8.94326 -10.7501,-10.92383 -4.2095,-1.26124 -5.1941,-2.99304 -2.7954,-4.91765 1.3339,-1.07044 19.8459,-4.53546 24.2308,-4.53546 3.473,0 10.8156,7.38045 11.7143,11.77477 1.141,5.57835 3.3942,5.06149 8.7261,-2.00156 3.6421,-4.82458 6.3549,-7.1127 11.4015,-9.61619 6.4677,-3.20857 6.7422,-3.24953 11.7696,-1.75655 6.5337,1.94031 13.2629,6.86516 15.7887,11.55505 1.8633,3.46012 1.8807,4.36669 0.3437,17.96098 -1.6088,14.22793 -1.652,14.37009 -6.9599,22.87052 -2.9376,4.7045 -6.011,8.55361 -6.8297,8.55361 -1.1352,0 -1.6246,-2.54084 -2.0594,-10.69201 -0.6594,-12.36021 -2.2632,-16.26371 -8.0972,-19.70585 -6.3922,-3.77145 -7.9648,-2.86457 -11.8443,6.83011 -5.5241,13.80529 -11.9228,54.55581 -9.5666,60.9259 2.7679,7.48296 2.3118,7.29729 14.6607,5.96866 6.1276,-0.65931 12.9563,-1.59226 15.175,-2.0733 2.4474,-0.53051 4.2865,-0.4665 4.6753,0.1628 0.3527,0.57056 -2.7459,4.47609 -6.8861,8.67894 -4.1396,4.20287 -8.2332,9.37248 -9.0965,11.48807 -2.735,6.70272 -6.4648,8.06385 -25.872,9.44205 -9.409,0.6682 -18.5506,1.42849 -20.3148,1.68959 -2.0383,0.30167 -4.0367,-0.1981 -5.4822,-1.37113 z m 262.6249,0.82691 c -14.6737,-1.25709 -23.6401,-10.23027 -27.1416,-27.16282 -1.3436,-6.49626 -1.7267,-14.82988 -1.7267,-37.55043 0,-16.06066 -0.2921,-29.96227 -0.6491,-30.89245 -0.5145,-1.34128 -2.367,-1.69126 -8.952,-1.69126 h -8.303 l -4.5002,-4.88214 c -2.7403,-2.9729 -4.2599,-5.50819 -3.886,-6.48294 0.3379,-0.88042 -0.1005,-2.98323 -0.9744,-4.67292 -0.8736,-1.68967 -1.3399,-3.72007 -1.0361,-4.51201 0.8229,-2.14429 15.3112,-9.12781 20.6623,-9.95928 8.6821,-1.34914 8.7999,-1.71971 8.6652,-27.23195 -0.071,-13.54749 -0.5882,-23.6274 -1.309,-25.53727 -1.3386,-3.54595 0.2197,-6.56458 3.3534,-6.4966 2.7307,0.0592 14.7711,7.80254 17.472,11.2363 2.2284,2.83279 2.4947,4.5588 3.0838,19.97665 0.5416,14.17697 0.9533,17.21695 2.574,19.00805 2.4737,2.73328 4.1355,2.67239 10.7175,-0.39267 3.4767,-1.61896 8.5665,-2.78211 14.4017,-3.29111 4.9634,-0.43299 10.2422,-1.40481 11.7301,-2.15961 1.488,-0.75479 5.734,-1.65879 9.4354,-2.00884 5.6048,-0.53011 6.8408,-0.34656 7.3952,1.09796 0.4578,1.1929 -0.6377,2.76758 -3.5087,5.04313 -2.2957,1.81974 -9.7305,8.16716 -16.5217,14.10537 -9.1275,7.98152 -13.9461,11.39501 -18.4797,13.09119 -3.3728,1.26193 -8.4558,3.47187 -11.2957,4.91091 l -5.1634,2.61646 -0.7027,31.33718 c -0.7933,35.36953 -0.2118,42.4553 3.8139,46.48102 2.5517,2.55156 2.869,2.61203 5.7822,1.10134 1.6954,-0.87916 9.4735,-7.66057 17.2849,-15.06973 15.0227,-14.2491 19.2425,-16.61306 17.8433,-9.99635 -1.7125,8.1001 -4.7271,14.68335 -8.1063,17.70259 -3.1389,2.80471 -3.4101,3.46501 -2.3652,5.75882 1.9105,4.19261 -2.6737,12.45641 -10.5695,19.05403 -8.9092,7.44437 -10.7731,8.1762 -19.0239,7.46938 z m -138.7074,-1.63518 c -5.5037,-1.73288 -14.5282,-8.08257 -19.7097,-13.86792 -4.8581,-5.42411 -10.9588,-17.56287 -12.5203,-24.91152 -1.6294,-7.669 -1.4562,-26.75476 0.332,-36.56752 1.4254,-7.82052 6.303,-22.31723 9.7559,-28.99449 4.1603,-8.04475 15.3689,-17.45262 28.8033,-24.17566 15.5985,-7.80596 41.4855,-3.46488 50.9339,8.54123 1.551,1.9708 4.2549,6.44342 6.0087,9.93919 9.9301,19.79294 12.2364,38.72761 7.3504,60.35055 -1.823,8.06739 -3.389,12.6635 -4.5538,13.36503 -0.9766,0.58804 -2.9032,2.03147 -4.281,3.2076 -2.3981,2.04667 -2.4339,2.28276 -0.834,5.50561 1.6006,3.22395 1.5489,3.56159 -1.2129,7.93666 -4.4655,7.07354 -12.001,14.59375 -18.1474,18.11039 -5.5454,3.17282 -5.7037,3.19556 -21.4945,3.09062 -9.9814,-0.0663 -17.5927,-0.63622 -20.4306,-1.52977 z m 30.9369,-23.1007 c 9.8381,-2.17996 17.1124,-13.96492 18.5737,-30.09028 0.3983,-4.39468 0.3497,-16.83098 -0.108,-27.63626 l -0.8321,-19.64594 -8.9185,-6.6825 c -9.926,-7.43761 -11.9023,-7.88878 -21.8374,-4.98537 -9.5528,2.7917 -19.2141,14.05933 -21.8771,25.51425 -0.8083,3.47771 -3.0313,8.00037 -5.7236,11.64491 -4.9679,6.72467 -5.243,8.14476 -2.3714,12.24133 1.1169,1.59335 2.296,5.41451 2.6204,8.49146 0.7434,7.05226 9.6641,25.58614 13.7045,28.4722 6.415,4.58259 14.5128,5.39214 26.7695,2.6762 z m -223.6733,19.39921 c -2.3307,-2.52461 -4.5459,-5.60429 -4.9225,-6.84371 -0.3767,-1.23946 -1.285,-2.97524 -2.0186,-3.85731 -2.3799,-2.86207 -2.8398,-7.182 -0.9638,-9.0579 1.3133,-1.31326 2.8365,-1.56192 6.3452,-1.03578 l 4.6169,0.69235 1.2671,-4.65484 c 0.6968,-2.56018 1.1857,-8.60131 1.0863,-13.42476 -0.1274,-6.19826 0.315,-9.72832 1.5095,-12.0382 1.3101,-2.53323 1.4223,-3.76858 0.4993,-5.49316 -1.6284,-3.04262 -1.482,-9.21496 0.5108,-21.53397 0.9263,-5.72724 1.6842,-12.40641 1.6842,-14.84259 0,-2.67065 0.9158,-5.91099 2.3062,-8.16077 2.019,-3.26663 2.1469,-4.17111 1.0292,-7.26274 -1.4623,-4.04372 -0.1394,-17.96705 2.5489,-26.82837 0.8673,-2.85888 1.5821,-7.76698 1.5885,-10.9069 0.01,-3.13993 1.4093,-11.80046 3.1173,-19.24561 1.7081,-7.44517 3.1422,-15.94239 3.1871,-18.88269 0.045,-2.9403 0.4569,-10.23685 0.9153,-16.21456 l 0.8338,-10.86857 -2.8816,1.70217 c -2.0814,1.22952 -3.2721,1.38706 -4.2882,0.56732 -0.7736,-0.62416 -2.937,-1.4619 -4.8076,-1.86164 -10.2473,-2.18986 -4.7257,-8.8483 11.913,-14.36567 9.0143,-2.98903 11.5274,-3.41586 16.5609,-2.81262 7.6407,0.91573 17.475,3.70361 18.4726,5.23675 1.1547,1.77436 -0.1497,5.03393 -3.5946,8.98371 -1.685,1.93165 -3.0636,4.23217 -3.0636,5.11226 0,0.88008 -0.8418,1.9161 -1.8709,2.30223 -4.36,1.63595 -5.9759,7.63788 -2.955,10.97582 1.7416,1.9244 1.7727,1.65541 -3.2144,27.81542 -1.4013,7.35075 -3.078,18.17642 -3.7258,24.05702 -2.6845,24.36654 -5.5879,45.75579 -8.0603,59.37865 -1.8003,9.91838 -2.6267,18.34913 -2.6267,26.79298 0,9.17794 -0.4003,12.85014 -1.5697,14.39618 -2.2325,2.95155 -2.2124,15.77108 0.029,17.63012 0.9161,0.76027 2.3187,2.94561 3.1169,4.85628 1.9057,4.56055 5.2885,6.4107 8.7978,4.8117 3.4784,-1.58488 4.5961,-0.70317 4.5961,3.62597 0,2.98727 -0.9208,4.40178 -5.4392,8.35423 -5.9251,5.18316 -6.7552,5.39492 -26.7021,6.81078 l -9.5882,0.68059 z m -566.952,-6.16535 c -2.1816,-0.48465 -2.2438,-0.77234 -0.7642,-3.53677 1.0514,-1.96459 5.2511,-2.83819 6.6964,-1.39294 0.9004,0.90044 -0.9758,4.29966 -2.6949,4.88232 -0.7514,0.25468 -2.2081,0.276 -3.2373,0.0474 z"
       id="path8305"
       inkscape:connector-curvature="0"
       sodipodi:nodetypes="csccccsscscccccccccccscsccsscsccscsccscscccscsccccccscssccccccsccccccccccccccsssccccccccccccccccccscscccccscccccsccccccccccsscscccccccccccccccccccsccccccscscccccccscccccccscccscccccccccccccscccccccccsccscscccccscccccccccsccccccsccscccscccccccscccscccscscccsccccccscccccccccccccccccccccccccccscccccccsscscscccccssccccccscccsccscccccscsccccsscccccccscscccccsccccsccccccccscscccscccccccsccccccccccccccscscccccccccccccccccccccccccccccccccccccccccccccccccccccccsccccccccccccccscccccccccccccccscccccsccccscsccccccc" />
    <path
       sodipodi:nodetypes="ccccc"
       inkscape:connector-curvature="0"
       id="path4329"
       d="m 1835.2178,357.30402 16.5232,-11.15831 16.9221,12.23719 -17.6612,10.81842 z"
       style="color:#000000;clip-rule:nonzero;display:inline;overflow:visible;visibility:visible;opacity:1;isolation:auto;mix-blend-mode:normal;color-interpolation:sRGB;color-interpolation-filters:linearRGB;solid-color:#000000;solid-opacity:1;fill:url(#linearGradient4327);fill-opacity:1;fill-rule:nonzero;stroke:#552200;stroke-width:5.4000001;stroke-linecap:butt;stroke-linejoin:miter;stroke-miterlimit:4;stroke-dasharray:none;stroke-dashoffset:0;stroke-opacity:1;filter:url(#filter4268-6);color-rendering:auto;image-rendering:auto;shape-rendering:auto;text-rendering:auto;enable-background:accumulate" />
  </g>
</svg>
