<?xml version="1.0" encoding="UTF-8" standalone="no"?>
<!-- Created with Inkscape (http://www.inkscape.org/) -->

<svg
   xmlns:dc="http://purl.org/dc/elements/1.1/"
   xmlns:cc="http://creativecommons.org/ns#"
   xmlns:rdf="http://www.w3.org/1999/02/22-rdf-syntax-ns#"
   xmlns:svg="http://www.w3.org/2000/svg"
   xmlns="http://www.w3.org/2000/svg"
   xmlns:xlink="http://www.w3.org/1999/xlink"
   xmlns:sodipodi="http://sodipodi.sourceforge.net/DTD/sodipodi-0.dtd"
   xmlns:inkscape="http://www.inkscape.org/namespaces/inkscape"
   id="svg2"
   version="1.1"
   inkscape:version="0.92.2 2405546, 2018-03-11"
   width="2481"
   height="3503"
   sodipodi:docname="E26P01.svg">
  <metadata
     id="metadata8">
    <rdf:RDF>
      <cc:Work
         rdf:about="">
        <dc:format>image/svg+xml</dc:format>
        <dc:type
           rdf:resource="http://purl.org/dc/dcmitype/StillImage" />
        <dc:title />
      </cc:Work>
    </rdf:RDF>
  </metadata>
  <defs
     id="defs6" />
  <sodipodi:namedview
     pagecolor="#ffffff"
     bordercolor="#666666"
     borderopacity="1"
     objecttolerance="10"
     gridtolerance="10"
     guidetolerance="10"
     inkscape:pageopacity="0"
     inkscape:pageshadow="2"
     inkscape:window-width="1280"
     inkscape:window-height="946"
     id="namedview4"
     showgrid="false"
     inkscape:zoom="0.36"
     inkscape:cx="1456.9745"
     inkscape:cy="726.56949"
     inkscape:window-x="0"
     inkscape:window-y="26"
     inkscape:window-maximized="0"
     inkscape:current-layer="layer1"
     inkscape:snap-global="false" />
  <g
     inkscape:groupmode="layer"
     id="layer2"
     inkscape:label="artwork"
     sodipodi:insensitive="true">
    <image
       sodipodi:absref="/home/zveryok/Downloads/webcomics-master/ep26_Books-Are-Great/lang/uk/../gfx_Pepper-and-Carrot_by-David-Revoy_E26P01.png"
       xlink:href="../gfx_Pepper-and-Carrot_by-David-Revoy_E26P01.png"
       width="2481"
       height="3503"
       id="image10"
       x="0"
       y="0" />
  </g>
  <g
     inkscape:groupmode="layer"
     id="layer3"
     inkscape:label="speechbubbles"
     style="display:inline;opacity:1">
    <path
       style="fill:#ffffff;fill-opacity:1;stroke:none;stroke-width:1.33979297"
       d="m 262.07174,1886.1769 c -74.00755,0.4386 -108.80734,-10.674 -126.20339,-20.5104 -28.865,-16.3214 -34.51022,-114.4916 23.65213,-134.0523 58.46845,-19.6636 172.48995,-15.2908 219.28668,22.5228 46.79654,37.8137 13.42112,87.6015 2.66108,97.8334 -10.76022,10.2319 -39.33099,33.814 -119.3965,34.2065 z"
       id="path3659-8"
       inkscape:connector-curvature="0"
       sodipodi:nodetypes="cssssc" />
    <path
       style="color:#000000;display:inline;overflow:visible;visibility:visible;fill:#ffffff;fill-opacity:1;fill-rule:nonzero;stroke:none;stroke-width:0.77001458px;marker:none;enable-background:accumulate"
       d="m 274.67689,1855.3732 c 11.17842,15.8247 25.32183,43.4204 25.79652,49.4209 -6.73911,-0.5556 -13.09406,0.387 -18.03883,1.0204 1.81058,10.7946 32.21158,51.6223 41.64451,56.3046 -23.83945,-10.0592 -58.27989,-45.5693 -59.88737,-63.8703 6.68489,-2.1454 10.75049,-2.4727 14.26692,-3.6967 -0.36416,-9.3034 -20.80365,-30.8908 -20.80365,-30.8908 z"
       id="path5066"
       inkscape:connector-curvature="0"
       sodipodi:nodetypes="cccccccc" />
    <path
       style="color:#000000;display:inline;overflow:visible;visibility:visible;fill:#ffffff;fill-opacity:1;fill-rule:nonzero;stroke:none;stroke-width:1.12914014px;marker:none;enable-background:accumulate"
       d="m 1804.2216,1946.3081 c -38.0014,-49.7059 -36.6648,-154.5338 -25.807,-176.9014 16.9794,-41.8224 57.6598,-49.2864 109.2332,-49.2864 51.5734,0 417.6432,-25.3961 470.5737,26.7951 52.9305,52.1912 36.2688,149.3892 -9.8758,210.2788 -46.1447,60.8897 -302.3369,48.4632 -302.3369,48.4632 0,0 -183.4278,4.0256 -241.7872,-59.3493 z"
       id="path3992"
       inkscape:connector-curvature="0"
       sodipodi:nodetypes="ccscccc" />
    <path
       style="color:#000000;display:inline;overflow:visible;visibility:visible;fill:#ffffff;fill-opacity:1;fill-rule:nonzero;stroke:none;stroke-width:1px;marker:none;enable-background:accumulate"
       d="m 1984.9695,2211.7966 c 97.5172,-13.4683 140.8945,-73.5032 173.5649,-113.8088 15.274,-18.8437 -32.2063,-50.3843 -32.2063,-50.3843 l -20.4844,64.3961 c 4.4776,5.3732 -31.2523,71.0033 -120.8742,99.797 z"
       id="path4000"
       inkscape:connector-curvature="0"
       sodipodi:nodetypes="csccc" />
    <path
       style="color:#000000;display:inline;overflow:visible;visibility:visible;fill:#ffffff;fill-opacity:1;fill-rule:nonzero;stroke:none;stroke-width:0.83059144px;marker:none;enable-background:accumulate"
       d="m 1986.5711,2032.8023 c 15.4863,-23.0063 26.9857,-67.3113 141.0428,-51.7323 61.0951,8.3448 130.5567,7.6994 123.3535,88.2216 -7.2031,80.5222 -108.342,70.1622 -129.0511,71.1095 -20.709,0.9474 -118.3996,0.012 -136.2989,-28.3054 -11.2046,-17.7262 -14.5012,-57.9183 0.9537,-79.2934 z"
       id="path4546-6"
       inkscape:connector-curvature="0"
       sodipodi:nodetypes="cssssc" />
    <path
       style="color:#000000;display:inline;overflow:visible;visibility:visible;opacity:1;vector-effect:none;fill:#ffffff;fill-opacity:1;fill-rule:nonzero;stroke:none;stroke-width:1.20491946;stroke-linecap:butt;stroke-linejoin:miter;stroke-miterlimit:4;stroke-dasharray:none;stroke-dashoffset:0;stroke-opacity:1;marker:none;paint-order:stroke fill markers;enable-background:accumulate"
       d="m 873.29095,2726.9394 c -38.71503,-61.1547 -15.70788,-169.4878 -4.64635,-197.0073 -6.48685,-41.1188 17.8463,-75.3278 78.81276,-68.7991 52.33566,5.6044 437.69794,-28.4857 491.62244,35.7266 53.9243,64.2125 42.3567,181.2504 -4.6544,256.1649 -47.0112,74.9146 -260.3112,53.6323 -392.9725,53.6323 -62.03342,0 -117.47067,13.3476 -168.16195,-79.7174 z"
       id="path3992-0"
       inkscape:connector-curvature="0"
       sodipodi:nodetypes="ccscssc" />
    <path
       style="color:#000000;display:inline;overflow:visible;visibility:visible;fill:#ffffff;fill-opacity:1;fill-rule:nonzero;stroke:none;stroke-width:1.1471467px;marker:none;enable-background:accumulate"
       d="m 1103.8213,2697.422 c -41.0805,41.3971 -74.3212,126.4523 -32.6058,262.3106 -64.481,-107.4324 -40.7404,-218.5665 -31.5488,-251.0486 9.1915,-32.4819 64.1546,-11.262 64.1546,-11.262 z"
       id="path4008"
       inkscape:connector-curvature="0" />
    <path
       style="color:#000000;display:inline;overflow:visible;visibility:visible;fill:#ffffff;fill-opacity:1;fill-rule:nonzero;stroke:none;stroke-width:1.1471467px;marker:none;enable-background:accumulate"
       d="m 1891.9827,2656.832 c -40.4116,58.3597 -53.3089,167.7072 24.2468,263.2149 -108.4132,-99.3198 -82.2954,-214.0613 -72.6196,-244.9782 2.0322,-33.6961 48.3728,-18.2367 48.3728,-18.2367 z"
       id="path4008-0"
       inkscape:connector-curvature="0"
       sodipodi:nodetypes="cccc" />
    <path
       style="color:#000000;display:inline;overflow:visible;visibility:visible;opacity:1;fill:#ffffff;fill-opacity:1;fill-rule:nonzero;stroke:none;stroke-width:1.3938657px;marker:none;enable-background:accumulate"
       d="m 1849.6991,2744.4158 c -88.5801,-11.4249 -103.3369,-33.2233 -124.4642,-85.7917 -21.1274,-52.5684 18.4002,-199.8538 36.8904,-211.8218 11.7741,-4.5693 150.0024,-1.6759 226.5962,10.4072 76.5936,12.0833 166.6956,4.1407 191.8523,86.3811 21.8,71.2666 -26.6058,178.7306 -127.8931,195.4587 -101.2875,16.7282 -202.9816,5.3665 -202.9816,5.3665 z"
       id="path3970"
       inkscape:connector-curvature="0"
       sodipodi:nodetypes="csccssc" />
  </g>
  <g
     inkscape:groupmode="layer"
     id="layer1"
     inkscape:label="txt">
    <text
       xml:space="preserve"
       style="font-style:normal;font-variant:normal;font-weight:normal;font-stretch:normal;line-height:0%;font-family:Lavi;-inkscape-font-specification:Lavi;text-align:center;letter-spacing:0px;word-spacing:0px;text-anchor:middle;fill:#000000;fill-opacity:1;stroke:none"
       x="255.58946"
       y="1793.1943"
       id="text4246"><tspan
         sodipodi:role="line"
         style="font-size:45px;line-height:1.25"
         x="255.58946"
         y="1793.1943"
         id="tspan825">Книжки це</tspan><tspan
         sodipodi:role="line"
         style="font-size:45px;line-height:1.25"
         x="255.58946"
         y="1849.4443"
         id="tspan303">чудово!</tspan></text>
    <text
       xml:space="preserve"
       style="font-style:normal;font-variant:normal;font-weight:normal;font-stretch:normal;line-height:0%;font-family:Lavi;-inkscape-font-specification:Lavi;text-align:center;letter-spacing:0px;word-spacing:0px;text-anchor:middle;fill:#000000;fill-opacity:1;stroke:none"
       x="2111.0237"
       y="2051.428"
       id="text4246-3-5-9"><tspan
         sodipodi:role="line"
         style="font-size:45px;line-height:1.25"
         x="2118.0549"
         y="2051.428"
         id="tspan958">Це чисте </tspan><tspan
         sodipodi:role="line"
         style="font-size:45px;line-height:1.25"
         x="2111.0237"
         y="2107.678"
         id="tspan319">золото!</tspan></text>
    <text
       xml:space="preserve"
       style="font-style:normal;font-variant:normal;font-weight:normal;font-stretch:normal;line-height:0%;font-family:Lavi;-inkscape-font-specification:Lavi;text-align:center;letter-spacing:0px;word-spacing:0px;text-anchor:middle;fill:#000000;fill-opacity:1;stroke:none"
       x="2082.2961"
       y="1787.9297"
       id="text4246-3-3"><tspan
         sodipodi:role="line"
         style="font-size:45px;line-height:1.25"
         x="2082.2961"
         y="1787.9297"
         id="tspan1093">Ця рідкісна книга містить</tspan><tspan
         sodipodi:role="line"
         style="font-size:45px;line-height:1.25"
         x="2089.3274"
         y="1844.1797"
         id="tspan1083">примітки досвідченного </tspan><tspan
         sodipodi:role="line"
         style="font-size:45px;line-height:1.25"
         x="2089.3274"
         y="1900.4297"
         id="tspan1107">авантюриста та описує </tspan><tspan
         sodipodi:role="line"
         style="font-size:45px;line-height:1.25"
         x="2082.2961"
         y="1956.6797"
         id="tspan313">все про підземелля.</tspan></text>
    <text
       xml:space="preserve"
       style="font-style:normal;font-variant:normal;font-weight:normal;font-stretch:normal;line-height:0%;font-family:Lavi;-inkscape-font-specification:Lavi;text-align:center;letter-spacing:0px;word-spacing:0px;text-anchor:middle;fill:#000000;fill-opacity:1;stroke:none"
       x="1163.4302"
       y="2538.7097"
       id="text4246-3-3-1"><tspan
         sodipodi:role="line"
         style="font-size:45px;line-height:1.25"
         x="1170.4614"
         y="2538.7097"
         id="tspan1153">Наприклад, це око зла на </tspan><tspan
         sodipodi:role="line"
         style="font-size:45px;line-height:1.25"
         x="1163.4302"
         y="2594.9597"
         id="tspan331">вхідних дверях стріляє</tspan><tspan
         sodipodi:role="line"
         style="font-size:45px;line-height:1.25"
         x="1170.4614"
         y="2651.2097"
         id="tspan325">смертельними вогняними </tspan><tspan
         sodipodi:role="line"
         style="font-size:45px;line-height:1.25"
         x="1170.4614"
         y="2707.4597"
         id="tspan323">кулями щоб відпугнути </tspan><tspan
         sodipodi:role="line"
         style="font-size:45px;line-height:1.25"
         x="1163.4302"
         y="2763.7097"
         id="tspan333">небажаних відвідувачів.</tspan></text>
    <text
       xml:space="preserve"
       style="font-style:normal;font-variant:normal;font-weight:normal;font-stretch:normal;line-height:0%;font-family:Lavi;-inkscape-font-specification:Lavi;text-align:center;letter-spacing:0px;word-spacing:0px;text-anchor:middle;fill:#000000;fill-opacity:1;stroke:none"
       x="1946.3141"
       y="2538.2783"
       id="text4246-3-3-1-2"><tspan
         sodipodi:role="line"
         style="font-size:45px;line-height:1.25"
         x="1946.3141"
         y="2538.2783"
         id="tspan1226">Однак, якщо ти</tspan><tspan
         sodipodi:role="line"
         style="font-size:45px;line-height:1.25"
         x="1953.3453"
         y="2594.5283"
         id="tspan39"> обережно підійдеш </tspan><tspan
         sodipodi:role="line"
         style="font-size:45px;line-height:1.25"
         x="1946.3141"
         y="2650.7783"
         id="tspan353">зі сторони,</tspan><tspan
         sodipodi:role="line"
         style="font-size:45px;line-height:1.25"
         x="1946.3141"
         y="2707.0283"
         id="tspan41">непоміченим...</tspan><tspan
         sodipodi:role="line"
         style="font-size:45px;line-height:1.25"
         x="1946.3141"
         y="2725.5354"
         id="tspan1230" /></text>
  </g>
</svg>
