<?xml version="1.0" encoding="UTF-8" standalone="no"?>
<!-- Created with Inkscape (http://www.inkscape.org/) -->

<svg
   xmlns:dc="http://purl.org/dc/elements/1.1/"
   xmlns:cc="http://creativecommons.org/ns#"
   xmlns:rdf="http://www.w3.org/1999/02/22-rdf-syntax-ns#"
   xmlns:svg="http://www.w3.org/2000/svg"
   xmlns="http://www.w3.org/2000/svg"
   xmlns:xlink="http://www.w3.org/1999/xlink"
   xmlns:sodipodi="http://sodipodi.sourceforge.net/DTD/sodipodi-0.dtd"
   xmlns:inkscape="http://www.inkscape.org/namespaces/inkscape"
   id="svg2"
   version="1.1"
   inkscape:version="0.92.4 (5da689c313, 2019-01-14)"
   width="2481"
   height="3503"
   sodipodi:docname="E16P02.svg">
  <sodipodi:namedview
     pagecolor="#ffffff"
     bordercolor="#666666"
     inkscape:pageopacity="0"
     inkscape:pageshadow="2"
     inkscape:window-width="1813"
     inkscape:window-height="955"
     id="namedview70"
     showgrid="false"
     inkscape:zoom="0.56568542"
     inkscape:cx="1186.0865"
     inkscape:cy="180.40011"
     inkscape:current-layer="layer1"
     inkscape:window-x="0"
     inkscape:window-y="62"
     inkscape:window-maximized="0" />
  <metadata
     id="metadata8">
    <rdf:RDF>
      <cc:Work
         rdf:about="">
        <dc:format>image/svg+xml</dc:format>
        <dc:type
           rdf:resource="http://purl.org/dc/dcmitype/StillImage" />
        <dc:title />
      </cc:Work>
    </rdf:RDF>
  </metadata>
  <defs
     id="defs6" />
  <sodipodi:namedview
     pagecolor="#ffffff"
     bordercolor="#666666"
     borderopacity="1"
     objecttolerance="10"
     gridtolerance="10"
     guidetolerance="10"
     inkscape:pageopacity="0"
     inkscape:pageshadow="2"
     inkscape:window-width="1920"
     inkscape:window-height="1025"
     id="namedview4"
     showgrid="false"
     inkscape:zoom="0.46"
     inkscape:cx="1607.0828"
     inkscape:cy="1840.0765"
     inkscape:window-x="0"
     inkscape:window-y="26"
     inkscape:window-maximized="1"
     inkscape:current-layer="layer1" />
  <g
     inkscape:groupmode="layer"
     id="layer2"
     inkscape:label="artwork"
     sodipodi:insensitive="true">
    <image
       sodipodi:absref="/felles/omsetting/pepper-carrot/webcomics/ep16_The-Sage-of-the-Mountain/lang/nn/../gfx_Pepper-and-Carrot_by-David-Revoy_E16P02.png"
       xlink:href="../gfx_Pepper-and-Carrot_by-David-Revoy_E16P02.png"
       y="0"
       x="0"
       id="image10"
       height="3503"
       width="2481" />
  </g>
  <g
     inkscape:groupmode="layer"
     id="layer3"
     inkscape:label="speechbubbles">
    <path
       style="fill:#ffffff;fill-rule:evenodd;stroke:none;stroke-width:1.03185201px;stroke-linecap:butt;stroke-linejoin:miter;stroke-opacity:1"
       d="m 159.47183,1209.7327 c 8.4673,-32.5296 31.2689,-57.2107 56.0849,-73.6869 11.8098,-7.9545 25.3086,-13.7838 39.1219,-12.2505 13.7227,0.9162 27.1264,6.3861 41.0009,4.4862 16.871,-0.6275 34.0382,-3.3653 50.7155,0.5468 14.8255,4.2686 30.1,6.4794 45.3989,6.6076 10.7929,-2.7095 20.6691,4.5122 30.3078,8.8315 8.6531,4.6657 17.4915,9.5608 24.7596,16.7779 6.6961,10.1312 14.7138,18.9451 21.4881,28.9862 4.4326,5.4894 4.0067,13.0716 3.8025,20.0889 -0.5757,14.3699 -1.5506,28.9665 -5.1691,42.8106 -2.1654,8.7892 -10.1691,11.6979 -16.319,15.7367 -14.5516,8.5258 -30.0035,14.9912 -43.8912,25.0244 -13.7587,5.1373 -28.3804,2.7344 -42.4906,1.958 -11.8234,-1.5293 -23.7171,-3.6618 -35.6421,-1.8834 -15.1777,1.3014 -30.3093,4.6711 -45.5413,4.2395 -19.0815,-2.9618 -37.3564,-10.2546 -55.848,-16.1047 -16.5903,-5.1563 -31.711,-14.8523 -46.2197,-25.2246 -7.75,-5.89 -15.9543,-12.7363 -18.6894,-23.5909 -2.2421,-7.4743 -2.7704,-15.4775 -2.8697,-23.3533 z"
       id="path4365"
       inkscape:connector-curvature="0" />
    <path
       style="fill:#ffffff;stroke:none"
       d="m 526.05317,1332.6787 c -30.94804,-5.9742 -33.65755,-15.3739 -35.85896,-26.3529 -2.20164,-10.979 -2.97755,-21.2157 -9.14413,-25.0411 -6.16635,-3.8252 -15.85979,-4.8779 -23.17719,-4.6934 -7.31743,0.1844 -5.29357,-9.0401 -8.28411,-16.1281 -2.99067,-7.0881 -31.76642,-37.2963 -31.76642,-37.2963 0,0 -1.64154,31.4089 0.94371,41.0513 2.58502,9.6423 3.48097,13.1815 5.57556,16.7304 2.09482,3.5489 8.54676,11.5174 16.06913,13.2832 7.52237,1.7658 15.47204,-0.2404 21.46624,-0.192 5.99426,0.048 8.9236,8.3554 12.37845,16.2997 3.45476,7.9444 7.26292,13.1493 20.83234,18.6149 11.63149,4.6851 30.96538,3.7243 30.96538,3.7243 z"
       id="path3023-2"
       inkscape:connector-curvature="0"
       sodipodi:nodetypes="csssscssssssc" />
    <path
       style="color:#000000;display:inline;overflow:visible;visibility:visible;fill:#ffffff;fill-opacity:1;fill-rule:nonzero;stroke:none;stroke-width:0.88655752px;marker:none;enable-background:accumulate"
       d="m 1356.7964,1390.7278 c -44.8552,-47.6477 -80.9204,-164.5605 -68.1047,-186.0019 12.8159,-21.4414 36.7252,-20.7647 97.6001,-29.6035 60.243,-8.7471 662.193,-30.1681 691.0822,18.0941 41.1087,68.6761 -2.8319,155.1288 -33.0815,204.6583 -41.7875,68.4212 -416.7637,46.4565 -416.7637,46.4565 0,0 -201.8478,7.1471 -270.7324,-53.6035 z"
       id="path3992"
       inkscape:connector-curvature="0"
       sodipodi:nodetypes="csssscc" />
    <path
       style="fill:#ffffff;stroke:none;stroke-width:1.03552878"
       d="m 1718.066,1513.7674 c -2.6207,-39.0163 44.365,-136.6899 273.5584,-129.3431 229.1936,7.3467 300.9276,50.2632 307.644,119.6149 10.6249,109.7122 -109.9537,139.0311 -283.0935,147.1573 -178.4885,8.3775 -300.8791,-66.9327 -298.1089,-137.4291 z"
       id="path3280-8"
       inkscape:connector-curvature="0"
       sodipodi:nodetypes="csssc" />
    <path
       style="color:#000000;display:inline;overflow:visible;visibility:visible;fill:#ffffff;fill-opacity:1;fill-rule:nonzero;stroke:none;stroke-width:1px;marker:none;enable-background:accumulate"
       d="m 1219.1793,1379.025 c 11.1145,-52.0341 49.4885,-48.0105 61.0024,-50.7043 11.5139,-2.6938 53.2465,-12.1003 59.6337,-55.0276 6.3873,-42.9274 50.5704,-62.6224 50.5704,-62.6224 l -8.1471,64.4127 c 0,0 -26.1867,43.4877 -51.8954,55.4317 -25.7088,11.9439 -66.72,11.6091 -78.3208,20.0382 -11.601,8.429 -26.2997,13.0823 -32.8432,28.4717 z"
       id="path4018"
       inkscape:connector-curvature="0" />
    <path
       style="color:#000000;display:inline;overflow:visible;visibility:visible;fill:#ffffff;fill-opacity:1;fill-rule:nonzero;stroke:none;stroke-width:0.78393513px;marker:none;enable-background:accumulate"
       d="m 257.5107,203.35758 c 3.94474,-57.89395 41.7999,-92.20305 225.0037,-89.81724 151.43737,1.97211 225.48393,17.06067 218.47474,91.49489 -9.72958,103.32329 -137.82024,86.1008 -227.55123,92.1825 C 414.497,295.84241 259.41086,308.90681 257.5107,203.35758 Z"
       id="path4546"
       inkscape:connector-curvature="0"
       sodipodi:nodetypes="csscc" />
    <path
       style="color:#000000;display:inline;overflow:visible;visibility:visible;fill:#ffffff;fill-opacity:1;fill-rule:nonzero;stroke:none;stroke-width:1.05255616px;marker:none;enable-background:accumulate"
       d="m 1145.6459,384.79038 c 2.0239,143.5357 -21.6375,200.04107 -297.70067,194.55129 C 619.7498,574.80382 528.79068,620.59859 525.67074,361.07062 524.04685,225.98861 714.48863,240.15874 867.91915,241.88404 c 88.83418,2.8844 276.86035,-19.4806 277.72675,142.90634 z"
       id="path4546-3"
       inkscape:connector-curvature="0"
       sodipodi:nodetypes="csscc" />
    <path
       style="color:#000000;display:inline;overflow:visible;visibility:visible;fill:#ffffff;fill-opacity:1;fill-rule:nonzero;stroke:none;stroke-width:1px;marker:none;enable-background:accumulate"
       d="m 1291.819,599.42745 c -67.2618,20.68446 -152.2854,0.78987 -192.165,-42.94991 -39.8794,-43.73978 14.3178,-40.84093 14.3178,-40.84093 0,0 77.3502,101.9849 177.8472,83.79084 z"
       id="path5002"
       inkscape:connector-curvature="0"
       sodipodi:nodetypes="cscc" />
    <path
       style="fill:#ffffff;fill-rule:evenodd;stroke:none;stroke-width:0.98392326px;stroke-linecap:butt;stroke-linejoin:miter;stroke-opacity:1"
       d="m 79.975094,2111.7888 23.889306,15.8075 5.8607,-20.4891 14.16667,6.1902 -8.5,-71.6091 31.16668,65.9542 2.83333,-17.1502 12.75001,23.2522 36.95653,-11.8338 6.96015,-57.3816 15.58333,48.5364 11.33334,-20.5085 8.00725,26.3325 c 0,0 1.90941,5.583 16.07608,3.2864 14.16668,-2.2967 143.85758,7.7395 170.00006,26.1902 l 23.31638,10.3342 22.89566,-14.9809 -6.54536,24.8083 48.04944,-42.6051 -27.67813,55.2462 18.18768,-10.0899 -8.84623,21.5256 c 0,0 4.28725,11.9968 8.53725,17.3901 41.08335,46.9483 61.02381,153.7098 68.3094,176.3652 l 31.16669,-3.8604 -21.25001,13.801 c 9.27337,6.5665 42.60605,17.118 112.94447,-10.5575 0,0 -65.0871,44.7296 -110.18892,40.3925 -9.70551,5.1175 39.91853,15.3877 39.91853,15.3877 l -54.05541,6.701 -5.92807,47.9453 39.66668,17.3326 -45.33335,-8.4928 38.25001,41.4669 -47.48634,-10.006 -4.89834,26.1731 -7.79566,9.5924 c -16.35578,11.5056 -39.90898,36.8967 -61.8087,42.5075 0,4.2434 23.72548,46.8683 23.72548,46.8683 l -52.77086,-28.1406 24.43751,34.1484 -57.09048,-28.8739 -14.58176,-0.3884 -8.5,3.3583 c -43.91669,25.3664 -145.52407,10.8285 -162.52408,7.6436 -1.41667,0.089 -18.41666,40.7524 -18.41666,40.7524 l -7.80367,-35.7871 -12.02968,14.3906 -7.05933,-9.6948 -51.81938,66.08 18.09213,-78.2496 -36.52032,32.4453 5.44727,-44.3334 -28.368155,31.972 5.010322,-40.8286 -16.343661,4.7577 z"
       id="path4603"
       inkscape:connector-curvature="0"
       sodipodi:nodetypes="cccccccccccccsscccccccccccccccccccccccccccccccccccccccccc" />
    <path
       style="color:#000000;display:inline;overflow:visible;visibility:visible;fill:#ffffff;fill-opacity:1;fill-rule:nonzero;stroke:none;stroke-width:1px;marker:none;enable-background:accumulate"
       d="m 911.57297,2905.1862 c 26.15941,-35.2543 82.16095,-65.5675 156.19513,-78.8643 74.0341,-13.2967 211.5557,-12.838 235.7905,-9.3658 24.2346,3.4721 157.3586,15.071 186.5886,34.2365 29.2299,19.1652 68.7814,42.8654 77.7025,67.9563 8.9214,25.0909 2.8452,86.0066 -23.7889,99.9521 -26.6342,13.9453 -148.5752,45.553 -220.0518,48.5351 -71.4766,2.9823 -237.9994,-6.3821 -285.5577,-14.1337 -47.55828,-7.7516 -97.95553,-17.8163 -113.43039,-45.1473 -15.47501,-27.331 -44.14549,-63.0881 -13.44794,-103.1689 z"
       id="path3533"
       inkscape:connector-curvature="0" />
    <path
       style="fill:#ffffff;stroke:none"
       d="m 1665.3162,3027.9651 c -45.7195,6.3375 -53.9298,-5.1776 -62.1848,-19.0773 -8.2551,-13.8997 -14.1828,-27.4561 -24.5416,-29.7762 -10.3587,-2.3201 -24.2907,0.778 -34.3436,4.4479 -10.0531,3.6701 -16.0502,-4.3086 -23.5544,-12.549 -7.5042,-8.2404 -57.2715,-41.3793 -57.2715,-41.3793 0,0 12.6136,43.4743 20.7667,55.3773 8.1531,11.903 11.0722,16.2967 15.6572,20.1434 4.5852,3.8466 17.3035,11.6669 28.565,10.553 11.2614,-1.1138 21.3268,-7.5562 29.6567,-10.2912 8.3298,-2.7351 21.007,2.5425 29.5605,11.7303 8.5534,9.1878 31.1188,27.0998 49.1012,23.41 17.9825,-3.6897 28.5886,-12.5889 28.5886,-12.5889 z"
       id="path3023"
       inkscape:connector-curvature="0"
       sodipodi:nodetypes="csssscssssssc" />
  </g>
  <g
     inkscape:groupmode="layer"
     id="layer1"
     inkscape:label="txt"
     style="display:inline">
    <text
       xml:space="preserve"
       style="font-style:normal;font-variant:normal;font-weight:normal;font-stretch:normal;line-height:0%;font-family:Lavi;-inkscape-font-specification:Lavi;text-align:center;letter-spacing:0px;word-spacing:0px;text-anchor:middle;fill:#000000;fill-opacity:1;stroke:none"
       x="830.75757"
       y="317.35486"
       id="text4246-4"><tspan
         sodipodi:role="line"
         style="font-size:45px;line-height:1.25"
         x="830.75757"
         y="317.35486"
         id="tspan3465">Er det noko eg ikkje gjer,</tspan><tspan
         sodipodi:role="line"
         style="font-size:45px;line-height:1.25"
         x="830.75757"
         y="373.60486"
         id="tspan87">så er det å mekla –</tspan><tspan
         sodipodi:role="line"
         style="font-size:45px;line-height:1.25"
         x="830.75757"
         y="429.85486"
         id="tspan89">ikkje eingong for vener.</tspan><tspan
         sodipodi:role="line"
         style="font-size:45px;line-height:1.25"
         x="830.75757"
         y="486.10486"
         id="tspan91">Det kjem det nemleg</tspan><tspan
         sodipodi:role="line"
         style="font-size:45px;line-height:1.25"
         x="830.75757"
         y="542.35486"
         id="tspan93">aldri noko bra ut av.</tspan></text>
    <text
       xml:space="preserve"
       style="font-style:normal;font-variant:normal;font-weight:normal;font-stretch:normal;line-height:0%;font-family:Lavi;-inkscape-font-specification:Lavi;text-align:center;letter-spacing:0px;word-spacing:0px;text-anchor:middle;fill:#000000;fill-opacity:1;stroke:none"
       x="478.92535"
       y="184.53915"
       id="text4246-42"><tspan
         sodipodi:role="line"
         style="font-size:45px;line-height:1.25"
         x="478.92535"
         y="184.53915"
         id="tspan3442">Dette må du</tspan><tspan
         sodipodi:role="line"
         style="font-size:45px;line-height:1.25"
         x="478.92535"
         y="240.78915"
         id="tspan65">ordna opp i sjølv.</tspan></text>
    <text
       xml:space="preserve"
       style="font-style:normal;font-variant:normal;font-weight:normal;font-stretch:normal;line-height:0%;font-family:Lavi;-inkscape-font-specification:Lavi;text-align:center;letter-spacing:0px;word-spacing:0px;text-anchor:middle;fill:#000000;fill-opacity:1;stroke:none"
       x="320.12131"
       y="1198.3259"
       id="text4246-4-3"><tspan
         sodipodi:role="line"
         style="font-size:45px;line-height:1.25"
         x="320.12131"
         y="1198.3259"
         id="tspan4324">Ver så snill,</tspan><tspan
         sodipodi:role="line"
         style="font-size:45px;line-height:1.25"
         x="320.12131"
         y="1254.5759"
         id="tspan100">Safran ...</tspan></text>
    <text
       xml:space="preserve"
       style="font-style:normal;font-variant:normal;font-weight:normal;font-stretch:normal;line-height:0%;font-family:Lavi;-inkscape-font-specification:Lavi;text-align:center;letter-spacing:0px;word-spacing:0px;text-anchor:middle;fill:#000000;fill-opacity:1;stroke:none"
       x="1690.2172"
       y="1233.8634"
       id="text4246-4-3-5"><tspan
         sodipodi:role="line"
         style="font-size:45px;line-height:1.25"
         x="1690.2172"
         y="1233.8634"
         id="tspan3486">Eg lærer ikkje <tspan
   style="font-style:italic"
   id="tspan58">noko</tspan> frå gudmødrene!</tspan><tspan
         sodipodi:role="line"
         style="font-size:45px;line-height:1.25"
         x="1690.2172"
         y="1290.1134"
         id="tspan111">Dei tek berre over huset mitt,</tspan><tspan
         sodipodi:role="line"
         style="font-size:45px;line-height:1.25"
         x="1690.2172"
         y="1346.3634"
         id="tspan113">klagar over gikta og kjeftar på</tspan><tspan
         sodipodi:role="line"
         style="font-size:45px;line-height:1.25"
         x="1690.2172"
         y="1402.6134"
         id="tspan115">meg same kva eg gjer ...</tspan></text>
    <text
       xml:space="preserve"
       style="font-style:normal;font-variant:normal;font-weight:normal;font-stretch:normal;line-height:0%;font-family:Lavi;-inkscape-font-specification:Lavi;text-align:center;letter-spacing:0px;word-spacing:0px;text-anchor:middle;fill:#000000;fill-opacity:1;stroke:none"
       x="309.28632"
       y="2184.7444"
       id="text4246-4-3-4"><tspan
         sodipodi:role="line"
         style="font-size:45px;line-height:1.25"
         x="309.28632"
         y="2184.7444"
         id="tspan3514">Høyr her!</tspan><tspan
         sodipodi:role="line"
         style="font-size:45px;line-height:1.25"
         x="309.28632"
         y="2240.9944"
         id="tspan146">Du er ei heks –</tspan><tspan
         sodipodi:role="line"
         style="font-size:45px;line-height:1.25"
         x="309.28632"
         y="2297.2444"
         id="tspan148">du bør snart læra å</tspan><tspan
         sodipodi:role="line"
         style="font-size:45px;line-height:1.25"
         x="309.28632"
         y="2353.4944"
         id="tspan78">oppføra deg som ei!</tspan></text>
    <text
       xml:space="preserve"
       style="font-style:normal;font-variant:normal;font-weight:normal;font-stretch:normal;line-height:0%;font-family:Lavi;-inkscape-font-specification:Lavi;text-align:center;letter-spacing:0px;word-spacing:0px;text-anchor:middle;fill:#000000;fill-opacity:1;stroke:none"
       x="308.00092"
       y="2531.2104"
       id="text4246-4-3-4-7"><tspan
         sodipodi:role="line"
         style="font-size:45px;line-height:1.25"
         x="308.00092"
         y="2531.2104"
         id="tspan4438">Vis at du er</tspan><tspan
         sodipodi:role="line"
         style="font-size:45px;line-height:1.25"
         x="308.00092"
         y="2587.4604"
         id="tspan156">stor jente!</tspan></text>
    <text
       xml:space="preserve"
       style="font-style:normal;font-variant:normal;font-weight:normal;font-stretch:normal;line-height:0%;font-family:Lavi;-inkscape-font-specification:Lavi;text-align:center;letter-spacing:0px;word-spacing:0px;text-anchor:middle;fill:#000000;fill-opacity:1;stroke:none"
       x="308.74799"
       y="2443.6948"
       id="text4246-4-3-4-7-0"><tspan
         sodipodi:role="line"
         style="font-size:45px;line-height:1.25"
         x="308.74799"
         y="2443.6948"
         id="tspan4434">Tal med dei sjølv!</tspan></text>
    <text
       xml:space="preserve"
       style="font-style:normal;font-variant:normal;font-weight:normal;font-stretch:normal;line-height:0%;font-family:Lavi;-inkscape-font-specification:Lavi;text-align:center;letter-spacing:0px;word-spacing:0px;text-anchor:middle;fill:#000000;fill-opacity:1;stroke:none"
       x="2014.6814"
       y="1483.0845"
       id="text4246-4-3-5-1"><tspan
         sodipodi:role="line"
         style="font-size:45px;line-height:1.25"
         x="2014.6814"
         y="1483.0845"
         id="tspan3499">Er du <tspan
   style="font-style:italic"
   id="tspan134">heilt sikker</tspan> på at</tspan><tspan
         sodipodi:role="line"
         style="font-size:45px;line-height:1.25"
         x="2014.6814"
         y="1539.3345"
         id="tspan122">du ikkje kan hjelpa meg å</tspan><tspan
         sodipodi:role="line"
         style="font-size:45px;line-height:1.25"
         x="2014.6814"
         y="1595.5845"
         id="tspan128">snakka med dei ...?</tspan></text>
    <text
       xml:space="preserve"
       style="font-style:normal;font-variant:normal;font-weight:normal;font-stretch:normal;line-height:0%;font-family:Lavi;-inkscape-font-specification:Lavi;text-align:center;letter-spacing:0px;word-spacing:0px;text-anchor:middle;fill:#000000;fill-opacity:1;stroke:none"
       x="1243.7258"
       y="2887.5386"
       id="text4246-4-3-5-1-7"><tspan
         sodipodi:role="line"
         style="font-size:45px;line-height:1.25"
         x="1243.7258"
         y="2887.5386"
         id="tspan3533">Greitt, greitt!</tspan><tspan
         sodipodi:role="line"
         style="font-size:45px;line-height:1.25"
         x="1243.7258"
         y="2943.7886"
         id="tspan163">Eg får vel verta med deg</tspan><tspan
         sodipodi:role="line"
         style="font-size:45px;line-height:1.25"
         x="1243.7258"
         y="3000.0386"
         id="tspan165">og veksla nokre ord med dei.</tspan></text>
  </g>
</svg>
