<?xml version="1.0" encoding="UTF-8" standalone="no"?>
<!-- Created with Inkscape (http://www.inkscape.org/) -->

<svg
   xmlns:dc="http://purl.org/dc/elements/1.1/"
   xmlns:cc="http://creativecommons.org/ns#"
   xmlns:rdf="http://www.w3.org/1999/02/22-rdf-syntax-ns#"
   xmlns:svg="http://www.w3.org/2000/svg"
   xmlns="http://www.w3.org/2000/svg"
   xmlns:xlink="http://www.w3.org/1999/xlink"
   xmlns:sodipodi="http://sodipodi.sourceforge.net/DTD/sodipodi-0.dtd"
   xmlns:inkscape="http://www.inkscape.org/namespaces/inkscape"
   id="svg2"
   version="1.1"
   inkscape:version="0.92.3 (2405546, 2018-03-11)"
   width="2481"
   height="3503"
   sodipodi:docname="E23P06.svg">
  <metadata
     id="metadata8">
    <rdf:RDF>
      <cc:Work
         rdf:about="">
        <dc:format>image/svg+xml</dc:format>
        <dc:type
           rdf:resource="http://purl.org/dc/dcmitype/StillImage" />
        <dc:title />
      </cc:Work>
    </rdf:RDF>
  </metadata>
  <defs
     id="defs6" />
  <sodipodi:namedview
     pagecolor="#ffffff"
     bordercolor="#666666"
     borderopacity="1"
     objecttolerance="10"
     gridtolerance="10"
     guidetolerance="10"
     inkscape:pageopacity="0"
     inkscape:pageshadow="2"
     inkscape:window-width="1299"
     inkscape:window-height="713"
     id="namedview4"
     showgrid="false"
     inkscape:zoom="0.26342335"
     inkscape:cx="1520.851"
     inkscape:cy="1151.1111"
     inkscape:window-x="67"
     inkscape:window-y="27"
     inkscape:window-maximized="1"
     inkscape:current-layer="layer1"
     inkscape:document-rotation="0" />
  <g
     inkscape:groupmode="layer"
     id="layer2"
     inkscape:label="artwork"
     sodipodi:insensitive="true"
     style="display:inline">
    <image
       sodipodi:absref="/home/emmiline/Documents/git/webcomics/ep23_Take-a-Chance/lang/da/../gfx_Pepper-and-Carrot_by-David-Revoy_E23P06.png"
       xlink:href="../gfx_Pepper-and-Carrot_by-David-Revoy_E23P06.png"
       width="2481"
       height="3503"
       id="image10"
       x="0"
       y="0" />
  </g>
  <g
     inkscape:groupmode="layer"
     id="layer3"
     inkscape:label="speechbubbles"
     style="display:inline">
    <path
       style="fill:#ffffff;fill-rule:evenodd;stroke:none;stroke-width:0.94849288px;stroke-linecap:butt;stroke-linejoin:miter;stroke-opacity:1"
       d="m 192.21541,2100.1491 c 4.57778,-69.3791 28.61112,-112.9427 52.64447,-117.7832 24.03333,-4.8403 258.64453,0 281.53342,11.2943 22.88891,11.2942 56.07781,58.0848 54.93336,93.5812 -1.14445,35.4962 3.17975,88.907 -32.04445,130.6908 -25.03869,29.7014 -169.37784,22.5886 -193.41119,22.5886 -24.03334,0 -90.26513,15.6988 -128.17783,-24.202 -38.26254,-40.2689 -35.47778,-116.1697 -35.47778,-116.1697 z"
       id="path4272"
       inkscape:connector-curvature="0"
       sodipodi:nodetypes="cssssssc" />
    <path
       style="fill:#ffffff;fill-rule:evenodd;stroke:none;stroke-width:1px;stroke-linecap:butt;stroke-linejoin:miter;stroke-opacity:1"
       d="m 1345.8132,2086.9463 c -5.0561,60.8814 -43.5778,96.5557 -74.4258,101.3173 -30.8479,4.7615 -340.74358,8.6177 -370.31304,-0.7811 -29.56935,-9.3986 -89.08397,-51.1781 -88.03724,-82.3007 1.04682,-31.1227 1.62769,-76.3154 46.42431,-113.685 31.84314,-26.5638 227.03617,-23.4604 257.94187,-23.9814 30.906,-0.5208 134.8766,-0.6491 184.1085,33.4859 49.6862,34.4498 44.3014,85.945 44.3014,85.945 z"
       id="path4272-6"
       inkscape:connector-curvature="0"
       sodipodi:nodetypes="cssssssc" />
    <path
       style="fill:#ffffff;fill-rule:evenodd;stroke:none;stroke-width:1px;stroke-linecap:butt;stroke-linejoin:miter;stroke-opacity:1"
       d="m 1174.8502,2374.625 c 53.2945,-58.4181 71.3886,-137.4736 64.8491,-196.709 -6.4438,-58.3689 -35.667,-20.5356 -35.667,-20.5356 0,0 -7.6853,2.1941 0,30.2629 7.8496,28.6688 31.1185,75.2067 -29.1821,186.9817 z"
       id="path4289"
       inkscape:connector-curvature="0"
       sodipodi:nodetypes="cscsc" />
    <path
       style="fill:#ffffff;fill-rule:evenodd;stroke:none;stroke-width:1px;stroke-linecap:butt;stroke-linejoin:miter;stroke-opacity:1"
       d="m 2059.5546,2355.1659 c 94.4635,-48.4747 132.9947,-119.3224 130.5089,-160.3395 -2.4859,-41.0171 -23.6159,-53.4465 -28.5877,-22.3729 -4.9718,31.0735 19.8871,90.7347 -101.9212,182.7124 z"
       id="path4293"
       inkscape:connector-curvature="0" />
    <path
       style="fill:#ffffff;fill-rule:evenodd;stroke:none;stroke-width:0.96484172px;stroke-linecap:butt;stroke-linejoin:miter;stroke-opacity:1"
       d="m 1875.871,2048.5504 c 18.4634,-35.987 55.3901,-69.7928 89.6792,-80.6979 34.2891,-10.9054 117.3742,-4.3621 138.4753,-7.6337 21.1009,-3.2717 110.7801,-3.2717 137.1564,0 26.3762,3.2716 96.2733,18.5388 114.7367,35.9869 18.4634,17.4483 48.796,53.4352 42.2019,79.6075 -6.5941,26.1723 5.2752,37.0774 -18.4633,57.7971 -23.7386,20.7198 -79.1288,53.4352 -127.9248,58.8878 -48.796,5.4527 -187.2713,8.7241 -224.1981,5.4527 -36.9266,-3.2716 -108.1424,-20.7199 -123.9681,-39.2586 -15.8259,-18.5386 -43.5209,-57.7971 -27.6952,-110.1418 z"
       id="path4291"
       inkscape:connector-curvature="0" />
  </g>
  <g
     inkscape:groupmode="layer"
     id="layer1"
     inkscape:label="txt"
     style="display:inline">
    <text
       xml:space="preserve"
       style="font-style:normal;font-variant:normal;font-weight:normal;font-stretch:normal;line-height:0%;font-family:Lavi;-inkscape-font-specification:Lavi;text-align:center;letter-spacing:0px;word-spacing:0px;text-anchor:middle;fill:#000000;fill-opacity:1;stroke:#000000;stroke-width:0.41015574;stroke-miterlimit:4;stroke-dasharray:none;stroke-opacity:1"
       x="1954.752"
       y="1501.1776"
       id="text4246-8"
       transform="matrix(0.76133526,-0.51280204,0.4098681,1.0374126,0,0)"><tspan
         sodipodi:role="line"
         style="font-size:41.48361969px;line-height:1.25;fill:#000000;stroke:#000000;stroke-width:0.41015574;stroke-miterlimit:4;stroke-dasharray:none;stroke-opacity:1"
         x="1954.752"
         y="1501.1776"
         id="tspan4150-8">Pip!</tspan></text>
    <text
       xml:space="preserve"
       style="font-style:normal;font-variant:normal;font-weight:normal;font-stretch:normal;line-height:0%;font-family:Lavi;-inkscape-font-specification:Lavi;text-align:center;letter-spacing:0px;word-spacing:0px;text-anchor:middle;fill:#000000;fill-opacity:1;stroke:#000000;stroke-width:0.41015574;stroke-miterlimit:4;stroke-dasharray:none;stroke-opacity:1"
       x="2086.8733"
       y="1374.3584"
       id="text4246-8-3"
       transform="matrix(0.8070703,-0.42305912,0.27884184,1.092883,0,0)"><tspan
         sodipodi:role="line"
         style="font-size:38.3127861px;line-height:1.25;fill:#000000;stroke:#000000;stroke-width:0.41015574;stroke-miterlimit:4;stroke-dasharray:none;stroke-opacity:1"
         x="2086.8733"
         y="1374.3584"
         id="tspan4150-8-6">Pip!</tspan></text>
    <text
       xml:space="preserve"
       style="font-style:normal;font-variant:normal;font-weight:normal;font-stretch:normal;line-height:0%;font-family:Lavi;-inkscape-font-specification:Lavi;text-align:center;letter-spacing:0px;word-spacing:0px;text-anchor:middle;fill:#000000;fill-opacity:1;stroke:#000000;stroke-width:0.41015574;stroke-miterlimit:4;stroke-dasharray:none;stroke-opacity:1"
       x="2137.4421"
       y="1412.3752"
       id="text4246-8-3-7"
       transform="matrix(0.8070703,-0.42305912,0.27884184,1.092883,0,0)"><tspan
         sodipodi:role="line"
         style="font-size:38.3127861px;line-height:1.25;fill:#000000;stroke:#000000;stroke-width:0.41015574;stroke-miterlimit:4;stroke-dasharray:none;stroke-opacity:1"
         x="2137.4421"
         y="1412.3752"
         id="tspan4150-8-6-5">Pip!</tspan></text>
    <text
       xml:space="preserve"
       style="font-style:normal;font-variant:normal;font-weight:normal;font-stretch:normal;line-height:0%;font-family:Lavi;-inkscape-font-specification:Lavi;text-align:center;letter-spacing:0px;word-spacing:0px;text-anchor:middle;fill:#000000;fill-opacity:1;stroke:#000000;stroke-width:0.41015574;stroke-miterlimit:4;stroke-dasharray:none;stroke-opacity:1"
       x="1869.3112"
       y="1652.55"
       id="text4246-8-3-3"
       transform="matrix(0.73266151,-0.54180126,0.44311163,1.0372069,0,0)"><tspan
         sodipodi:role="line"
         style="font-size:38.3127861px;line-height:1.25;fill:#000000;stroke:#000000;stroke-width:0.41015574;stroke-miterlimit:4;stroke-dasharray:none;stroke-opacity:1"
         x="1869.3112"
         y="1652.55"
         id="tspan4150-8-6-56">Pip!</tspan></text>
    <text
       xml:space="preserve"
       style="font-style:normal;font-variant:normal;font-weight:normal;font-stretch:normal;line-height:0%;font-family:Lavi;-inkscape-font-specification:Lavi;text-align:center;letter-spacing:0px;word-spacing:0px;text-anchor:middle;fill:#000000;fill-opacity:1;stroke:none"
       x="390.71164"
       y="2048.1582"
       id="text4246"><tspan
         sodipodi:role="line"
         style="font-size:45px;line-height:1.25"
         x="390.71164"
         y="2048.1582"
         id="tspan45">Ser du, Carrot,</tspan><tspan
         sodipodi:role="line"
         style="font-size:45px;line-height:1.25"
         x="390.71164"
         y="2104.4082"
         id="tspan53">jeg tror det er</tspan><tspan
         sodipodi:role="line"
         style="font-size:45px;line-height:1.25"
         x="390.71164"
         y="2160.6582"
         id="tspan57">en del af at</tspan><tspan
         sodipodi:role="line"
         style="font-size:45px;line-height:1.25"
         x="390.71164"
         y="2216.9082"
         id="tspan38">blive voksen.</tspan></text>
    <text
       xml:space="preserve"
       style="font-style:normal;font-variant:normal;font-weight:normal;font-stretch:normal;line-height:0%;font-family:Lavi;-inkscape-font-specification:Lavi;text-align:center;letter-spacing:0px;word-spacing:0px;text-anchor:middle;fill:#000000;fill-opacity:1;stroke:none"
       x="1089.3129"
       y="2041.9417"
       id="text4246-2"><tspan
         sodipodi:role="line"
         style="font-size:45px;line-height:1.25"
         x="1089.3129"
         y="2041.9417"
         id="tspan4235">Undgå de nemme</tspan><tspan
         sodipodi:role="line"
         style="font-size:45px;line-height:1.25"
         x="1089.3129"
         y="2098.1917"
         id="tspan44">løsninger, se værdien af</tspan><tspan
         sodipodi:role="line"
         style="font-size:45px;line-height:1.25"
         x="1097.223"
         y="2154.4417"
         id="tspan48">hårdt arbejde... </tspan><tspan
         sodipodi:role="line"
         style="font-size:45px;line-height:1.25"
         x="1089.3129"
         y="2172.9751"
         id="tspan66" /></text>
    <text
       xml:space="preserve"
       style="font-style:normal;font-variant:normal;font-weight:normal;font-stretch:normal;line-height:0%;font-family:Lavi;-inkscape-font-specification:Lavi;text-align:center;letter-spacing:0px;word-spacing:0px;text-anchor:middle;fill:#000000;fill-opacity:1;stroke:none"
       x="2124.6797"
       y="2040.2068"
       id="text4246-2-7"><tspan
         sodipodi:role="line"
         style="font-size:45px;line-height:1.25"
         x="2124.6797"
         y="2040.2068"
         id="tspan83">...ingen grund til</tspan><tspan
         sodipodi:role="line"
         style="font-size:45px;line-height:1.25"
         x="2124.6797"
         y="2096.4568"
         id="tspan85">at være jaloux på dem</tspan><tspan
         sodipodi:role="line"
         style="font-size:45px;line-height:1.25"
         x="2124.6797"
         y="2152.7068"
         id="tspan95">der har fået succes!</tspan></text>
  </g>
</svg>
