<?xml version="1.0" encoding="UTF-8" standalone="no"?>
<!-- Created With Inkscape (http://www.inkscape.org/) -->

<svg
   xmlns:dc="http://purl.org/dc/elements/1.1/"
   xmlns:cc="http://creativecommons.org/ns#"
   xmlns:rdf="http://www.w3.org/1999/02/22-rdf-syntax-ns#"
   xmlns:svg="http://www.w3.org/2000/svg"
   xmlns="http://www.w3.org/2000/svg"
   xmlns:xlink="http://www.w3.org/1999/xlink"
   xmlns:sodipodi="http://sodipodi.sourceforge.net/DTD/sodipodi-0.dtd"
   xmlns:inkscape="http://www.inkscape.org/namespaces/inkscape"
   id="svg2"
   version="1.1"
   inkscape:version="0.91 r13725"
   width="2481"
   height="663"
   sodipodi:docname="Pepper-and-Carrot_by-David-Revoy_E03P00.svg"
   sodipodi:absref="/home/deevad/Development/github/pepper-carrot_project-manager/lang/fr/../gfx_Pepper-and-Carrot_by-David-Revoy_E03P00.png"
   inkscape:export-xdpi="90.720001"
   inkscape:export-ydpi="90.720001">
  <metadata
     id="metadata8">
    <rdf:RDF>
      <cc:Work
         rdf:about="">
        <dc:format>image/svg+xml</dc:format>
        <dc:type
           rdf:resource="http://purl.org/dc/dcmitype/StillImage" />
        <dc:title />
      </cc:Work>
    </rdf:RDF>
  </metadata>
  <defs
     id="defs6" />
  <sodipodi:namedview
     pagecolor="#ffffff"
     bordercolor="#666666"
     borderopacity="1"
     objecttolerance="10"
     gridtolerance="10"
     guidetolerance="10"
     inkscape:pageopacity="0"
     inkscape:pageshadow="2"
     inkscape:window-width="1920"
     inkscape:window-height="1043"
     id="namedview4"
     showgrid="false"
     inkscape:zoom="0.60944264"
     inkscape:cx="901.01703"
     inkscape:cy="432.56385"
     inkscape:window-x="1920"
     inkscape:window-y="22"
     inkscape:window-maximized="1"
     inkscape:current-layer="layer1" />
  <g
     inkscape:groupmode="layer"
     id="layer2"
     inkscape:label="artwork"
     sodipodi:insensitive="true">
    <image
       sodipodi:absref="/home/deevad/peppercarrot/webcomics/ep03_The-secret-ingredients/lang/eo/../gfx_Pepper-and-Carrot_by-David-Revoy_E03P00.png"
       xlink:href="../gfx_Pepper-and-Carrot_by-David-Revoy_E03P00.png"
       y="0"
       x="0"
       id="image10"
       height="663"
       width="2481" />
  </g>
  <g
     inkscape:groupmode="layer"
     id="layer1"
     inkscape:label="txt"
     style="display:inline">
    <flowRoot
       xml:space="preserve"
       id="episode-title"
       style="font-style:normal;font-variant:normal;font-weight:normal;font-stretch:normal;font-size:12px;line-height:125%;font-family:Arial;-inkscape-font-specification:Arial;letter-spacing:0px;word-spacing:0px;fill:#301b0b;fill-opacity:1;stroke:none"
       transform="translate(-739.25113,-122.27392)"><flowRegion
         id="flowRegion2989"><rect
           id="rect2991"
           width="2405.8"
           height="107.55731"
           x="739.22333"
           y="644.36664"
           style="fill:#301b0b;fill-opacity:1" /></flowRegion><flowPara
         id="flowPara2993"
         style="font-style:normal;font-variant:normal;font-weight:normal;font-stretch:normal;font-size:72px;font-family:Lavi;-inkscape-font-specification:Lavi;text-align:center;text-anchor:middle;fill:#301b0b;fill-opacity:1">Ĉapitro 3a: La sekretaj ingrediencoj</flowPara></flowRoot>    <flowRoot
       xml:space="preserve"
       id="flowRoot2996-2"
       style="font-style:normal;font-weight:normal;font-size:40px;line-height:125%;font-family:Sans;letter-spacing:0px;word-spacing:0px;display:inline;fill:#ac7c5b;fill-opacity:1;stroke:none"
       transform="matrix(1.4459619,0,0,1.3974976,63.470509,124.59553)"><flowRegion
         id="flowRegion2998-3"
         style="fill:#ac7c5b;fill-opacity:1"><rect
           id="rect3000-9"
           width="549.01398"
           height="107.30727"
           x="464.16632"
           y="16.660873"
           style="fill:#ac7c5b;fill-opacity:1" /></flowRegion><flowPara
         id="flowPara3002-2"
         style="font-style:normal;font-variant:normal;font-weight:normal;font-stretch:normal;font-size:72px;font-family:Risque;-inkscape-font-specification:Risque;fill:#ac7c5b;fill-opacity:1">Pipro </flowPara></flowRoot>    <flowRoot
       xml:space="preserve"
       id="flowRoot3012-7"
       style="font-style:normal;font-variant:normal;font-weight:normal;font-stretch:normal;font-size:40px;line-height:125%;font-family:Risque;-inkscape-font-specification:Risque;letter-spacing:0px;word-spacing:0px;display:inline;fill:#301b0b;fill-opacity:1;stroke:none"
       transform="translate(68.931464,-32.611288)"><flowRegion
         id="flowRegion3014-0"
         style="fill:#301b0b;fill-opacity:1"><rect
           id="rect3016-7"
           width="247.05627"
           height="82.352089"
           x="1140.4517"
           y="178.86954"
           style="font-style:normal;font-variant:normal;font-weight:normal;font-stretch:normal;font-family:Risque;-inkscape-font-specification:Risque;fill:#301b0b;fill-opacity:1" /></flowRegion><flowPara
         id="flowPara3018-4"
         style="font-size:72px;fill:#ac7c5b;fill-opacity:1">kaj</flowPara></flowRoot>    <flowRoot
       xml:space="preserve"
       id="flowRoot3020-2"
       style="font-style:normal;font-weight:normal;font-size:40px;line-height:125%;font-family:Sans;letter-spacing:0px;word-spacing:0px;display:inline;fill:#301b0b;fill-opacity:1;stroke:none"
       transform="matrix(2.5856793,0,0,2.7333209,-2211.0494,-160.93632)"><flowRegion
         id="flowRegion3022-2"
         style="fill:#301b0b;fill-opacity:1"><rect
           id="rect3024-2"
           width="158.68651"
           height="53.440353"
           x="1459.8779"
           y="118.9771"
           style="fill:#301b0b;fill-opacity:1" /></flowRegion><flowPara
         id="flowPara3026-5"
         style="font-style:normal;font-variant:normal;font-weight:normal;font-stretch:normal;font-size:38.49537659px;font-family:Risque;-inkscape-font-specification:Risque;fill:#ac7c5b;fill-opacity:1">Karoĉjo</flowPara></flowRoot>  </g>
</svg>
