<?xml version="1.0" encoding="UTF-8" standalone="no"?>
<!-- Created with Inkscape (http://www.inkscape.org/) -->

<svg
   xmlns:osb="http://www.openswatchbook.org/uri/2009/osb"
   xmlns:dc="http://purl.org/dc/elements/1.1/"
   xmlns:cc="http://creativecommons.org/ns#"
   xmlns:rdf="http://www.w3.org/1999/02/22-rdf-syntax-ns#"
   xmlns:svg="http://www.w3.org/2000/svg"
   xmlns="http://www.w3.org/2000/svg"
   xmlns:xlink="http://www.w3.org/1999/xlink"
   xmlns:sodipodi="http://sodipodi.sourceforge.net/DTD/sodipodi-0.dtd"
   xmlns:inkscape="http://www.inkscape.org/namespaces/inkscape"
   version="1.1"
   id="svg2"
   width="1285.12"
   height="1889.92"
   viewBox="0 0 1285.12 1889.92"
   sodipodi:docname="PCMINI_E09.svg"
   inkscape:version="0.92.1 r15371"
   inkscape:export-xdpi="300"
   inkscape:export-ydpi="300">
  <metadata
     id="metadata8">
    <rdf:RDF>
      <cc:Work
         rdf:about="">
        <dc:format>image/svg+xml</dc:format>
        <dc:type
           rdf:resource="http://purl.org/dc/dcmitype/StillImage" />
        <dc:title />
      </cc:Work>
    </rdf:RDF>
  </metadata>
  <defs
     id="defs6">
    <linearGradient
       id="linearGradient6748"
       osb:paint="solid">
      <stop
         style="stop-color:#e41a0a;stop-opacity:1;"
         offset="0"
         id="stop6746" />
    </linearGradient>
    <linearGradient
       inkscape:collect="always"
       id="linearGradient5284">
      <stop
         style="stop-color:#e41a0a;stop-opacity:1;"
         offset="0"
         id="stop5280" />
      <stop
         style="stop-color:#e41a0a;stop-opacity:0;"
         offset="1"
         id="stop5282" />
    </linearGradient>
    <filter
       style="color-interpolation-filters:sRGB"
       id="filter4375-4-1-1-15-1-3"
       inkscape:label="deevad outline effect">
      <feFlood
         id="feFlood4377-7-9-0-4-4-4"
         flood-opacity="1"
         flood-color="rgb(0,0,0)"
         result="flood" />
      <feComposite
         id="feComposite4379-3-8-8-6-0-7"
         in2="SourceGraphic"
         in="flood"
         operator="in"
         result="composite1" />
      <feMorphology
         id="feMorphology4393-1-0-49-8-2-7"
         operator="dilate"
         radius="0.59999999999999998"
         result="result3" />
      <feComposite
         id="feComposite4385-9-5-7-2-1-2"
         in2="result3"
         in="SourceGraphic"
         operator="over"
         result="composite2" />
    </filter>
    <filter
       style="color-interpolation-filters:sRGB"
       id="filter5265"
       inkscape:label="deevad outline effect">
      <feFlood
         id="feFlood5257"
         flood-opacity="1"
         flood-color="rgb(0,0,0)"
         result="flood" />
      <feComposite
         id="feComposite5259"
         in2="SourceGraphic"
         in="flood"
         operator="in"
         result="composite1" />
      <feMorphology
         id="feMorphology5261"
         operator="dilate"
         radius="0.59999999999999998"
         result="result3" />
      <feComposite
         id="feComposite5263"
         in2="result3"
         in="SourceGraphic"
         operator="over"
         result="composite2" />
    </filter>
    <filter
       style="color-interpolation-filters:sRGB"
       id="filter5275"
       inkscape:label="deevad outline effect">
      <feFlood
         id="feFlood5267"
         flood-opacity="1"
         flood-color="rgb(0,0,0)"
         result="flood" />
      <feComposite
         id="feComposite5269"
         in2="SourceGraphic"
         in="flood"
         operator="in"
         result="composite1" />
      <feMorphology
         id="feMorphology5271"
         operator="dilate"
         radius="0.59999999999999998"
         result="result3" />
      <feComposite
         id="feComposite5273"
         in2="result3"
         in="SourceGraphic"
         operator="over"
         result="composite2" />
    </filter>
    <filter
       style="color-interpolation-filters:sRGB"
       id="filter5285"
       inkscape:label="deevad outline effect">
      <feFlood
         id="feFlood5277"
         flood-opacity="1"
         flood-color="rgb(0,0,0)"
         result="flood" />
      <feComposite
         id="feComposite5279"
         in2="SourceGraphic"
         in="flood"
         operator="in"
         result="composite1" />
      <feMorphology
         id="feMorphology5281"
         operator="dilate"
         radius="0.59999999999999998"
         result="result3" />
      <feComposite
         id="feComposite5283"
         in2="result3"
         in="SourceGraphic"
         operator="over"
         result="composite2" />
    </filter>
    <filter
       style="color-interpolation-filters:sRGB"
       id="filter5295"
       inkscape:label="deevad outline effect">
      <feFlood
         id="feFlood5287"
         flood-opacity="1"
         flood-color="rgb(0,0,0)"
         result="flood" />
      <feComposite
         id="feComposite5289"
         in2="SourceGraphic"
         in="flood"
         operator="in"
         result="composite1" />
      <feMorphology
         id="feMorphology5291"
         operator="dilate"
         radius="0.59999999999999998"
         result="result3" />
      <feComposite
         id="feComposite5293"
         in2="result3"
         in="SourceGraphic"
         operator="over"
         result="composite2" />
    </filter>
    <filter
       style="color-interpolation-filters:sRGB"
       id="filter5305"
       inkscape:label="deevad outline effect">
      <feFlood
         id="feFlood5297"
         flood-opacity="1"
         flood-color="rgb(0,0,0)"
         result="flood" />
      <feComposite
         id="feComposite5299"
         in2="SourceGraphic"
         in="flood"
         operator="in"
         result="composite1" />
      <feMorphology
         id="feMorphology5301"
         operator="dilate"
         radius="0.59999999999999998"
         result="result3" />
      <feComposite
         id="feComposite5303"
         in2="result3"
         in="SourceGraphic"
         operator="over"
         result="composite2" />
    </filter>
    <filter
       style="color-interpolation-filters:sRGB"
       id="filter5315"
       inkscape:label="deevad outline effect">
      <feFlood
         id="feFlood5307"
         flood-opacity="1"
         flood-color="rgb(0,0,0)"
         result="flood" />
      <feComposite
         id="feComposite5309"
         in2="SourceGraphic"
         in="flood"
         operator="in"
         result="composite1" />
      <feMorphology
         id="feMorphology5311"
         operator="dilate"
         radius="0.59999999999999998"
         result="result3" />
      <feComposite
         id="feComposite5313"
         in2="result3"
         in="SourceGraphic"
         operator="over"
         result="composite2" />
    </filter>
    <filter
       style="color-interpolation-filters:sRGB"
       id="filter5325"
       inkscape:label="deevad outline effect">
      <feFlood
         id="feFlood5317"
         flood-opacity="1"
         flood-color="rgb(0,0,0)"
         result="flood" />
      <feComposite
         id="feComposite5319"
         in2="SourceGraphic"
         in="flood"
         operator="in"
         result="composite1" />
      <feMorphology
         id="feMorphology5321"
         operator="dilate"
         radius="0.59999999999999998"
         result="result3" />
      <feComposite
         id="feComposite5323"
         in2="result3"
         in="SourceGraphic"
         operator="over"
         result="composite2" />
    </filter>
    <linearGradient
       inkscape:collect="always"
       xlink:href="#linearGradient5284"
       id="linearGradient5286"
       x1="594.79938"
       y1="317.09082"
       x2="788.35405"
       y2="317.09082"
       gradientUnits="userSpaceOnUse" />
    <linearGradient
       inkscape:collect="always"
       xlink:href="#linearGradient6748"
       id="linearGradient6750"
       x1="594.29938"
       y1="317.09082"
       x2="788.85405"
       y2="317.09082"
       gradientUnits="userSpaceOnUse" />
    <filter
       style="color-interpolation-filters:sRGB"
       id="filter4375-4-1-1-1-9-5"
       inkscape:label="deevad outline effect">
      <feFlood
         id="feFlood4377-7-9-0-8-1-7"
         flood-opacity="1"
         flood-color="rgb(0,0,0)"
         result="flood" />
      <feComposite
         id="feComposite4379-3-8-8-2-77-4"
         in2="SourceGraphic"
         in="flood"
         operator="in"
         result="composite1" />
      <feMorphology
         id="feMorphology4393-1-0-49-8-9-3"
         operator="dilate"
         radius="1.3999999999999999"
         result="result3" />
      <feComposite
         id="feComposite4385-9-5-7-0-8-8"
         in2="result3"
         in="SourceGraphic"
         operator="over"
         result="composite2" />
    </filter>
    <filter
       inkscape:label="Lapping"
       inkscape:menu="Distort"
       inkscape:menu-tooltip="Something like a water noise"
       height="1.3"
       y="-0.15"
       width="1.3"
       x="-0.15"
       style="color-interpolation-filters:sRGB;"
       id="filter4600">
      <feTurbulence
         numOctaves="4"
         seed="0"
         type="fractalNoise"
         baseFrequency="0.0060000000000000001 0.0029999999999999966"
         result="result1"
         id="feTurbulence4594" />
      <feGaussianBlur
         stdDeviation="2"
         result="result2"
         id="feGaussianBlur4596" />
      <feDisplacementMap
         scale="50"
         yChannelSelector="B"
         xChannelSelector="R"
         in="SourceGraphic"
         in2="result2"
         id="feDisplacementMap4598" />
    </filter>
    <filter
       style="color-interpolation-filters:sRGB"
       id="filter4375-4-1-1-1-9-5-8"
       inkscape:label="deevad outline effect">
      <feFlood
         id="feFlood4377-7-9-0-8-1-7-7"
         flood-opacity="1"
         flood-color="rgb(0,0,0)"
         result="flood" />
      <feComposite
         id="feComposite4379-3-8-8-2-77-4-7"
         in2="SourceGraphic"
         in="flood"
         operator="in"
         result="composite1" />
      <feMorphology
         id="feMorphology4393-1-0-49-8-9-3-5"
         operator="dilate"
         radius="1.3999999999999999"
         result="result3" />
      <feComposite
         id="feComposite4385-9-5-7-0-8-8-4"
         in2="result3"
         in="SourceGraphic"
         operator="over"
         result="composite2" />
    </filter>
    <filter
       style="color-interpolation-filters:sRGB"
       id="filter4375-4-1-1-1-9"
       inkscape:label="deevad outline effect">
      <feFlood
         id="feFlood4377-7-9-0-8-1"
         flood-opacity="1"
         flood-color="rgb(0,0,0)"
         result="flood" />
      <feComposite
         id="feComposite4379-3-8-8-2-77"
         in2="SourceGraphic"
         in="flood"
         operator="in"
         result="composite1" />
      <feMorphology
         id="feMorphology4393-1-0-49-8-9"
         operator="dilate"
         radius="4"
         result="result3" />
      <feComposite
         id="feComposite4385-9-5-7-0-8"
         in2="result3"
         in="SourceGraphic"
         operator="over"
         result="composite2" />
    </filter>
  </defs>
  <sodipodi:namedview
     pagecolor="#ffffff"
     bordercolor="#666666"
     borderopacity="1"
     objecttolerance="10"
     gridtolerance="10"
     guidetolerance="10"
     inkscape:pageopacity="0"
     inkscape:pageshadow="2"
     inkscape:window-width="1920"
     inkscape:window-height="1057"
     id="namedview4"
     showgrid="false"
     inkscape:zoom="0.99898406"
     inkscape:cx="50.984254"
     inkscape:cy="350.59943"
     inkscape:window-x="-8"
     inkscape:window-y="-8"
     inkscape:window-maximized="1"
     inkscape:current-layer="svg2" />
  <g inkscape:label="text" id="layer2" inkscape:groupmode="layer"><image sodipodi:insensitive="true"
     width="1285.12"
     height="1889.92"
     preserveAspectRatio="none"
     xlink:href="../../img/09/gfx_Pepper-and-Carrot-MINI_by_Nicolas_Artance_E09.png"
     id="image10"
     x="0"
     y="0"
     sodipodi:absref="../../img/09/gfx_Pepper-and-Carrot-MINI_by_Nicolas_Artance_E09.png"
     inkscape:export-xdpi="300"
     inkscape:export-ydpi="300" />
  <flowRoot
     xml:space="preserve"
     id="flowRoot3682"
     style="font-style:normal;font-variant:normal;font-weight:normal;font-stretch:normal;font-size:40px;line-height:1.25;font-family:Lavi;-inkscape-font-specification:Lavi;letter-spacing:0px;word-spacing:0px;fill:#000000;fill-opacity:1;stroke:none"
     transform="matrix(1.262974,0,0,1.3279674,33.852137,32.854516)"
     inkscape:export-xdpi="300"
     inkscape:export-ydpi="300"><flowRegion
       id="flowRegion3684"
       style="font-style:normal;font-variant:normal;font-weight:normal;font-stretch:normal;font-family:Lavi;-inkscape-font-specification:Lavi"><rect
         id="rect3686"
         width="471.33078"
         height="53.650127"
         x="17.29627"
         y="-14.053221"
         style="font-style:normal;font-variant:normal;font-weight:normal;font-stretch:normal;font-family:Lavi;-inkscape-font-specification:Lavi" /></flowRegion><flowPara
       id="flowPara3688"
       style="font-style:normal;font-variant:normal;font-weight:normal;font-stretch:normal;font-family:Lavi;-inkscape-font-specification:Lavi">Pepper and Carrot MINI</flowPara></flowRoot>  <flowRoot
     xml:space="preserve"
     id="flowRoot3690"
     style="font-style:normal;font-variant:normal;font-weight:normal;font-stretch:normal;font-size:18.66666603px;line-height:1.25;font-family:Lavi;-inkscape-font-specification:Lavi;text-align:end;letter-spacing:0px;word-spacing:0px;text-anchor:end;fill:#000000;fill-opacity:1;stroke:none"
     transform="matrix(1.2996799,0,0,1.2991412,17.378495,14.057713)"><flowRegion
       id="flowRegion3692"
       style="font-style:normal;font-variant:normal;font-weight:normal;font-stretch:normal;font-size:18.66666603px;font-family:Lavi;-inkscape-font-specification:Lavi;text-align:end;text-anchor:end"><rect
         id="rect3694"
         width="378.35593"
         height="104.85864"
         x="562.12878"
         y="6.4861007"
         style="font-style:normal;font-variant:normal;font-weight:normal;font-stretch:normal;font-size:18.66666603px;font-family:Lavi;-inkscape-font-specification:Lavi;text-align:end;text-anchor:end" /></flowRegion><flowPara
       style="font-style:normal;font-variant:normal;font-weight:normal;font-stretch:normal;font-size:18.66666603px;font-family:Lavi;-inkscape-font-specification:Lavi"
       id="flowPara3704">By Nicolas Artance</flowPara><flowPara
       style="font-style:normal;font-variant:normal;font-weight:normal;font-stretch:normal;font-size:18.66666603px;font-family:Lavi;-inkscape-font-specification:Lavi"
       id="flowPara5234">based on the CC-BY webcomic </flowPara><flowPara
       style="font-style:normal;font-variant:normal;font-weight:normal;font-stretch:normal;font-size:18.66666603px;font-family:Lavi;-inkscape-font-specification:Lavi"
       id="flowPara5236">Pepper&amp;Carrot by David Revoy</flowPara></flowRoot>  <flowRoot
     xml:space="preserve"
     id="flowRoot3706"
     style="font-style:normal;font-variant:normal;font-weight:normal;font-stretch:normal;font-size:40px;line-height:1.25;font-family:Lavi;-inkscape-font-specification:Lavi;text-align:center;letter-spacing:0px;word-spacing:0px;text-anchor:middle;fill:#000000;fill-opacity:1;stroke:none"
     transform="matrix(1.9432924,0,0,2.1801183,78.836792,-105.27197)"><flowRegion
       id="flowRegion3708"
       style="font-style:normal;font-variant:normal;font-weight:normal;font-stretch:normal;font-family:Lavi;-inkscape-font-specification:Lavi;text-align:center;text-anchor:middle"><rect
         id="rect3710"
         width="281.06439"
         height="82.157288"
         x="153.50441"
         y="79.995255"
         style="font-style:normal;font-variant:normal;font-weight:normal;font-stretch:normal;font-family:Lavi;-inkscape-font-specification:Lavi;text-align:center;text-anchor:middle" /></flowRegion><flowPara
       id="flowPara3712"
       style="font-style:normal;font-variant:normal;font-weight:normal;font-stretch:normal;font-size:14.66666698px;font-family:Lavi;-inkscape-font-specification:Lavi;text-align:center;text-anchor:middle">#9 -  Another culture</flowPara></flowRoot>  <path
     style="fill:#75e59d;fill-opacity:1;stroke:none;stroke-width:0.66680056"
     d="m 337.94644,253.54944 c 29.82609,4.01119 41.29759,7.73582 35.9441,10.02799 12.2364,1.14603 16.8251,30.9435 5.35349,36.38726 -0.76479,0.57314 -6.11821,2.29216 -3.8239,2.57866 2.29431,0.28649 16.06021,-0.573 18.35451,0.57299 2.29432,1.14613 -20.64882,17.47741 -17.58979,18.05046 3.05918,0.57299 73.4181,-10.31454 83.36001,-7.73588 9.942,2.57861 4.58869,9.1684 7.6478,9.455 3.05891,0.2865 31.35559,-1.43258 35.1795,-1.14613 3.82371,0.28654 10.70651,8.88196 14.53042,9.16845 3.8239,0.28655 21.4137,-3.72464 24.47279,-3.43814 3.0591,0.28654 1.52941,7.44938 5.3533,7.73582 3.82391,0.28655 20.64881,-6.0167 22.9432,-5.73026 2.29421,0.28655 10.70681,14.61231 14.53061,15.47176 3.82389,0.85958 28.2965,-15.7582 30.5909,-16.04474 2.29421,-0.28656 16.82481,19.48298 19.88401,19.76947 3.05909,0.28655 18.35441,-13.46623 20.64882,-13.17968 2.29428,0.28649 16.82488,8.30901 19.88388,8.88196 3.05912,0.57299 22.94322,-17.76387 26.00222,-17.76387 3.05918,0 29.0613,7.73588 31.35569,9.1684 2.29432,1.43258 4.58851,-7.44933 7.64762,-7.44933 3.05909,0 38.2385,5.15727 39.00339,4.87077 0.76471,-0.28654 -5.35349,-5.7303 -3.05919,-5.7303 2.2943,0 38.23851,7.16288 39.7682,5.7303 1.5294,-1.43257 78.00653,7.16284 83.35992,6.01681 5.3534,-1.14614 -34.4147,-23.49418 -30.59098,-25.21325 3.82389,-1.71912 17.58998,0.28649 18.35466,-0.57304 0.76473,-0.85954 -8.41248,-4.58423 -6.11838,-5.73031 2.29449,-1.14603 28.2967,-5.73026 30.5909,-7.16278 2.2944,-1.43258 -11.47149,-5.15736 -8.41249,-6.0169 3.05918,-0.85954 48.18077,-6.3033 48.94549,-7.73588 0.7647,-1.43257 -22.94308,-8.30882 -19.88409,-10.31444 3.0591,-2.00561 11.47161,-2.86515 10.70679,-4.29772 -0.76479,-1.43258 -15.2955,-3.1517 -14.53069,-4.58427 0.76491,-1.43258 8.41249,-8.59542 10.70679,-9.74145 2.29432,-1.14608 -16.06019,-0.57304 -16.06019,-1.71912 0,-1.14603 67.29991,-31.80309 65.7702,-40.3985 -23.7078,5.44376 -104.77351,15.18525 -130.01082,12.89318 -25.2376,-2.2922 -15.29541,-16.61782 -19.11922,-17.47741 -3.82388,-0.85953 -32.12047,4.87077 -35.94438,2.86516 -3.8238,-2.00557 -5.35331,-5.73026 -8.41251,-5.73026 -3.05889,0 -20.64879,8.02232 -24.4725,7.73587 -3.82391,-0.28654 -39.76812,-12.89309 -45.12162,-13.17968 -5.35328,-0.28645 -26.0021,4.87077 -30.59078,5.15726 -4.58862,0.28655 -8.41242,-6.87629 -12.23633,-6.30325 -3.82389,0.57295 -28.2965,5.73026 -32.1202,5.15722 -3.8239,-0.57304 -6.883,-2.86511 -9.9422,-2.29207 -3.05891,0.57295 -16.82491,2.86511 -16.82491,2.86511 0,0 -9.942,-1.71912 -14.53059,-1.71912 -4.5886,0 -35.94413,9.45499 -39.76802,10.02799 -3.82391,0.57299 -36.709,-21.77505 -34.41471,-23.49417 2.2944,-1.71907 -34.41471,23.78071 -39.7681,24.64025 -5.35331,0.85949 -21.41359,-1.71908 -22.94301,-0.85954 -1.52958,0.85954 -6.1182,5.44372 -10.7069,5.73026 -4.58858,0.2865 -15.29539,1.43253 -15.29539,1.43253 l 1.52949,1.71912 c 0,0 -32.12031,-4.58423 -35.94421,-6.3033 -3.8238,-1.71907 2.2944,7.44933 4.58871,9.74149 -13.76582,-2.29216 -54.29871,-7.16288 -57.35762,-8.59545 -3.05921,-1.43258 5.35321,5.15726 9.94181,7.16288 -6.11812,-0.85959 -11.47161,-1.14608 -11.47161,-1.14608 l 17.5898,6.87634 -5.35348,0.57308 c 0,0 11.4716,3.15165 11.4716,4.58423 0,1.43253 -29.82592,3.15165 -29.82592,3.15165 0,0 12.2363,2.57856 9.1772,4.01114 -3.0592,1.43257 -10.7069,2.29211 -10.7069,2.29211 l -1.52941,3.72474 z"
     id="path5888"
     inkscape:connector-curvature="0" />
  <text
     xml:space="preserve"
     style="font-style:normal;font-variant:normal;font-weight:normal;font-stretch:normal;font-size:49.69113159px;line-height:1.25;font-family:Lavi;-inkscape-font-specification:'Lavi, Normal';font-variant-ligatures:normal;font-variant-caps:normal;font-variant-numeric:normal;font-feature-settings:normal;text-align:start;letter-spacing:0px;word-spacing:0px;writing-mode:lr-tb;text-anchor:start;fill:#ffffff;fill-opacity:1;stroke:#e41a0a;stroke-width:10.06245518;stroke-miterlimit:4;stroke-dasharray:none;stroke-opacity:1;paint-order:stroke fill markers"
     x="632.66815"
     y="317.65228"
     id="text5278"
     transform="matrix(1.0087725,-0.03610731,0.03543665,0.99003539,0,0)"><tspan
       sodipodi:role="line"
       id="tspan5276"
       x="632.66815"
       y="317.65228"
       style="text-align:center;text-anchor:middle;fill:#ffffff;fill-opacity:1;stroke:#e41a0a;stroke-width:10.06245518;stroke-miterlimit:4;stroke-dasharray:none;stroke-opacity:1;paint-order:stroke fill markers">MERRY CHRISTMAS!</tspan></text>
  <path
     style="color:#000000;display:inline;overflow:visible;visibility:visible;fill:#ffffff;fill-opacity:1;fill-rule:nonzero;stroke:none;stroke-width:0.57125574px;marker:none;enable-background:accumulate"
     d="m 858.33733,840.69542 c -43.55021,-2.95839 -107.42379,-12.5732 -119.76308,-30.69327 -12.3392,-18.12014 -9.43586,-40.6778 15.96847,-50.66236 25.40422,-9.98457 68.95444,-18.48989 106.69797,-15.16172 37.74352,3.32817 87.10043,15.5315 98.71382,32.54225 11.6134,17.01067 0.72583,53.25096 -47.90519,60.27705 -48.6311,7.02618 -53.71199,3.69805 -53.71199,3.69805 z"
     id="path3970"
     inkscape:connector-curvature="0" />
  <path
     style="color:#000000;display:inline;overflow:visible;visibility:visible;fill:#ffffff;fill-opacity:1;fill-rule:nonzero;stroke:none;stroke-width:0.48150155px;marker:none;enable-background:accumulate"
     d="m 884.75068,826.79028 c -0.87125,22.7637 -21.78061,56.0336 -43.99683,52.0937 26.57236,-12.6951 33.54214,-42.0251 31.7997,-49.0293 -1.74245,-7.0042 12.19713,-3.0644 12.19713,-3.0644 z"
     id="path3978"
     inkscape:connector-curvature="0" />
  <text
     xml:space="preserve"
     style="font-style:normal;font-variant:normal;font-weight:normal;font-stretch:normal;font-size:21.9878521px;line-height:1.25;font-family:Lavi;-inkscape-font-specification:'Lavi, Normal';font-variant-ligatures:normal;font-variant-caps:normal;font-variant-numeric:normal;font-feature-settings:normal;text-align:center;letter-spacing:0px;word-spacing:0px;writing-mode:lr-tb;text-anchor:middle;fill:#000000;fill-opacity:1;stroke:none;stroke-width:0.82454449"
     x="863.58459"
     y="769.75763"
     id="text6762"
     transform="scale(0.98372226,1.0165471)"><tspan
       sodipodi:role="line"
       id="tspan6760"
       x="863.58459"
       y="769.75763"
       style="stroke-width:0.82454449">By the way, what</tspan><tspan
       sodipodi:role="line"
       x="863.58459"
       y="797.24243"
       id="tspan6764"
       style="stroke-width:0.82454449">is &quot;Christmas&quot;?</tspan></text>
  <path
     style="color:#000000;display:inline;overflow:visible;visibility:visible;fill:#ffffff;fill-opacity:1;fill-rule:nonzero;stroke:none;stroke-width:0.66485924px;marker:none;enable-background:accumulate"
     d="m 547.64907,1314.6956 c 6.6174,-3.8498 35.21668,-15.1359 31.01009,-1.1465 45.94815,-16.1418 77.99856,-7.8275 110.83884,-0.9033 11.38111,-5.0002 15.87018,-13.35 44.73881,-9.8508 -1.9672,-5.6388 9.53167,-8.8518 33.04622,-9.9002 -28.73367,-4.826 -32.88342,-8.4901 24.39745,-9.2509 -42.3267,-2.5406 -81.66436,-5.3058 -26.82619,-15.1421 -15.51028,-1.1058 -56.77944,7.3338 -27.24635,-22.0659 -30.79823,8.3118 -61.62866,12.1854 -89.38409,-9.9813 -14.29486,7.4508 -33.00465,12.015 -60.37833,-0.5671 -10.0178,7.6106 -48.65183,6.2919 -62.11777,3.9459 24.86326,10.3729 21.64982,15.8545 -17.34133,14.722 58.31999,19.3909 6.33863,14.2415 -5.75194,17.7731 48.64966,8.1541 23.10403,13.8552 11.27514,20.2412 58.3924,3.2498 34.81001,13.25 33.73945,22.1259 z"
     id="path3549-3"
     inkscape:connector-curvature="0"
     sodipodi:nodetypes="ccccccccccccccc" />
  <text
     xml:space="preserve"
     style="font-style:normal;font-variant:normal;font-weight:normal;font-stretch:normal;font-size:26.66666603px;line-height:1.25;font-family:Lavi;-inkscape-font-specification:'Lavi, Normal';font-variant-ligatures:normal;font-variant-caps:normal;font-variant-numeric:normal;font-feature-settings:normal;text-align:center;letter-spacing:0px;word-spacing:0px;writing-mode:lr-tb;text-anchor:middle;fill:#000000;fill-opacity:1;stroke:none"
     x="631.9657"
     y="1287.3058"
     id="text6774"><tspan
       sodipodi:role="line"
       id="tspan6772"
       x="631.9657"
       y="1287.3058">OH MY GOD!</tspan></text>
  <path
     style="fill:#ffffff;stroke:none;stroke-width:0.43737727"
     d="m 642.78455,1357.0476 c -0.88298,-11.0703 14.9485,-38.7833 92.17375,-36.6989 77.22532,2.0845 101.3956,14.2614 103.65865,33.9387 3.57999,31.1288 -37.04819,39.4475 -95.38651,41.7532 -60.14049,2.377 -101.37927,-18.9909 -100.44589,-38.993 z"
     id="path3280-8"
     inkscape:connector-curvature="0"
     sodipodi:nodetypes="csssc" />
  <path
     style="color:#000000;display:inline;overflow:visible;visibility:visible;fill:#ffffff;fill-opacity:1;fill-rule:nonzero;stroke:none;stroke-width:0.40094656px;marker:none;enable-background:accumulate"
     d="m 740.30705,1423.54 c -15.49122,-15.326 -28.99476,-31.6236 -25.94443,-47.6394 4.3119,-22.6398 3.72906,-12.1056 3.72906,-12.1056 l -16.52985,14.7069 c -1.74826,-0.5581 -2.71991,19.9955 38.74522,45.0381 z"
     id="path3072-1"
     inkscape:connector-curvature="0"
     sodipodi:nodetypes="csccc" />
  <text
     xml:space="preserve"
     style="font-style:normal;font-variant:normal;font-weight:normal;font-stretch:normal;font-size:21.45273781px;line-height:1.25;font-family:Lavi;-inkscape-font-specification:'Lavi, Normal';font-variant-ligatures:normal;font-variant-caps:normal;font-variant-numeric:normal;font-feature-settings:normal;text-align:center;letter-spacing:0px;word-spacing:0px;writing-mode:lr-tb;text-anchor:middle;fill:#000000;fill-opacity:1;stroke:none;stroke-width:0.80447769"
     x="749.07745"
     y="1335.3096"
     id="text6786"
     transform="scale(0.98793271,1.0122147)"><tspan
       sodipodi:role="line"
       x="749.07745"
       y="1335.3096"
       id="tspan6788"
       style="stroke-width:0.80447769">But what is</tspan><tspan
       sodipodi:role="line"
       x="749.07745"
       y="1362.1255"
       style="stroke-width:0.80447769"
       id="tspan5244">&quot;God&quot;?</tspan></text>
  <path
     style="display:inline;fill:#ffffff;stroke:none;stroke-width:0.50125021"
     d="m 422.14667,1348.8551 12.73925,12.3141 -7.39702,5.9993 3.69848,3.473 -5.75319,3.4733 11.50644,2.526 c -7.42411,7.7127 -17.41977,14.2399 -27.94417,20.5234 l 15.61582,-1.8945 c -0.76559,4.4312 -4.21376,8.3472 -7.39696,12.3141 l 16.43773,-5.3676 c 0.42954,2.9947 -2.79377,4.8668 -5.34224,6.9463 l 11.91734,-1.8944 -1.64376,2.526 c 4.81752,-0.8599 9.39623,-1.5362 14.79397,-2.8418 l -6.98606,8.5251 14.38301,-5.3676 3.69848,3.4733 3.69854,-3.789 4.10943,12.9455 7.80791,-13.5771 5.16532,7.9842 4.28641,-7.3526 c 5.29448,3.6358 7.95916,7.7481 9.86262,11.9983 4.18947,-5.052 8.36067,-10.104 14.38301,-15.1559 2.58038,1.5038 6.22529,4.916 10.68454,9.7882 l 2.87662,-6.6306 c 7.76655,4.431 14.46875,9.1346 18.49245,14.5242 v -13.5771 l 10.27358,6.9465 3.28752,-10.7354 9.04077,7.5778 0.82191,-8.8407 11.91734,6.3148 -0.41095,-5.3677 11.9174,4.1047 c 0,0 -2.97106,-8.6732 -0.99695,-10.3743 1.97405,-1.7011 16.20181,2.4807 16.20181,2.4807 0,0 -4.69423,-6.3451 -3.28752,-7.5779 1.40671,-1.2328 15.61587,0.3158 15.61587,0.3158 l -11.9174,-10.4195 c 8.83539,-3.4206 17.6838,-6.8311 28.35513,-8.841 0,0 -13.30878,-6.6657 -13.67818,-8.2539 -0.36934,-1.5883 6.28117,-3.4286 6.28117,-3.4286 l -12.73832,-4.6456 14.38208,-5.774 -24.65659,0.6314 11.09549,-11.051 -18.49245,9.4723 7.80791,-20.5234 c -8.96943,8.7903 -21.0063,15.224 -33.69736,21.1548 l 4.52038,-7.262 -16.43772,8.525 -1.64382,-16.7345 -6.57511,12.9456 c -5.75244,-6.9616 -8.90341,-14.4943 -10.27358,-22.4179 -1.14819,7.1569 -5.35137,14.3138 -11.50638,21.4708 l -4.52039,-15.7874 -9.86262,12.3141 -5.3423,-9.4723 -9.04071,11.6826 -9.86269,-17.9975 -2.05471,17.0502 -5.7532,-6.9464 -3.28758,8.2093 -9.04071,-11.6825 2.05471,12.9455 c -9.22507,-6.1407 -15.45386,-9.9794 -23.01283,-14.8401 l 8.21887,16.7345 -12.73925,-7.8936 4.93134,11.6826 -10.68454,-4.4204 1.64376,7.2622 z"
     id="path3497"
     inkscape:connector-curvature="0"
     sodipodi:nodetypes="ccccccccccccccccccccccccccccccccccczczccczccccccccccccccccccccccccccccccc" />
  <text
     xml:space="preserve"
     style="font-style:normal;font-variant:normal;font-weight:normal;font-stretch:normal;font-size:26.66666603px;line-height:1.25;font-family:Lavi;-inkscape-font-specification:'Lavi, Normal';font-variant-ligatures:normal;font-variant-caps:normal;font-variant-numeric:normal;font-feature-settings:normal;text-align:center;letter-spacing:0px;word-spacing:0px;writing-mode:lr-tb;text-anchor:middle;fill:#000000;fill-opacity:1;stroke:none;stroke-width:1.70000005;stroke-miterlimit:4;stroke-dasharray:none;"
     x="517.9115"
     y="1388.4025"
     id="text6798"><tspan
       sodipodi:role="line"
       id="tspan6796"
       x="445.40372"
       y="1388.4025"
       style="font-size:32px;stroke:#000000;stroke-width:1.70000005;stroke-miterlimit:4;stroke-dasharray:none;stroke-opacity:1;text-anchor:middle;text-align:center;">AAAHHH!!!</tspan></text>
  <path
     style="color:#000000;display:inline;overflow:visible;visibility:visible;fill:#ffffff;fill-opacity:1;fill-rule:nonzero;stroke:none;stroke-width:0.36543998px;marker:none;enable-background:accumulate"
     d="m 539.5811,1286.4873 c -0.26212,7.4323 -1.6341,15.8988 -2.47515,17.2815 -0.84105,1.3826 -9.57873,3.8333 -9.90625,6.235 -0.32749,2.4017 3.00894,7.0802 2.46085,8.4894 -0.54808,1.4091 -6.67311,4.4206 -6.81791,6.3525 -0.14481,1.932 2.964,11.6146 2.44007,12.7018 -0.52394,1.0872 -3.32632,6.9928 -3.96755,13.5804 5.84945,-11.1408 8.40009,-11.7203 8.72758,-14.122 0.32752,-2.4017 -2.32641,-8.3151 -1.43709,-10.3417 0.8893,-2.0266 6.7214,-5.0646 6.91445,-7.6406 0.19308,-2.5759 -1.88527,-6.33 -1.88527,-6.33 2.20943,0.038 13.69419,-1.6778 16.71039,-14.3719 3.01623,-12.694 -10.76412,-11.8344 -10.76412,-11.8344 z"
     id="path5050"
     inkscape:connector-curvature="0" />
  <path
     style="color:#000000;display:inline;overflow:visible;visibility:visible;fill:#ffffff;fill-opacity:1;fill-rule:nonzero;stroke:none;stroke-width:0.25878242px;marker:none;enable-background:accumulate"
     d="m 630.26466,1437.9165 c -5.54842,-9.2449 -13.07396,-17.9553 -16.3252,-27.821 l -3.38328,8.6907 c -3.6836,-3.0422 -4.51848,-7.3646 -6.32068,-11.2522 l -3.30671,5.1083 c -8.57398,-7.2602 -11.84218,-15.862 -17.67484,-23.8154 l -4.79313,9.2498 c 7.1845,7.5203 15.94123,14.0717 21.35725,22.6817 l 3.92552,-4.7413 c 2.43655,2.7745 4.72652,5.6269 6.36178,8.8271 l 4.20481,-6.2811 z"
     id="path4032"
     inkscape:connector-curvature="0"
     sodipodi:nodetypes="cccccccccccc" />
  <text
     xml:space="preserve"
     style="font-style:normal;font-variant:normal;font-weight:normal;font-stretch:normal;line-height:0%;font-family:Lavi;-inkscape-font-specification:Lavi;letter-spacing:0px;word-spacing:0px;fill:#000000;fill-opacity:1;stroke:#000000;stroke-width:0.99236238;stroke-miterlimit:4;stroke-dasharray:none;stroke-opacity:1;filter:url(#filter4375-4-1-1-1-9-5)"
     x="787.65729"
     y="1584.5073"
     id="text4580-6"
     transform="matrix(0.43820777,-0.16527924,-0.10302101,0.4899055,237.94632,819.29784)"><tspan
       sodipodi:role="line"
       id="tspan4582-1"
       x="787.65729"
       y="1584.5073"
       style="font-size:70px;line-height:1.25;fill:#000000">??</tspan></text>
  <g
     id="g5381"
     transform="matrix(0.85668888,0,0,1.2990773,-793.86172,-2609.6391)"
     style="fill:#ffffff">
    <path
       inkscape:connector-curvature="0"
       id="path5263"
       d="m 1225.2771,3157.962 c -4.7051,-6.6655 -4.7051,-15.2915 -4.7051,-16.8598 0,-1.5684 0.3921,-7.4497 0.3921,-7.4497 l -3.1367,-1.1763 2.7446,-5.0971 -3.1367,0.3921 c 0,0 7.4497,-9.0181 9.018,-11.7627 1.5684,-2.7446 4.313,-9.018 4.313,-9.018 0,0 14.5073,-1.9605 17.644,-3.1368 3.1367,-1.1762 12.5468,-11.3705 12.5468,-11.3705 0,0 11.3706,5.4892 15.6836,6.2734 4.3129,0.7842 24.3095,1.9604 27.8383,0 3.5288,-1.9605 7.0576,-4.7051 7.0576,-4.7051 0,0 9.018,-0.7841 11.3705,-1.9604 2.3526,-1.1763 6.6655,-3.9209 6.6655,-3.9209 0,0 7.4497,0.7842 10.5864,0.3921 3.1367,-0.3921 17.644,0 19.2124,0 1.5683,0 12.5468,6.6655 12.5468,6.6655 l 7.0576,6.6655 c 0,0 5.8813,-0.3921 8.626,-1.1763 2.7446,-0.7841 5.0971,3.1367 5.0971,3.1367 0,0 10.5864,23.9175 12.1548,28.6225 1.5683,4.7051 2.3525,14.1152 2.3525,14.1152 0,0 -4.313,7.4497 -6.6655,10.5864 -2.3525,3.1367 -9.018,10.5864 -12.5468,13.331 -3.5288,2.7446 -7.8418,7.0576 -12.1548,4.313 -4.313,-2.7446 -8.6259,-2.3525 -10.1943,-0.3921 -1.5684,1.9604 -12.9389,15.6836 -16.8598,14.1152 -3.9209,-1.5684 -17.2519,-3.9209 -21.1728,-7.4497 -3.9209,-3.5288 -10.1943,4.7051 -12.9389,2.3525 -2.7446,-2.3525 -6.6655,-6.6655 -9.4102,-6.6655 -2.7446,0 -35.68,9.8023 -39.6009,8.2339 -3.9209,-1.5684 -24.7016,-14.5073 -27.0541,-16.0756 -2.3526,-1.5684 -8.2339,-10.9785 -8.2339,-10.9785 z"
       style="color:#000000;display:inline;overflow:visible;visibility:visible;fill:#ffffff;fill-opacity:1;fill-rule:nonzero;stroke:none;stroke-width:1px;marker:none;enable-background:accumulate" />
    <path
       inkscape:connector-curvature="0"
       id="path5271"
       d="m 1236.8125,3095.4062 a 2.20022,2.20022 0 0 0 -0.1563,0.031 l -9.875,1.375 a 2.20022,2.20022 0 0 0 -1.4374,0.8125 l -12.9688,16.3438 a 2.2133161,2.2133161 0 1 0 3.4688,2.75 l 12.375,-15.6876 9.0312,-1.25 a 2.20022,2.20022 0 0 0 -0.4375,-4.375 z"
       style="color:#000000;font-style:normal;font-variant:normal;font-weight:normal;font-stretch:normal;font-size:medium;line-height:normal;font-family:Sans;-inkscape-font-specification:Sans;text-indent:0;text-align:start;text-decoration:none;text-decoration-line:none;letter-spacing:normal;word-spacing:normal;text-transform:none;writing-mode:lr-tb;direction:ltr;baseline-shift:baseline;text-anchor:start;display:inline;overflow:visible;visibility:visible;fill:#ffffff;fill-opacity:1;fill-rule:nonzero;stroke:none;stroke-width:1px;marker:none;enable-background:accumulate" />
    <path
       inkscape:connector-curvature="0"
       id="path5273"
       d="m 1252.1562,3077.3125 a 2.20022,2.20022 0 0 0 -1.625,0.9063 l -7.8124,10.5312 -11.3438,-5.0625 a 2.20022,2.20022 0 0 0 -2.3125,0.3125 l -14.6563,12.2812 a 2.20022,2.20022 0 1 0 2.8126,3.375 l 13.5937,-11.4062 11.7187,5.25 a 2.20022,2.20022 0 0 0 2.6563,-0.7188 l 8.875,-11.9374 a 2.20022,2.20022 0 0 0 -1.9063,-3.5313 z"
       style="color:#000000;font-style:normal;font-variant:normal;font-weight:normal;font-stretch:normal;font-size:medium;line-height:normal;font-family:Sans;-inkscape-font-specification:Sans;text-indent:0;text-align:start;text-decoration:none;text-decoration-line:none;letter-spacing:normal;word-spacing:normal;text-transform:none;writing-mode:lr-tb;direction:ltr;baseline-shift:baseline;text-anchor:start;display:inline;overflow:visible;visibility:visible;fill:#ffffff;fill-opacity:1;fill-rule:nonzero;stroke:none;stroke-width:1px;marker:none;enable-background:accumulate" />
    <path
       inkscape:connector-curvature="0"
       id="path5275"
       d="m 1267.9375,3079.7188 a 2.20022,2.20022 0 0 0 -1,0.2812 l -10.2187,5.4375 a 2.20022,2.20022 0 1 0 2.0624,3.875 l 8.8126,-4.6563 6.3437,6.3438 a 2.20022,2.20022 0 0 0 1.2187,0.625 l 2.4063,0.3125 a 2.20022,2.20022 0 1 0 0.625,-4.3437 l -1.6875,-0.25 -6.9688,-6.9688 a 2.20022,2.20022 0 0 0 -1.5937,-0.6562 z"
       style="color:#000000;font-style:normal;font-variant:normal;font-weight:normal;font-stretch:normal;font-size:medium;line-height:normal;font-family:Sans;-inkscape-font-specification:Sans;text-indent:0;text-align:start;text-decoration:none;text-decoration-line:none;letter-spacing:normal;word-spacing:normal;text-transform:none;writing-mode:lr-tb;direction:ltr;baseline-shift:baseline;text-anchor:start;display:inline;overflow:visible;visibility:visible;fill:#ffffff;fill-opacity:1;fill-rule:nonzero;stroke:none;stroke-width:1px;marker:none;enable-background:accumulate" />
    <path
       inkscape:connector-curvature="0"
       id="path5277"
       d="m 1265.2812,3072.9062 a 2.20022,2.20022 0 0 0 -0.25,4.3438 l 14.375,3.8438 4.6876,9.3124 a 2.2010735,2.2010735 0 0 0 3.9374,-1.9687 l -5.125,-10.2187 a 2.20022,2.20022 0 0 0 -1.4062,-1.1563 L 1266.1562,3073 a 2.20022,2.20022 0 0 0 -0.875,-0.094 z"
       style="color:#000000;font-style:normal;font-variant:normal;font-weight:normal;font-stretch:normal;font-size:medium;line-height:normal;font-family:Sans;-inkscape-font-specification:Sans;text-indent:0;text-align:start;text-decoration:none;text-decoration-line:none;letter-spacing:normal;word-spacing:normal;text-transform:none;writing-mode:lr-tb;direction:ltr;baseline-shift:baseline;text-anchor:start;display:inline;overflow:visible;visibility:visible;fill:#ffffff;fill-opacity:1;fill-rule:nonzero;stroke:none;stroke-width:1px;marker:none;enable-background:accumulate" />
    <path
       inkscape:connector-curvature="0"
       id="path5279"
       d="m 1343.875,3078.6875 a 2.20022,2.20022 0 0 0 -0.7812,0.2187 l -4.4376,2.0626 a 2.20022,2.20022 0 1 0 1.8438,3.9687 l 4.4375,-2.0313 a 2.20022,2.20022 0 0 0 -1.0625,-4.2187 z"
       style="color:#000000;font-style:normal;font-variant:normal;font-weight:normal;font-stretch:normal;font-size:medium;line-height:normal;font-family:Sans;-inkscape-font-specification:Sans;text-indent:0;text-align:start;text-decoration:none;text-decoration-line:none;letter-spacing:normal;word-spacing:normal;text-transform:none;writing-mode:lr-tb;direction:ltr;baseline-shift:baseline;text-anchor:start;display:inline;overflow:visible;visibility:visible;fill:#ffffff;fill-opacity:1;fill-rule:nonzero;stroke:none;stroke-width:1px;marker:none;enable-background:accumulate" />
    <path
       inkscape:connector-curvature="0"
       id="path5281"
       d="m 1353.5625,3079.375 a 2.2031,2.2031 0 1 0 0,4.4062 h 16.5313 l 8.9374,7.9688 a 2.2020313,2.2020313 0 1 0 2.9376,-3.2812 l -9.5626,-8.5313 a 2.20022,2.20022 0 0 0 -1.4687,-0.5625 z"
       style="color:#000000;font-style:normal;font-variant:normal;font-weight:normal;font-stretch:normal;font-size:medium;line-height:normal;font-family:Sans;-inkscape-font-specification:Sans;text-indent:0;text-align:start;text-decoration:none;text-decoration-line:none;letter-spacing:normal;word-spacing:normal;text-transform:none;writing-mode:lr-tb;direction:ltr;baseline-shift:baseline;text-anchor:start;display:inline;overflow:visible;visibility:visible;fill:#ffffff;fill-opacity:1;fill-rule:nonzero;stroke:none;stroke-width:1px;marker:none;enable-background:accumulate" />
    <path
       inkscape:connector-curvature="0"
       id="path5283"
       d="m 1365,3069.8438 a 2.2036013,2.2036013 0 1 0 0.094,4.4062 l 10,0.3125 4.8124,5.125 a 2.20022,2.20022 0 1 0 3.2188,-3 l -5.4688,-5.8125 a 2.20022,2.20022 0 0 0 -1.5312,-0.6875 l -10.9062,-0.3437 a 2.20022,2.20022 0 0 0 -0.2188,0 z"
       style="color:#000000;font-style:normal;font-variant:normal;font-weight:normal;font-stretch:normal;font-size:medium;line-height:normal;font-family:Sans;-inkscape-font-specification:Sans;text-indent:0;text-align:start;text-decoration:none;text-decoration-line:none;letter-spacing:normal;word-spacing:normal;text-transform:none;writing-mode:lr-tb;direction:ltr;baseline-shift:baseline;text-anchor:start;display:inline;overflow:visible;visibility:visible;fill:#ffffff;fill-opacity:1;fill-rule:nonzero;stroke:none;stroke-width:1px;marker:none;enable-background:accumulate" />
    <path
       inkscape:connector-curvature="0"
       id="path5285"
       d="m 1397.4375,3095.0625 a 2.20022,2.20022 0 0 0 -0.25,4.375 l 15.5,2.5 2.125,12.0937 a 2.2066945,2.2066945 0 0 0 4.3437,-0.7812 l -2.4062,-13.625 a 2.20022,2.20022 0 0 0 -1.8125,-1.7812 l -17.0625,-2.75 a 2.20022,2.20022 0 0 0 -0.4375,-0.031 z"
       style="color:#000000;font-style:normal;font-variant:normal;font-weight:normal;font-stretch:normal;font-size:medium;line-height:normal;font-family:Sans;-inkscape-font-specification:Sans;text-indent:0;text-align:start;text-decoration:none;text-decoration-line:none;letter-spacing:normal;word-spacing:normal;text-transform:none;writing-mode:lr-tb;direction:ltr;baseline-shift:baseline;text-anchor:start;display:inline;overflow:visible;visibility:visible;fill:#ffffff;fill-opacity:1;fill-rule:nonzero;stroke:none;stroke-width:1px;marker:none;enable-background:accumulate" />
    <path
       inkscape:connector-curvature="0"
       id="path5287"
       d="m 1397.875,3101.1875 a 2.20022,2.20022 0 0 0 -1.0312,4.1563 l 3.5937,1.9062 5.875,22.9688 a 2.2094076,2.2094076 0 1 0 4.2813,-1.0938 l -6.1563,-23.875 a 2.20022,2.20022 0 0 0 -1.0937,-1.375 l -4.4063,-2.4062 a 2.20022,2.20022 0 0 0 -1.0625,-0.2813 z"
       style="color:#000000;font-style:normal;font-variant:normal;font-weight:normal;font-stretch:normal;font-size:medium;line-height:normal;font-family:Sans;-inkscape-font-specification:Sans;text-indent:0;text-align:start;text-decoration:none;text-decoration-line:none;letter-spacing:normal;word-spacing:normal;text-transform:none;writing-mode:lr-tb;direction:ltr;baseline-shift:baseline;text-anchor:start;display:inline;overflow:visible;visibility:visible;fill:#ffffff;fill-opacity:1;fill-rule:nonzero;stroke:none;stroke-width:1px;marker:none;enable-background:accumulate" />
    <path
       inkscape:connector-curvature="0"
       id="path5289"
       d="m 1412.125,3144.4688 a 2.20022,2.20022 0 0 0 -2.0312,1.625 l -2.9688,10.1874 -3.875,5.5313 a 2.20022,2.20022 0 1 0 3.5938,2.5313 l 4.0937,-5.7813 a 2.20022,2.20022 0 0 0 0.3125,-0.6563 l 3.0625,-10.5937 a 2.20022,2.20022 0 0 0 -2.1875,-2.8437 z"
       style="color:#000000;font-style:normal;font-variant:normal;font-weight:normal;font-stretch:normal;font-size:medium;line-height:normal;font-family:Sans;-inkscape-font-specification:Sans;text-indent:0;text-align:start;text-decoration:none;text-decoration-line:none;letter-spacing:normal;word-spacing:normal;text-transform:none;writing-mode:lr-tb;direction:ltr;baseline-shift:baseline;text-anchor:start;display:inline;overflow:visible;visibility:visible;fill:#ffffff;fill-opacity:1;fill-rule:nonzero;stroke:none;stroke-width:1px;marker:none;enable-background:accumulate" />
    <path
       inkscape:connector-curvature="0"
       id="path5291"
       d="m 1417.4062,3142.0938 a 2.20022,2.20022 0 0 0 -1.9374,2 l -1,9.5624 -3.2813,7.9063 a 2.20022,2.20022 0 1 0 4.0625,1.6875 l 3.4062,-8.1875 a 2.20022,2.20022 0 0 0 0.1563,-0.625 l 1.0313,-9.875 a 2.20022,2.20022 0 0 0 -2.4376,-2.4687 z"
       style="color:#000000;font-style:normal;font-variant:normal;font-weight:normal;font-stretch:normal;font-size:medium;line-height:normal;font-family:Sans;-inkscape-font-specification:Sans;text-indent:0;text-align:start;text-decoration:none;text-decoration-line:none;letter-spacing:normal;word-spacing:normal;text-transform:none;writing-mode:lr-tb;direction:ltr;baseline-shift:baseline;text-anchor:start;display:inline;overflow:visible;visibility:visible;fill:#ffffff;fill-opacity:1;fill-rule:nonzero;stroke:none;stroke-width:1px;marker:none;enable-background:accumulate" />
    <path
       inkscape:connector-curvature="0"
       id="path5293"
       d="m 1390.3125,3173.8125 a 2.20022,2.20022 0 0 0 -1,0.2813 l -7.125,3.875 -7.3437,0.6562 a 2.20022,2.20022 0 1 0 0.375,4.375 l 7.8437,-0.6875 a 2.20022,2.20022 0 0 0 0.875,-0.25 l 7.5,-4.0937 a 2.20022,2.20022 0 0 0 -1.125,-4.1563 z"
       style="color:#000000;font-style:normal;font-variant:normal;font-weight:normal;font-stretch:normal;font-size:medium;line-height:normal;font-family:Sans;-inkscape-font-specification:Sans;text-indent:0;text-align:start;text-decoration:none;text-decoration-line:none;letter-spacing:normal;word-spacing:normal;text-transform:none;writing-mode:lr-tb;direction:ltr;baseline-shift:baseline;text-anchor:start;display:inline;overflow:visible;visibility:visible;fill:#ffffff;fill-opacity:1;fill-rule:nonzero;stroke:none;stroke-width:1px;marker:none;enable-background:accumulate" />
    <path
       inkscape:connector-curvature="0"
       id="path5295"
       d="m 1360.875,3185.4062 a 2.20022,2.20022 0 0 0 -1.4688,0.75 l -6.7812,7.6876 -12.2812,-1.1876 -8.0626,-5.5 a 2.205845,2.205845 0 1 0 -2.4687,3.6563 l 8.5313,5.7813 a 2.20022,2.20022 0 0 0 1.0312,0.375 l 13.9688,1.375 a 2.20022,2.20022 0 0 0 1.875,-0.75 l 7.5,-8.5313 a 2.20022,2.20022 0 0 0 -1.8438,-3.6563 z"
       style="color:#000000;font-style:normal;font-variant:normal;font-weight:normal;font-stretch:normal;font-size:medium;line-height:normal;font-family:Sans;-inkscape-font-specification:Sans;text-indent:0;text-align:start;text-decoration:none;text-decoration-line:none;letter-spacing:normal;word-spacing:normal;text-transform:none;writing-mode:lr-tb;direction:ltr;baseline-shift:baseline;text-anchor:start;display:inline;overflow:visible;visibility:visible;fill:#ffffff;fill-opacity:1;fill-rule:nonzero;stroke:none;stroke-width:1px;marker:none;enable-background:accumulate" />
    <path
       inkscape:connector-curvature="0"
       id="path5297"
       d="m 1299.0938,3181.6562 a 2.20022,2.20022 0 0 0 -1.125,3.9376 l 11.9374,9.5312 a 2.20022,2.20022 0 0 0 1.5,0.5 l 5.4688,-0.3438 a 2.20022,2.20022 0 0 0 1.5312,-0.75 l 2.375,-2.7187 a 2.2033255,2.2033255 0 1 0 -3.3124,-2.9063 l -1.7813,2.0313 -3.6875,0.2187 -11.2812,-9 a 2.20022,2.20022 0 0 0 -1.625,-0.5 z"
       style="color:#000000;font-style:normal;font-variant:normal;font-weight:normal;font-stretch:normal;font-size:medium;line-height:normal;font-family:Sans;-inkscape-font-specification:Sans;text-indent:0;text-align:start;text-decoration:none;text-decoration-line:none;letter-spacing:normal;word-spacing:normal;text-transform:none;writing-mode:lr-tb;direction:ltr;baseline-shift:baseline;text-anchor:start;display:inline;overflow:visible;visibility:visible;fill:#ffffff;fill-opacity:1;fill-rule:nonzero;stroke:none;stroke-width:1px;marker:none;enable-background:accumulate" />
    <path
       inkscape:connector-curvature="0"
       id="path5299"
       d="m 1243.5,3178.25 a 2.20022,2.20022 0 0 0 -0.75,4.1562 l 16.375,8.5313 a 2.20022,2.20022 0 0 0 0.2812,0.125 l 8.875,3.0625 a 2.20022,2.20022 0 0 0 1.5,0 l 8.5938,-3.3438 0.094,-0.031 7.0624,-1.6562 a 2.20022,2.20022 0 1 0 -1,-4.2813 l -7.1874,1.6875 a 2.20022,2.20022 0 0 0 -0.25,0.094 l -8.125,3.125 -7.8126,-2.6876 -0.094,-0.062 -16.2813,-8.4688 a 2.20022,2.20022 0 0 0 -1.2812,-0.25 z"
       style="color:#000000;font-style:normal;font-variant:normal;font-weight:normal;font-stretch:normal;font-size:medium;line-height:normal;font-family:Sans;-inkscape-font-specification:Sans;text-indent:0;text-align:start;text-decoration:none;text-decoration-line:none;letter-spacing:normal;word-spacing:normal;text-transform:none;writing-mode:lr-tb;direction:ltr;baseline-shift:baseline;text-anchor:start;display:inline;overflow:visible;visibility:visible;fill:#ffffff;fill-opacity:1;fill-rule:nonzero;stroke:none;stroke-width:1px;marker:none;enable-background:accumulate" />
    <path
       inkscape:connector-curvature="0"
       id="path5301"
       d="m 1229.0625,3164.9375 a 2.20022,2.20022 0 0 0 -1.3125,3.9375 l 3.4062,2.75 a 2.201074,2.201074 0 1 0 2.75,-3.4375 l -3.4062,-2.75 a 2.20022,2.20022 0 0 0 -1.4375,-0.5 z"
       style="color:#000000;font-style:normal;font-variant:normal;font-weight:normal;font-stretch:normal;font-size:medium;line-height:normal;font-family:Sans;-inkscape-font-specification:Sans;text-indent:0;text-align:start;text-decoration:none;text-decoration-line:none;letter-spacing:normal;word-spacing:normal;text-transform:none;writing-mode:lr-tb;direction:ltr;baseline-shift:baseline;text-anchor:start;display:inline;overflow:visible;visibility:visible;fill:#ffffff;fill-opacity:1;fill-rule:nonzero;stroke:none;stroke-width:1px;marker:none;enable-background:accumulate" />
  </g>
  <text
     xml:space="preserve"
     style="font-style:normal;font-variant:normal;font-weight:normal;font-stretch:normal;font-size:18.66666603px;line-height:1.25;font-family:Lavi;-inkscape-font-specification:'Lavi, Normal';font-variant-ligatures:normal;font-variant-caps:normal;font-variant-numeric:normal;font-feature-settings:normal;text-align:center;letter-spacing:0px;word-spacing:0px;writing-mode:lr-tb;text-anchor:middle;fill:#000000;fill-opacity:1;stroke:none"
     x="-94.018875"
     y="1469.4611"
     id="text6892"><tspan
       sodipodi:role="line"
       x="-91.206375"
       y="1469.4611"
       style="font-size:16px"
       id="tspan5263">The big red man... </tspan><tspan
       sodipodi:role="line"
       x="-91.206375"
       y="1492.7944"
       style="font-size:16px"
       id="tspan5253">the flying </tspan><tspan
       sodipodi:role="line"
       x="-94.018875"
       y="1516.1277"
       style="font-size:16px"
       id="tspan4625">reindeers...</tspan></text>
  <path
     style="color:#000000;display:inline;overflow:visible;visibility:visible;fill:#ffffff;fill-opacity:1;fill-rule:nonzero;stroke:none;stroke-width:0.38914919px;marker:none;enable-background:accumulate"
     d="m 739.84457,1713.788 c 25.24998,-23.0009 156.64519,-25.0725 173.4025,-7.8003 16.75742,17.2722 30.60048,59.6169 7.2859,73.5462 -23.31467,13.9291 -166.84535,19.5008 -182.14558,-1.1144 -15.30022,-20.6153 -23.79285,-41.6307 1.45718,-64.6315 z"
     id="path4008-8"
     inkscape:connector-curvature="0"
     sodipodi:nodetypes="zsssz" />
  <text
     xml:space="preserve"
     style="font-style:normal;font-variant:normal;font-weight:normal;font-stretch:normal;font-size:21.34670067px;line-height:1.25;font-family:Lavi;-inkscape-font-specification:'Lavi, Normal';font-variant-ligatures:normal;font-variant-caps:normal;font-variant-numeric:normal;font-feature-settings:normal;text-align:center;letter-spacing:0px;word-spacing:0px;writing-mode:lr-tb;text-anchor:middle;fill:#000000;fill-opacity:1;stroke:none;stroke-width:0.80050129"
     x="830.91077"
     y="1714.3132"
     id="text4604"
     transform="scale(0.99449042,1.0055401)"><tspan
       sodipodi:role="line"
       x="830.91077"
       y="1714.3132"
       id="tspan4608"
       style="stroke-width:0.80050129">What are these</tspan><tspan
       sodipodi:role="line"
       x="830.91077"
       y="1740.9966"
       style="stroke-width:0.80050129"
       id="tspan5277">socks on the</tspan><tspan
       sodipodi:role="line"
       x="830.91077"
       y="1767.6799"
       style="stroke-width:0.80050129"
       id="tspan5279">fireplace?</tspan></text>
  <path
     style="color:#000000;display:inline;overflow:visible;visibility:visible;fill:#ffffff;fill-opacity:1;fill-rule:nonzero;stroke:none;stroke-width:0.31761461px;marker:none;enable-background:accumulate"
     d="m 834.22937,1700.4976 c -1.05039,-16.5928 5.96986,-38.818 32.6485,-46.7246 -23.61465,20.4505 -26.14752,31.2733 -23.5836,44.3783 2.56395,13.105 2.3217,19.5375 2.3217,19.5375 z"
     id="path4440"
     inkscape:connector-curvature="0"
     sodipodi:nodetypes="ccscc" />
  <text
     xml:space="preserve"
     style="font-style:normal;font-variant:normal;font-weight:normal;font-stretch:normal;line-height:0%;font-family:Lavi;-inkscape-font-specification:Lavi;letter-spacing:0px;word-spacing:0px;fill:#000000;fill-opacity:1;stroke:#000000;stroke-width:0.99236238;stroke-miterlimit:4;stroke-dasharray:none;stroke-opacity:1;filter:url(#filter4375-4-1-1-1-9-5-8)"
     x="787.65729"
     y="1584.5073"
     id="text4580-6-2"
     transform="matrix(0.2209787,-0.11846494,-0.033945,0.30027384,183.03349,1382.7307)"><tspan
       sodipodi:role="line"
       x="787.65729"
       y="1584.5073"
       style="font-size:70px;line-height:1.25;fill:#000000"
       id="tspan5328">Ho, ho, ho!</tspan></text>
  <use
     x="0"
     y="0"
     xlink:href="#text6892"
     id="use4612"
     transform="translate(426.41289,-19.019315)"
     width="100%"
     height="100%"
     style="filter:url(#filter4600)" />
  <text
     xml:space="preserve"
     style="font-style:normal;font-variant:normal;font-weight:normal;font-stretch:normal;font-size:42.01138306px;line-height:0%;font-family:Lavi;-inkscape-font-specification:Lavi;letter-spacing:0px;word-spacing:0px;fill:#000000;fill-opacity:1;stroke:#000000;stroke-width:0.99236238;stroke-miterlimit:4;stroke-dasharray:none;stroke-opacity:1;filter:url(#filter4375-4-1-1-1-9)"
     x="787.65729"
     y="1584.5073"
     id="text4580"
     transform="matrix(1.1521041,-0.02582225,-0.75061272,1.1498938,-110.60326,-407.53192)"><tspan
       sodipodi:role="line"
       x="787.65729"
       y="1584.5073"
       style="font-size:32.67551804px;line-height:1.25;fill:#ffffff"
       id="tspan4574">Edit this one</tspan><tspan
       sodipodi:role="line"
       x="787.65729"
       y="1625.3517"
       style="font-size:32.67551804px;line-height:1.25;fill:#ffffff"
       id="tspan5290">for the left  </tspan><tspan
       sodipodi:role="line"
       x="787.65729"
       y="1666.1962"
       style="font-size:32.67551804px;line-height:1.25;fill:#ffffff"
       id="tspan5292">speechbubble -&gt;</tspan></text>
</g></svg>
