<?xml version="1.0" encoding="UTF-8" standalone="no"?>
<!-- Created with Inkscape (http://www.inkscape.org/) -->

<svg
   version="1.1"
   id="svg2"
   width="992"
   height="3042"
   viewBox="0 0 991.99998 3042"
   sodipodi:docname="PCMINI_E21.svg"
   inkscape:version="1.3 (0e150ed6c4, 2023-07-21)"
   inkscape:export-xdpi="300"
   inkscape:export-ydpi="300"
   xmlns:inkscape="http://www.inkscape.org/namespaces/inkscape"
   xmlns:sodipodi="http://sodipodi.sourceforge.net/DTD/sodipodi-0.dtd"
   xmlns:xlink="http://www.w3.org/1999/xlink"
   xmlns="http://www.w3.org/2000/svg"
   xmlns:svg="http://www.w3.org/2000/svg"
   xmlns:rdf="http://www.w3.org/1999/02/22-rdf-syntax-ns#"
   xmlns:cc="http://creativecommons.org/ns#"
   xmlns:dc="http://purl.org/dc/elements/1.1/">
  <metadata
     id="metadata8">
    <rdf:RDF>
      <cc:Work
         rdf:about="">
        <dc:format>image/svg+xml</dc:format>
        <dc:type
           rdf:resource="http://purl.org/dc/dcmitype/StillImage" />
        <dc:title />
      </cc:Work>
    </rdf:RDF>
  </metadata>
  <defs
     id="defs6">
    <linearGradient
       id="linearGradient1964"
       inkscape:swatch="gradient">
      <stop
         style="stop-color:#3a830f;stop-opacity:1;"
         offset="0"
         id="stop1960" />
      <stop
         style="stop-color:#3a830f;stop-opacity:0;"
         offset="1"
         id="stop1962" />
    </linearGradient>
    <linearGradient
       id="linearGradient1224"
       inkscape:swatch="solid">
      <stop
         style="stop-color:#98caff;stop-opacity:1;"
         offset="0"
         id="stop1222" />
    </linearGradient>
    <linearGradient
       inkscape:collect="always"
       id="linearGradient1218">
      <stop
         style="stop-color:#ffffff;stop-opacity:1;"
         offset="0"
         id="stop1214" />
      <stop
         style="stop-color:#ffffff;stop-opacity:0;"
         offset="1"
         id="stop1216" />
    </linearGradient>
    <pattern
       y="0"
       x="0"
       height="6"
       width="6"
       patternUnits="userSpaceOnUse"
       id="EMFhbasepattern" />
    <filter
       style="color-interpolation-filters:sRGB"
       id="filter4375-4-1-1-1-9-5-8-8"
       inkscape:label="Drop Shadow">
      <feFlood
         id="feFlood4377-7-9-0-8-1-7-3-1"
         flood-opacity="1"
         flood-color="rgb(190,113,27)"
         result="flood" />
      <feComposite
         id="feComposite4379-3-8-8-2-77-4-1-0"
         in2="SourceGraphic"
         in="flood"
         operator="in"
         result="composite1"
         baseFrequency="0.053999999999999999 0.053999999999999999" />
      <feMorphology
         id="feMorphology4393-1-0-49-8-9-3-0-1"
         operator="dilate"
         radius="6.2000000000000002"
         result="result3" />
      <feComposite
         id="feComposite4385-9-5-7-0-8-8-7-5"
         in2="result3"
         in="SourceGraphic"
         operator="over"
         result="fbSourceGraphic" />
      <feColorMatrix
         result="fbSourceGraphicAlpha"
         in="fbSourceGraphic"
         values="0 0 0 -1 0 0 0 0 -1 0 0 0 0 -1 0 0 0 0 1 0"
         id="feColorMatrix4544-9" />
      <feTurbulence
         id="feTurbulence4546-3"
         type="fractalNoise"
         numOctaves="5"
         seed="174"
         baseFrequency="0.053999999999999999 0.054054054054054057"
         result="turbulence" />
      <feDisplacementMap
         id="feDisplacementMap4548-8"
         in2="turbulence"
         in="fbSourceGraphic"
         scale="6.6"
         yChannelSelector="G"
         xChannelSelector="R"
         result="fbSourceGraphic" />
      <feColorMatrix
         result="fbSourceGraphicAlpha"
         in="fbSourceGraphic"
         values="0 0 0 -1 0 0 0 0 -1 0 0 0 0 -1 0 0 0 0 1 0"
         id="feColorMatrix4670-7" />
      <feFlood
         id="feFlood4672-4"
         flood-opacity="1"
         flood-color="rgb(141,82,22)"
         result="flood"
         in="fbSourceGraphic" />
      <feComposite
         id="feComposite4674-8"
         in2="fbSourceGraphic"
         in="flood"
         operator="in"
         result="composite1" />
      <feGaussianBlur
         id="feGaussianBlur4676-3"
         in="composite1"
         stdDeviation="0"
         result="blur" />
      <feOffset
         id="feOffset4678-6"
         dx="6"
         dy="6"
         result="offset" />
      <feComposite
         id="feComposite4680-4"
         in2="offset"
         in="fbSourceGraphic"
         operator="over"
         result="composite2" />
    </filter>
    <filter
       style="color-interpolation-filters:sRGB"
       id="filter4375-4-1-1-1-9-5"
       inkscape:label="deevad outline effect">
      <feFlood
         id="feFlood4377-7-9-0-8-1-7"
         flood-opacity="1"
         flood-color="rgb(0,0,0)"
         result="flood" />
      <feComposite
         id="feComposite4379-3-8-8-2-77-4"
         in2="SourceGraphic"
         in="flood"
         operator="in"
         result="composite1" />
      <feMorphology
         id="feMorphology4393-1-0-49-8-9-3"
         operator="dilate"
         radius="1.3999999999999999"
         result="result3" />
      <feComposite
         id="feComposite4385-9-5-7-0-8-8"
         in2="result3"
         in="SourceGraphic"
         operator="over"
         result="composite2" />
    </filter>
    <filter
       style="color-interpolation-filters:sRGB"
       id="filter4375-4-1-1-1-9-5-8"
       inkscape:label="Drop Shadow">
      <feFlood
         id="feFlood4377-7-9-0-8-1-7-3"
         flood-opacity="1"
         flood-color="rgb(108,125,133)"
         result="flood" />
      <feComposite
         id="feComposite4379-3-8-8-2-77-4-1"
         in2="SourceGraphic"
         in="flood"
         operator="in"
         result="composite1" />
      <feMorphology
         id="feMorphology4393-1-0-49-8-9-3-0"
         operator="dilate"
         radius="6.2000000000000002"
         result="result3" />
      <feComposite
         id="feComposite4385-9-5-7-0-8-8-7"
         in2="result3"
         in="SourceGraphic"
         operator="over"
         result="fbSourceGraphic" />
      <feColorMatrix
         result="fbSourceGraphicAlpha"
         in="fbSourceGraphic"
         values="0 0 0 -1 0 0 0 0 -1 0 0 0 0 -1 0 0 0 0 1 0"
         id="feColorMatrix4544" />
      <feTurbulence
         id="feTurbulence4546"
         type="fractalNoise"
         numOctaves="3"
         seed="37"
         baseFrequency="0.129 0.0050000000000000001"
         result="turbulence" />
      <feDisplacementMap
         id="feDisplacementMap4548"
         in2="turbulence"
         in="fbSourceGraphic"
         scale="6.6"
         yChannelSelector="G"
         xChannelSelector="R"
         result="fbSourceGraphic" />
      <feColorMatrix
         result="fbSourceGraphicAlpha"
         in="fbSourceGraphic"
         values="0 0 0 -1 0 0 0 0 -1 0 0 0 0 -1 0 0 0 0 1 0"
         id="feColorMatrix4670" />
      <feFlood
         id="feFlood4672"
         flood-opacity="1"
         flood-color="rgb(17,52,65)"
         result="flood"
         in="fbSourceGraphic" />
      <feComposite
         id="feComposite4674"
         in2="fbSourceGraphic"
         in="flood"
         operator="in"
         result="composite1" />
      <feGaussianBlur
         id="feGaussianBlur4676"
         in="composite1"
         stdDeviation="0"
         result="blur" />
      <feOffset
         id="feOffset4678"
         dx="6"
         dy="6"
         result="offset" />
      <feComposite
         id="feComposite4680"
         in2="offset"
         in="fbSourceGraphic"
         operator="over"
         result="composite2" />
    </filter>
    <filter
       style="color-interpolation-filters:sRGB"
       id="filter4375-4-1-1-1-9-5-2"
       inkscape:label="deevad outline effect">
      <feFlood
         id="feFlood4377-7-9-0-8-1-7-0"
         flood-opacity="1"
         flood-color="rgb(0,0,0)"
         result="flood" />
      <feComposite
         id="feComposite4379-3-8-8-2-77-4-3"
         in2="SourceGraphic"
         in="flood"
         operator="in"
         result="composite1" />
      <feMorphology
         id="feMorphology4393-1-0-49-8-9-3-7"
         operator="dilate"
         radius="1.3999999999999999"
         result="result3" />
      <feComposite
         id="feComposite4385-9-5-7-0-8-8-2"
         in2="result3"
         in="SourceGraphic"
         operator="over"
         result="composite2" />
    </filter>
    <filter
       style="color-interpolation-filters:sRGB"
       id="filter4375-4-1-1-1-9-5-2-0"
       inkscape:label="deevad outline effect">
      <feFlood
         id="feFlood4377-7-9-0-8-1-7-0-2"
         flood-opacity="1"
         flood-color="rgb(0,0,0)"
         result="flood" />
      <feComposite
         id="feComposite4379-3-8-8-2-77-4-3-1"
         in2="SourceGraphic"
         in="flood"
         operator="in"
         result="composite1" />
      <feMorphology
         id="feMorphology4393-1-0-49-8-9-3-7-0"
         operator="dilate"
         radius="1.3999999999999999"
         result="result3" />
      <feComposite
         id="feComposite4385-9-5-7-0-8-8-2-2"
         in2="result3"
         in="SourceGraphic"
         operator="over"
         result="composite2" />
    </filter>
    <filter
       style="color-interpolation-filters:sRGB"
       id="filter4375-4-1-1-1-9-5-2-0-0"
       inkscape:label="deevad outline effect">
      <feFlood
         id="feFlood4377-7-9-0-8-1-7-0-2-5"
         flood-opacity="1"
         flood-color="rgb(0,0,0)"
         result="flood" />
      <feComposite
         id="feComposite4379-3-8-8-2-77-4-3-1-5"
         in2="SourceGraphic"
         in="flood"
         operator="in"
         result="composite1" />
      <feMorphology
         id="feMorphology4393-1-0-49-8-9-3-7-0-5"
         operator="dilate"
         radius="1.3999999999999999"
         result="result3" />
      <feComposite
         id="feComposite4385-9-5-7-0-8-8-2-2-4"
         in2="result3"
         in="SourceGraphic"
         operator="over"
         result="composite2" />
    </filter>
    <filter
       style="color-interpolation-filters:sRGB"
       id="filter4375-4-1-1-1-9-5-2-03"
       inkscape:label="deevad outline effect"
       x="-0.036330608"
       y="-0.034608134"
       width="1.0726612"
       height="1.0692163">
      <feFlood
         id="feFlood4377-7-9-0-8-1-7-0-8"
         flood-opacity="1"
         flood-color="rgb(0,0,0)"
         result="flood" />
      <feComposite
         id="feComposite4379-3-8-8-2-77-4-3-9"
         in2="SourceGraphic"
         in="flood"
         operator="in"
         result="composite1" />
      <feMorphology
         id="feMorphology4393-1-0-49-8-9-3-7-3"
         operator="dilate"
         radius="1.3999999999999999"
         result="result3" />
      <feComposite
         id="feComposite4385-9-5-7-0-8-8-2-20"
         in2="result3"
         in="SourceGraphic"
         operator="over"
         result="composite2" />
    </filter>
    <filter
       style="color-interpolation-filters:sRGB"
       id="filter4375-4-1-1-1-9-5-2-03-2"
       inkscape:label="deevad outline effect">
      <feFlood
         id="feFlood4377-7-9-0-8-1-7-0-8-0"
         flood-opacity="1"
         flood-color="rgb(0,0,0)"
         result="flood" />
      <feComposite
         id="feComposite4379-3-8-8-2-77-4-3-9-3"
         in2="SourceGraphic"
         in="flood"
         operator="in"
         result="composite1" />
      <feMorphology
         id="feMorphology4393-1-0-49-8-9-3-7-3-9"
         operator="dilate"
         radius="1.3999999999999999"
         result="result3" />
      <feComposite
         id="feComposite4385-9-5-7-0-8-8-2-20-6"
         in2="result3"
         in="SourceGraphic"
         operator="over"
         result="composite2" />
    </filter>
    <linearGradient
       inkscape:collect="always"
       xlink:href="#linearGradient1218"
       id="linearGradient1220"
       x1="753.18929"
       y1="1549.6741"
       x2="1195.7326"
       y2="1549.6741"
       gradientUnits="userSpaceOnUse" />
    <linearGradient
       inkscape:collect="always"
       xlink:href="#linearGradient1224"
       id="linearGradient1968"
       x1="789.57104"
       y1="1549.6741"
       x2="1159.3508"
       y2="1549.6741"
       gradientUnits="userSpaceOnUse" />
    <filter
       style="color-interpolation-filters:sRGB"
       id="filter4375-4-1-1-1-9-5-8-8-5"
       inkscape:label="soundFX1">
      <feFlood
         id="feFlood4377-7-9-0-8-1-7-3-1-2"
         flood-opacity="1"
         flood-color="rgb(43,143,96)"
         result="flood" />
      <feComposite
         id="feComposite4379-3-8-8-2-77-4-1-0-6"
         in2="SourceGraphic"
         in="flood"
         operator="in"
         result="composite1"
         baseFrequency="0.053999999999999999 0.053999999999999999" />
      <feMorphology
         id="feMorphology4393-1-0-49-8-9-3-0-1-9"
         operator="dilate"
         radius="6.2000000000000002"
         result="result3" />
      <feComposite
         id="feComposite4385-9-5-7-0-8-8-7-5-4"
         in2="result3"
         in="SourceGraphic"
         operator="over"
         result="fbSourceGraphic" />
      <feColorMatrix
         result="fbSourceGraphicAlpha"
         in="fbSourceGraphic"
         values="0 0 0 -1 0 0 0 0 -1 0 0 0 0 -1 0 0 0 0 1 0"
         id="feColorMatrix4544-9-4" />
      <feTurbulence
         id="feTurbulence4546-3-6"
         type="fractalNoise"
         numOctaves="5"
         seed="174"
         baseFrequency="0.053999999999999999 0.054054054054054057"
         result="turbulence" />
      <feDisplacementMap
         id="feDisplacementMap4548-8-0"
         in2="turbulence"
         in="fbSourceGraphic"
         scale="6.6"
         yChannelSelector="G"
         xChannelSelector="R"
         result="fbSourceGraphic" />
      <feColorMatrix
         result="fbSourceGraphicAlpha"
         in="fbSourceGraphic"
         values="0 0 0 -1 0 0 0 0 -1 0 0 0 0 -1 0 0 0 0 1 0"
         id="feColorMatrix4670-7-7" />
      <feFlood
         id="feFlood4672-4-4"
         flood-opacity="1"
         flood-color="rgb(39,84,60)"
         result="flood"
         in="fbSourceGraphic" />
      <feComposite
         id="feComposite4674-8-3"
         in2="fbSourceGraphic"
         in="flood"
         operator="in"
         result="composite1" />
      <feGaussianBlur
         id="feGaussianBlur4676-3-7"
         in="composite1"
         stdDeviation="0"
         result="blur" />
      <feOffset
         id="feOffset4678-6-9"
         dx="6"
         dy="6"
         result="offset" />
      <feComposite
         id="feComposite4680-4-0"
         in2="offset"
         in="fbSourceGraphic"
         operator="over"
         result="composite2" />
    </filter>
    <filter
       style="color-interpolation-filters:sRGB"
       id="filter4375-4-1-1-1-9"
       inkscape:label="deevad outline effect">
      <feFlood
         id="feFlood4377-7-9-0-8-1"
         flood-opacity="1"
         flood-color="rgb(0,0,0)"
         result="flood" />
      <feComposite
         id="feComposite4379-3-8-8-2-77"
         in2="SourceGraphic"
         in="flood"
         operator="in"
         result="composite1" />
      <feMorphology
         id="feMorphology4393-1-0-49-8-9"
         operator="dilate"
         radius="4"
         result="result3" />
      <feComposite
         id="feComposite4385-9-5-7-0-8"
         in2="result3"
         in="SourceGraphic"
         operator="over"
         result="composite2" />
    </filter>
    <filter
       style="color-interpolation-filters:sRGB"
       id="filter4375-4-1-1-1-9-30-2-7-6"
       inkscape:label="Roughen">
      <feFlood
         id="feFlood4377-7-9-0-8-1-78-6-7-3"
         flood-opacity="1"
         flood-color="rgb(0,0,0)"
         result="flood" />
      <feComposite
         id="feComposite4379-3-8-8-2-77-68-1-1-9"
         in2="SourceGraphic"
         in="flood"
         operator="in"
         result="composite1" />
      <feMorphology
         id="feMorphology4393-1-0-49-8-9-8-0-1-4"
         operator="dilate"
         radius="4"
         result="result3" />
      <feComposite
         id="feComposite4385-9-5-7-0-8-4-6-5-8"
         in2="result3"
         in="SourceGraphic"
         operator="over"
         result="fbSourceGraphic" />
      <feColorMatrix
         result="fbSourceGraphicAlpha"
         in="fbSourceGraphic"
         values="0 0 0 -1 0 0 0 0 -1 0 0 0 0 -1 0 0 0 0 1 0"
         id="feColorMatrix333-3-1-9-1" />
      <feTurbulence
         id="feTurbulence335-1-5-7-2"
         type="fractalNoise"
         numOctaves="5"
         seed="1"
         baseFrequency="0.013 0.013"
         result="turbulence" />
      <feDisplacementMap
         in2="turbulence"
         id="feDisplacementMap337-4-9-7-9"
         in="fbSourceGraphic"
         scale="6.6"
         yChannelSelector="G"
         xChannelSelector="R"
         result="fbSourceGraphic" />
      <feColorMatrix
         result="fbSourceGraphicAlpha"
         in="fbSourceGraphic"
         values="0 0 0 -1 0 0 0 0 -1 0 0 0 0 -1 0 0 0 0 1 0"
         id="feColorMatrix435-92-4-6-3" />
      <feTurbulence
         id="feTurbulence437-06-9-7-9"
         type="fractalNoise"
         numOctaves="5"
         seed="27"
         baseFrequency="0.001 0.4414"
         result="turbulence" />
      <feDisplacementMap
         in2="turbulence"
         id="feDisplacementMap439-8-0-3-0"
         in="fbSourceGraphic"
         scale="4.27461"
         yChannelSelector="G"
         xChannelSelector="R" />
    </filter>
    <filter
       style="color-interpolation-filters:sRGB"
       id="filter4375-4-1-1-1-9-30-2"
       inkscape:label="Roughen">
      <feFlood
         id="feFlood4377-7-9-0-8-1-78-6"
         flood-opacity="1"
         flood-color="rgb(0,0,0)"
         result="flood" />
      <feComposite
         id="feComposite4379-3-8-8-2-77-68-1"
         in2="SourceGraphic"
         in="flood"
         operator="in"
         result="composite1" />
      <feMorphology
         id="feMorphology4393-1-0-49-8-9-8-0"
         operator="dilate"
         radius="4"
         result="result3" />
      <feComposite
         id="feComposite4385-9-5-7-0-8-4-6"
         in2="result3"
         in="SourceGraphic"
         operator="over"
         result="fbSourceGraphic" />
      <feColorMatrix
         result="fbSourceGraphicAlpha"
         in="fbSourceGraphic"
         values="0 0 0 -1 0 0 0 0 -1 0 0 0 0 -1 0 0 0 0 1 0"
         id="feColorMatrix333-3-1" />
      <feTurbulence
         id="feTurbulence335-1-5"
         type="fractalNoise"
         numOctaves="5"
         seed="1"
         baseFrequency="0.013 0.013"
         result="turbulence" />
      <feDisplacementMap
         in2="turbulence"
         id="feDisplacementMap337-4-9"
         in="fbSourceGraphic"
         scale="6.6"
         yChannelSelector="G"
         xChannelSelector="R"
         result="fbSourceGraphic" />
      <feColorMatrix
         result="fbSourceGraphicAlpha"
         in="fbSourceGraphic"
         values="0 0 0 -1 0 0 0 0 -1 0 0 0 0 -1 0 0 0 0 1 0"
         id="feColorMatrix435-92-4" />
      <feTurbulence
         id="feTurbulence437-06-9"
         type="fractalNoise"
         numOctaves="5"
         seed="27"
         baseFrequency="0.001 0.4414"
         result="turbulence" />
      <feDisplacementMap
         in2="turbulence"
         id="feDisplacementMap439-8-0"
         in="fbSourceGraphic"
         scale="4.27461"
         yChannelSelector="G"
         xChannelSelector="R" />
    </filter>
    <filter
       style="color-interpolation-filters:sRGB"
       id="filter4375-4-1-1-1-9-30-2-7"
       inkscape:label="Roughen">
      <feFlood
         id="feFlood4377-7-9-0-8-1-78-6-7"
         flood-opacity="1"
         flood-color="rgb(0,0,0)"
         result="flood" />
      <feComposite
         id="feComposite4379-3-8-8-2-77-68-1-1"
         in2="SourceGraphic"
         in="flood"
         operator="in"
         result="composite1" />
      <feMorphology
         id="feMorphology4393-1-0-49-8-9-8-0-1"
         operator="dilate"
         radius="4"
         result="result3" />
      <feComposite
         id="feComposite4385-9-5-7-0-8-4-6-5"
         in2="result3"
         in="SourceGraphic"
         operator="over"
         result="fbSourceGraphic" />
      <feColorMatrix
         result="fbSourceGraphicAlpha"
         in="fbSourceGraphic"
         values="0 0 0 -1 0 0 0 0 -1 0 0 0 0 -1 0 0 0 0 1 0"
         id="feColorMatrix333-3-1-9" />
      <feTurbulence
         id="feTurbulence335-1-5-7"
         type="fractalNoise"
         numOctaves="5"
         seed="1"
         baseFrequency="0.013 0.013"
         result="turbulence" />
      <feDisplacementMap
         in2="turbulence"
         id="feDisplacementMap337-4-9-7"
         in="fbSourceGraphic"
         scale="6.6"
         yChannelSelector="G"
         xChannelSelector="R"
         result="fbSourceGraphic" />
      <feColorMatrix
         result="fbSourceGraphicAlpha"
         in="fbSourceGraphic"
         values="0 0 0 -1 0 0 0 0 -1 0 0 0 0 -1 0 0 0 0 1 0"
         id="feColorMatrix435-92-4-6" />
      <feTurbulence
         id="feTurbulence437-06-9-7"
         type="fractalNoise"
         numOctaves="5"
         seed="27"
         baseFrequency="0.001 0.4414"
         result="turbulence" />
      <feDisplacementMap
         in2="turbulence"
         id="feDisplacementMap439-8-0-3"
         in="fbSourceGraphic"
         scale="4.27461"
         yChannelSelector="G"
         xChannelSelector="R" />
    </filter>
    <filter
       style="color-interpolation-filters:sRGB"
       id="filter4375-4-1-1-1-9-3"
       inkscape:label="Roughen">
      <feFlood
         id="feFlood4377-7-9-0-8-1-6"
         flood-opacity="1"
         flood-color="rgb(0,0,0)"
         result="flood" />
      <feComposite
         id="feComposite4379-3-8-8-2-77-75"
         in2="SourceGraphic"
         in="flood"
         operator="in"
         result="composite1" />
      <feMorphology
         id="feMorphology4393-1-0-49-8-9-35"
         operator="dilate"
         radius="4"
         result="result3" />
      <feComposite
         id="feComposite4385-9-5-7-0-8-6"
         in2="result3"
         in="SourceGraphic"
         operator="over"
         result="fbSourceGraphic" />
      <feColorMatrix
         result="fbSourceGraphicAlpha"
         in="fbSourceGraphic"
         values="0 0 0 -1 0 0 0 0 -1 0 0 0 0 -1 0 0 0 0 1 0"
         id="feColorMatrix333" />
      <feTurbulence
         id="feTurbulence335"
         type="fractalNoise"
         numOctaves="5"
         seed="1"
         baseFrequency="0.013 0.013"
         result="turbulence" />
      <feDisplacementMap
         in2="turbulence"
         id="feDisplacementMap337"
         in="fbSourceGraphic"
         scale="6.6"
         yChannelSelector="G"
         xChannelSelector="R"
         result="fbSourceGraphic" />
      <feColorMatrix
         result="fbSourceGraphicAlpha"
         in="fbSourceGraphic"
         values="0 0 0 -1 0 0 0 0 -1 0 0 0 0 -1 0 0 0 0 1 0"
         id="feColorMatrix435" />
      <feTurbulence
         id="feTurbulence437"
         type="fractalNoise"
         numOctaves="5"
         seed="27"
         baseFrequency="0.001 0.4414"
         result="turbulence" />
      <feDisplacementMap
         in2="turbulence"
         id="feDisplacementMap439"
         in="fbSourceGraphic"
         scale="4.27461"
         yChannelSelector="G"
         xChannelSelector="R" />
    </filter>
    <filter
       style="color-interpolation-filters:sRGB"
       id="filter4375-4-1-1-1-9-30"
       inkscape:label="Roughen">
      <feFlood
         id="feFlood4377-7-9-0-8-1-78"
         flood-opacity="1"
         flood-color="rgb(0,0,0)"
         result="flood" />
      <feComposite
         id="feComposite4379-3-8-8-2-77-68"
         in2="SourceGraphic"
         in="flood"
         operator="in"
         result="composite1" />
      <feMorphology
         id="feMorphology4393-1-0-49-8-9-8"
         operator="dilate"
         radius="4"
         result="result3" />
      <feComposite
         id="feComposite4385-9-5-7-0-8-4"
         in2="result3"
         in="SourceGraphic"
         operator="over"
         result="fbSourceGraphic" />
      <feColorMatrix
         result="fbSourceGraphicAlpha"
         in="fbSourceGraphic"
         values="0 0 0 -1 0 0 0 0 -1 0 0 0 0 -1 0 0 0 0 1 0"
         id="feColorMatrix333-3" />
      <feTurbulence
         id="feTurbulence335-1"
         type="fractalNoise"
         numOctaves="5"
         seed="1"
         baseFrequency="0.013 0.013"
         result="turbulence" />
      <feDisplacementMap
         in2="turbulence"
         id="feDisplacementMap337-4"
         in="fbSourceGraphic"
         scale="6.6"
         yChannelSelector="G"
         xChannelSelector="R"
         result="fbSourceGraphic" />
      <feColorMatrix
         result="fbSourceGraphicAlpha"
         in="fbSourceGraphic"
         values="0 0 0 -1 0 0 0 0 -1 0 0 0 0 -1 0 0 0 0 1 0"
         id="feColorMatrix435-92" />
      <feTurbulence
         id="feTurbulence437-06"
         type="fractalNoise"
         numOctaves="5"
         seed="27"
         baseFrequency="0.001 0.4414"
         result="turbulence" />
      <feDisplacementMap
         in2="turbulence"
         id="feDisplacementMap439-8"
         in="fbSourceGraphic"
         scale="4.27461"
         yChannelSelector="G"
         xChannelSelector="R" />
    </filter>
    <filter
       style="color-interpolation-filters:sRGB"
       id="filter4375-4-1-1-1-9-5-2-03-9"
       inkscape:label="deevad outline effect">
      <feFlood
         id="feFlood4377-7-9-0-8-1-7-0-8-07"
         flood-opacity="1"
         flood-color="rgb(0,0,0)"
         result="flood" />
      <feComposite
         id="feComposite4379-3-8-8-2-77-4-3-9-5"
         in2="SourceGraphic"
         in="flood"
         operator="in"
         result="composite1" />
      <feMorphology
         id="feMorphology4393-1-0-49-8-9-3-7-3-5"
         operator="dilate"
         radius="1.3999999999999999"
         result="result3" />
      <feComposite
         id="feComposite4385-9-5-7-0-8-8-2-20-8"
         in2="result3"
         in="SourceGraphic"
         operator="over"
         result="composite2" />
    </filter>
    <filter
       style="color-interpolation-filters:sRGB"
       id="filter4375-4-1-1-1-9-5-2-03-7"
       inkscape:label="deevad outline effect"
       x="-0.015380327"
       y="-0.03452199"
       width="1.0307607"
       height="1.069044">
      <feFlood
         id="feFlood4377-7-9-0-8-1-7-0-8-9"
         flood-opacity="1"
         flood-color="rgb(0,0,0)"
         result="flood" />
      <feComposite
         id="feComposite4379-3-8-8-2-77-4-3-9-7"
         in2="SourceGraphic"
         in="flood"
         operator="in"
         result="composite1" />
      <feMorphology
         id="feMorphology4393-1-0-49-8-9-3-7-3-90"
         operator="dilate"
         radius="1.3999999999999999"
         result="result3" />
      <feComposite
         id="feComposite4385-9-5-7-0-8-8-2-20-4"
         in2="result3"
         in="SourceGraphic"
         operator="over"
         result="composite2" />
    </filter>
    <filter
       style="color-interpolation-filters:sRGB"
       id="filter4375-4-1-1-1-9-5-2-03-9-2"
       inkscape:label="deevad outline effect"
       x="-0.029508956"
       y="-0.034759924"
       width="1.0590179"
       height="1.0695198">
      <feFlood
         id="feFlood4377-7-9-0-8-1-7-0-8-07-7"
         flood-opacity="1"
         flood-color="rgb(0,0,0)"
         result="flood" />
      <feComposite
         id="feComposite4379-3-8-8-2-77-4-3-9-5-3"
         in2="SourceGraphic"
         in="flood"
         operator="in"
         result="composite1" />
      <feMorphology
         id="feMorphology4393-1-0-49-8-9-3-7-3-5-0"
         operator="dilate"
         radius="1.3999999999999999"
         result="result3" />
      <feComposite
         id="feComposite4385-9-5-7-0-8-8-2-20-8-3"
         in2="result3"
         in="SourceGraphic"
         operator="over"
         result="composite2" />
    </filter>
    <filter
       style="color-interpolation-filters:sRGB"
       id="filter4375-4-1-1-1-9-5-8-8-3"
       inkscape:label="Drop Shadow"
       x="-0.043247488"
       y="-0.12041249"
       width="1.1252462"
       height="1.3487186">
      <feFlood
         id="feFlood4377-7-9-0-8-1-7-3-1-8"
         flood-opacity="1"
         flood-color="rgb(190,113,27)"
         result="flood" />
      <feComposite
         id="feComposite4379-3-8-8-2-77-4-1-0-9"
         in2="SourceGraphic"
         in="flood"
         operator="in"
         result="composite1"
         baseFrequency="0.053999999999999999 0.053999999999999999" />
      <feMorphology
         id="feMorphology4393-1-0-49-8-9-3-0-1-2"
         operator="dilate"
         radius="6.2000000000000002"
         result="result3" />
      <feComposite
         id="feComposite4385-9-5-7-0-8-8-7-5-44"
         in2="result3"
         in="SourceGraphic"
         operator="over"
         result="fbSourceGraphic" />
      <feColorMatrix
         result="fbSourceGraphicAlpha"
         in="fbSourceGraphic"
         values="0 0 0 -1 0 0 0 0 -1 0 0 0 0 -1 0 0 0 0 1 0"
         id="feColorMatrix4544-9-1" />
      <feTurbulence
         id="feTurbulence4546-3-1"
         type="fractalNoise"
         numOctaves="5"
         seed="174"
         baseFrequency="0.053999999999999999 0.054054054054054057"
         result="turbulence" />
      <feDisplacementMap
         id="feDisplacementMap4548-8-5"
         in2="turbulence"
         in="fbSourceGraphic"
         scale="6.6"
         yChannelSelector="G"
         xChannelSelector="R"
         result="fbSourceGraphic" />
      <feColorMatrix
         result="fbSourceGraphicAlpha"
         in="fbSourceGraphic"
         values="0 0 0 -1 0 0 0 0 -1 0 0 0 0 -1 0 0 0 0 1 0"
         id="feColorMatrix4670-7-9" />
      <feFlood
         id="feFlood4672-4-8"
         flood-opacity="1"
         flood-color="rgb(141,82,22)"
         result="flood"
         in="fbSourceGraphic" />
      <feComposite
         id="feComposite4674-8-0"
         in2="fbSourceGraphic"
         in="flood"
         operator="in"
         result="composite1" />
      <feGaussianBlur
         id="feGaussianBlur4676-3-4"
         in="composite1"
         stdDeviation="0"
         result="blur" />
      <feOffset
         id="feOffset4678-6-5"
         dx="6"
         dy="6"
         result="offset" />
      <feComposite
         id="feComposite4680-4-4"
         in2="offset"
         in="fbSourceGraphic"
         operator="over"
         result="composite2" />
    </filter>
  </defs>
  <sodipodi:namedview
     pagecolor="#ffffff"
     bordercolor="#666666"
     borderopacity="1"
     objecttolerance="10"
     gridtolerance="10"
     guidetolerance="10"
     inkscape:pageopacity="0"
     inkscape:pageshadow="2"
     inkscape:window-width="1888"
     inkscape:window-height="1144"
     id="namedview4"
     showgrid="false"
     inkscape:zoom="0.99622846"
     inkscape:cx="418.07679"
     inkscape:cy="1173.9275"
     inkscape:window-x="32"
     inkscape:window-y="0"
     inkscape:window-maximized="1"
     inkscape:current-layer="layer2"
     fit-margin-top="0"
     fit-margin-left="0"
     fit-margin-right="0"
     fit-margin-bottom="0"
     inkscape:measure-start="0,0"
     inkscape:measure-end="0,0"
     inkscape:showpageshadow="2"
     inkscape:pagecheckerboard="0"
     inkscape:deskcolor="#d1d1d1" />
  <g
     inkscape:label="text"
     id="layer2"
     inkscape:groupmode="layer">
    <image
       sodipodi:insensitive="true"
       xlink:href="../../img/21/gfx_Pepper-and-Carrot-MINI_by_Nicolas_Artance_E21.png"
       height="3042"
       width="992"
       preserveAspectRatio="none"
       id="image10"
       x="0"
       y="0" />
    <flowRoot
       xml:space="preserve"
       id="flowRoot3682"
       style="font-style:normal;font-variant:normal;font-weight:normal;font-stretch:normal;font-size:40px;line-height:1.25;font-family:Lavi;-inkscape-font-specification:Lavi;letter-spacing:0px;word-spacing:0px;fill:#000000;fill-opacity:1;stroke:none"
       transform="matrix(1.1663727,0,0,1.2391611,0.7955986,35.976788)"
       inkscape:export-xdpi="300"
       inkscape:export-ydpi="300"><flowRegion
         id="flowRegion3684"
         style="font-style:normal;font-variant:normal;font-weight:normal;font-stretch:normal;font-family:Lavi;-inkscape-font-specification:Lavi"><rect
           id="rect3686"
           width="449.13834"
           height="55.157722"
           x="17.29627"
           y="-14.053221"
           style="font-style:normal;font-variant:normal;font-weight:normal;font-stretch:normal;font-family:Lavi;-inkscape-font-specification:Lavi" /></flowRegion><flowPara
         id="flowPara3688"
         style="font-style:normal;font-variant:normal;font-weight:normal;font-stretch:normal;font-family:Lavi;-inkscape-font-specification:Lavi">Pepper &amp; Carrot MINI</flowPara></flowRoot>
    <flowRoot
       xml:space="preserve"
       id="flowRoot3690"
       style="font-style:normal;font-variant:normal;font-weight:normal;font-stretch:normal;font-size:18.6667px;line-height:1.25;font-family:Lavi;-inkscape-font-specification:Lavi;text-align:end;letter-spacing:0px;word-spacing:0px;text-anchor:end;fill:#000000;fill-opacity:1;stroke:none"
       transform="matrix(1.2002711,0,0,1.2122625,-156.30426,8.423348)"><flowRegion
         id="flowRegion3692"
         style="font-style:normal;font-variant:normal;font-weight:normal;font-stretch:normal;font-size:18.6667px;font-family:Lavi;-inkscape-font-specification:Lavi;text-align:end;text-anchor:end"><rect
           id="rect3694"
           width="378.35593"
           height="104.85864"
           x="562.12878"
           y="6.4861007"
           style="font-style:normal;font-variant:normal;font-weight:normal;font-stretch:normal;font-size:18.66666603px;font-family:Lavi;-inkscape-font-specification:Lavi;text-align:end;text-anchor:end" /></flowRegion><flowPara
         id="flowPara3696"
         style="font-style:normal;font-variant:normal;font-weight:normal;font-stretch:normal;font-size:18.6667px;font-family:Lavi;-inkscape-font-specification:Lavi">Von Nicolas Artance</flowPara><flowPara
         style="font-style:normal;font-variant:normal;font-weight:normal;font-stretch:normal;font-size:18.6667px;font-family:Lavi;-inkscape-font-specification:Lavi"
         id="flowPara3700">Basierend auf dem CC-BY Webcomic</flowPara><flowPara
         style="font-style:normal;font-variant:normal;font-weight:normal;font-stretch:normal;font-size:18.6667px;font-family:Lavi;-inkscape-font-specification:Lavi"
         id="flowPara3704">Pepper&amp;Carrot von David Revoy</flowPara></flowRoot>
    <flowRoot
       xml:space="preserve"
       id="flowRoot3706"
       style="font-style:normal;font-variant:normal;font-weight:normal;font-stretch:normal;font-size:40px;line-height:1.25;font-family:Lavi;-inkscape-font-specification:Lavi;text-align:center;letter-spacing:0px;word-spacing:0px;text-anchor:middle;fill:#000000;fill-opacity:1;stroke:none"
       transform="matrix(1.7946554,0,0,2.0343253,-19.588571,-89.20121)"><flowRegion
         id="flowRegion3708"
         style="font-style:normal;font-variant:normal;font-weight:normal;font-stretch:normal;font-family:Lavi;-inkscape-font-specification:Lavi;text-align:center;text-anchor:middle"><rect
           id="rect3710"
           width="281.06439"
           height="82.157288"
           x="153.50441"
           y="79.995255"
           style="font-style:normal;font-variant:normal;font-weight:normal;font-stretch:normal;font-family:Lavi;-inkscape-font-specification:Lavi;text-align:center;text-anchor:middle" /></flowRegion><flowPara
         id="flowPara3712"
         style="font-style:normal;font-variant:normal;font-weight:normal;font-stretch:normal;font-size:14.6667px;font-family:Lavi;-inkscape-font-specification:Lavi;text-align:center;text-anchor:middle">#21 - Ah</flowPara></flowRoot>
    <path
       style="color:#000000;display:inline;overflow:visible;visibility:visible;fill:#ffffff;fill-opacity:1;fill-rule:nonzero;stroke:none;stroke-width:0.41981214px;marker:none;enable-background:accumulate"
       d="m 353.09138,225.93906 c 1.55188,-25.00773 17.84666,-35.90857 23.27825,-38.47348 5.43157,-2.56489 10.86313,-24.36653 99.32044,-28.85509 53.53994,-2.56489 78.37006,13.46566 83.80165,14.74815 5.43157,1.28242 47.1276,34.04774 37.45346,61.71395 -6.98349,19.97129 -15.23301,27.24815 -29.50482,30.9666 -16.42088,4.2785 -117.35629,5.42681 -139.85863,0.29701 -22.50231,-5.12975 -65.17906,2.56489 -74.49035,-40.39714 z"
       id="path4472"
       inkscape:connector-curvature="0"
       sodipodi:nodetypes="cscssssc" />
    <path
       style="color:#000000;display:inline;overflow:visible;visibility:visible;fill:#ffffff;fill-opacity:1;fill-rule:nonzero;stroke:none;stroke-width:0.26245689px;marker:none;enable-background:accumulate"
       d="m 441.94814,256.14458 c -2.19034,16.17802 -14.92928,30.96749 -19.6058,35.21909 14.78845,-8.8465 26.43119,-20.71459 27.41287,-31.69459 0.9817,-10.98003 -7.80707,-3.5245 -7.80707,-3.5245 z"
       id="path4480"
       inkscape:connector-curvature="0" />
    <text
       xml:space="preserve"
       style="font-style:normal;font-variant:normal;font-weight:normal;font-stretch:normal;font-size:21.3333px;line-height:1.25;font-family:Lavi;-inkscape-font-specification:Lavi;letter-spacing:0px;word-spacing:0px;fill:#000000;fill-opacity:1;stroke:none"
       x="477.66321"
       y="198.26833"
       id="text35"><tspan
         sodipodi:role="line"
         x="477.66321"
         y="198.26833"
         style="font-size:18.6667px;text-align:center;text-anchor:middle"
         id="tspan5">Jetzt können wir uns</tspan><tspan
         sodipodi:role="line"
         x="477.66321"
         y="224.93495"
         style="font-size:18.6667px;text-align:center;text-anchor:middle"
         id="tspan7">der vorletzten magischen</tspan><tspan
         sodipodi:role="line"
         x="477.66321"
         y="251.60158"
         style="font-size:18.6667px;text-align:center;text-anchor:middle"
         id="tspan6">Schule zuwenden.</tspan></text>
    <path
       style="fill:#ffffff;stroke:none;stroke-width:0.18950108"
       d="m 589.35807,222.06319 c -0.29191,-7.7366 6.13011,-16.93291 16.63883,-18.39265 10.50875,-1.45973 75.6045,-2.91946 81.15077,-1.89766 5.5463,1.02182 12.26021,2.91947 17.80649,5.69296 5.54627,2.77349 9.92492,7.44464 9.04917,11.23995 -0.87571,3.79531 -4.96246,11.53189 -8.75728,13.57552 -3.79481,2.04362 -14.01163,6.86075 -24.22846,7.73658 -10.21683,0.87585 -22.18511,1.60571 -26.85566,1.45974 -4.67055,-0.14598 -28.60711,-1.02181 -28.60711,-1.02181 0,0 -12.844,0.5839 -16.93074,-0.87584 -4.08672,-1.45974 -14.59546,-3.94129 -17.80645,-10.07216 -3.21101,-6.13087 -1.45956,-2.1896 -1.45956,-7.44463 z"
       id="path3971"
       inkscape:connector-curvature="0" />
    <text
       xml:space="preserve"
       style="font-style:normal;font-variant:normal;font-weight:normal;font-stretch:normal;font-size:13.3333px;line-height:1.25;font-family:Lavi;-inkscape-font-specification:Lavi;letter-spacing:0px;word-spacing:0px;fill:#000000;fill-opacity:1;stroke:none"
       x="649.51703"
       y="217.76515"
       id="text49"><tspan
         sodipodi:role="line"
         x="649.51703"
         y="217.76515"
         style="font-size:13.3333px;text-align:center;text-anchor:middle"
         id="tspan4815">Mach weiter,</tspan><tspan
         sodipodi:role="line"
         x="649.51703"
         y="234.43178"
         style="font-size:13.3333px;text-align:center;text-anchor:middle"
         id="tspan8">Carrot.</tspan></text>
    <path
       id="path58"
       d="m 616.65746,571.81312 c -5.50561,-1.43363 -14.15726,3.53628 -15.44721,3.18584 -1.32138,-0.35044 -9.97298,-1.43363 -11.79772,-3.18584 -1.85618,-1.78407 -7.07865,3.18584 -8.6517,1.75221 -1.57308,-1.40176 1.82474,6.02124 7.33031,6.75398 5.50568,0.70088 11.54614,1.75221 13.37079,3.88672 1.82476,2.13451 1.32138,6.40354 1.32138,6.40354 l -2.10786,1.40177 3.39772,2.83539 c 0,0 -0.50337,3.91859 -2.07634,3.53628 -1.57306,-0.35044 -13.37079,2.8354 -14.44048,3.56814 -1.03817,0.70089 -8.11691,7.42301 -9.68987,7.07257 -1.57307,-0.35045 -6.04047,-1.40177 -6.04047,-1.40177 0,0 4.21572,2.83539 6.04047,3.53628 1.82465,0.70088 14.94375,0.70088 16.51682,0.70088 h 10.47645 c 2.10786,0 5.78872,-3.88672 7.86512,-2.83539 2.10787,1.08318 8.40001,1.08318 8.40001,1.08318 z"
       style="fill:#d6c38d;fill-opacity:1;fill-rule:evenodd;stroke:none;stroke-width:0.39573929"
       inkscape:connector-curvature="0" />
    <path
       id="path60"
       d="m 607.78553,554.83615 9.12362,6.78583 1.35281,10.8 -0.69212,4.61946 -0.91238,2.77168 4.34157,1.9115 0.59775,7.23186 c 0,0 -0.15729,5.03362 0.31462,6.88141 0.44044,1.84778 -0.69215,5.54336 -0.47191,7.70973 0.25168,2.16637 0.69213,5.54336 0,6.78584 -0.66068,1.24247 -6.95281,-17.96814 -9.68989,-21.0584 -1.6045,-3.37699 -3.96407,-34.43891 -3.96407,-34.43891 z"
       style="fill:#6e674b;fill-opacity:1;fill-rule:evenodd;stroke:none;stroke-width:0.39573929"
       inkscape:connector-curvature="0" />
    <path
       id="path62"
       d="m 797.99682,555.09101 c -15.91911,-12.80707 -40.86743,-6.40354 -49.36181,-4.96991 -8.46291,1.43363 -43.51012,4.96991 -48.7955,3.56814 -5.31685,-1.43363 -21.7708,-3.56814 -27.62249,-3.56814 -5.82022,0 -28.62922,3.56814 -32.34157,2.13451 -3.74382,-1.43363 -27.62249,0.70089 -31.86967,2.8354 1.06969,12.10619 3.209,28.51325 3.74382,34.18405 7.95955,-1.40177 21.73934,0.73274 29.69888,2.86725 7.95954,2.13451 27.05619,-5.00177 36.08541,-5.00177 9.0292,0 50.93483,5.00177 62.10337,5.00177 11.13709,0 45.61799,-6.40353 54.64719,-6.40353 2.13933,-12.83893 3.71237,-30.64777 3.71237,-30.64777 z"
       style="fill:#b89f62;fill-opacity:1;fill-rule:evenodd;stroke:none;stroke-width:0.39573929"
       inkscape:connector-curvature="0" />
    <g
       id="g101"
       style="fill:#ececec"
       transform="translate(387.77401,52.478968)">
      <text
         id="text76"
         y="526.26331"
         x="319.22635"
         style="font-style:normal;font-variant:normal;font-weight:normal;font-stretch:normal;font-size:21.3333px;line-height:1.25;font-family:Lavi;-inkscape-font-specification:Lavi;text-align:center;letter-spacing:0px;word-spacing:0px;text-anchor:middle;fill:#ececec;fill-opacity:1;stroke:none"
         xml:space="preserve"><tspan
           style="font-style:normal;font-variant:normal;font-weight:bold;font-stretch:normal;font-size:24px;font-family:Lavi;-inkscape-font-specification:'Lavi, Bold';font-variant-ligatures:normal;font-variant-caps:normal;font-variant-numeric:normal;font-feature-settings:normal;text-align:center;writing-mode:lr-tb;text-anchor:middle;fill:#ececec"
           y="526.26331"
           x="319.22635"
           id="tspan74"
           sodipodi:role="line">AH.</tspan></text>
    </g>
    <path
       id="path58-7"
       d="m 830.93523,703.55697 c 7.99898,-3.83545 20.56876,9.46076 22.44291,8.52321 1.91982,-0.93755 14.48954,-3.83543 17.14064,-8.52321 2.69681,-4.77299 10.28443,8.52321 12.56989,4.68778 2.28549,-3.75021 -2.65114,16.10887 -10.65007,18.0692 -7.99906,1.87509 -16.77513,4.68777 -19.42612,10.39832 -2.65115,5.71054 -1.9198,17.13165 -1.9198,17.13165 l 3.06246,3.75022 -4.93646,7.58564 c 0,0 0.73132,10.48358 3.01667,9.46076 2.28545,-0.93753 19.42612,7.58569 20.98024,9.54601 1.50834,1.87511 11.7929,19.85909 14.07821,18.92156 2.28548,-0.93759 8.77606,-3.75023 8.77606,-3.75023 0,0 -6.12492,7.58565 -8.77606,9.46077 -2.651,1.8751 -21.71146,1.8751 -23.99693,1.8751 h -15.221 c -3.06246,0 -8.4103,-10.39832 -11.42707,-7.58564 -3.06248,2.89787 -12.20418,2.89787 -12.20418,2.89787 z"
       style="fill:#d6c38d;fill-opacity:1;fill-rule:evenodd;stroke:none;stroke-width:0.78021359"
       inkscape:connector-curvature="0" />
    <path
       id="path60-0"
       d="m 844.83067,658.89534 -13.25552,18.15444 -1.96547,28.89371 1.00557,12.35864 1.32558,7.41519 -6.30777,5.11391 -0.86845,19.34771 c 0,0 0.22851,13.46668 -0.45712,18.41013 -0.63991,4.94346 1.00561,14.83041 0.68563,20.62619 -0.36566,5.79578 -1.00558,14.83038 0,18.15445 0.95988,3.32404 10.10158,-48.07095 14.07824,-56.33845 2.33113,-9.03461 5.75931,-92.13592 5.75931,-92.13592 z"
       style="fill:#6e674b;fill-opacity:1;fill-rule:evenodd;stroke:none;stroke-width:0.78021359"
       inkscape:connector-curvature="0" />
    <path
       id="path62-2"
       d="m 549.51779,657.55424 c 24.75539,-34.66366 63.55184,-17.33184 76.76123,-13.45157 13.16042,3.88027 67.66142,13.45157 75.88058,9.65755 8.26808,-3.88027 33.85518,-9.65755 42.95498,-9.65755 9.05088,0 44.52053,9.65755 50.29351,5.77728 5.82192,-3.88028 42.95498,1.89702 49.55966,7.67429 -1.66344,32.76663 -4.99022,77.17402 -5.82191,92.52262 -12.37768,-3.79403 -33.80626,1.98324 -46.18392,7.76051 -12.37768,5.77728 -42.07436,-13.53781 -56.11547,-13.53781 -14.04106,0 -79.20736,13.53781 -96.57527,13.53781 -17.31899,0 -70.93932,-17.33181 -84.98038,-17.33181 -3.32681,-34.74987 -5.77301,-82.95132 -5.77301,-82.95132 z"
       style="fill:#b89f62;fill-opacity:1;fill-rule:evenodd;stroke:none;stroke-width:0.811889"
       inkscape:connector-curvature="0" />
    <text
       xml:space="preserve"
       style="font-style:italic;font-variant:normal;font-weight:normal;font-stretch:normal;font-size:21.3333px;line-height:1;font-family:Lavi;-inkscape-font-specification:'Lavi Italic';text-align:center;letter-spacing:0px;word-spacing:0px;text-anchor:middle;fill:#ececec;fill-opacity:1;stroke:none"
       x="696.92023"
       y="671.55786"
       id="text105"><tspan
         sodipodi:role="line"
         x="696.92023"
         y="671.55786"
         style="font-size:16px;line-height:1;text-align:center;text-anchor:middle;fill:#ececec;fill-opacity:1"
         id="tspan4">In Ah werden vor allem Geister, das</tspan><tspan
         sodipodi:role="line"
         x="696.92023"
         y="692.89117"
         style="font-size:16px;line-height:1;text-align:center;text-anchor:middle;fill:#ececec;fill-opacity:1"
         id="tspan4830">Leben nach dem Tod, Gespenster und</tspan><tspan
         sodipodi:role="line"
         x="696.92023"
         y="714.22449"
         style="font-size:16px;line-height:1;text-align:center;text-anchor:middle;fill:#ececec;fill-opacity:1"
         id="tspan11">Paralleldimensionen verehrt. Ein guter</tspan><tspan
         sodipodi:role="line"
         x="696.92023"
         y="735.55774"
         style="font-size:16px;line-height:1;text-align:center;text-anchor:middle;fill:#ececec;fill-opacity:1"
         id="tspan14">Anfang, aber noch nicht das Ende!</tspan></text>
    <path
       id="path58-7-3"
       d="m 169.55665,987.84782 c -8.2231,-4.8392 -21.14507,11.93679 -23.07173,10.75381 -1.97361,-1.18284 -14.89552,-4.83908 -17.6209,-10.75381 -2.77236,-6.02205 -10.57258,10.75381 -12.92207,5.91473 -2.34953,-4.73176 2.72542,20.32465 10.94847,22.79795 8.22318,2.3658 17.24514,5.9146 19.97041,13.1196 2.72543,7.2051 1.97359,21.6153 1.97359,21.6153 l -3.14827,4.7315 5.07477,9.5711 c 0,0 -0.75181,13.227 -3.10119,11.9367 -2.34948,-1.1829 -19.97041,9.5709 -21.56807,12.0441 -1.55061,2.3659 -12.12333,25.0564 -14.47267,23.8734 -2.34951,-1.1827 -9.02195,-4.7315 -9.02195,-4.7315 0,0 6.29653,9.5708 9.02195,11.9368 2.72528,2.3658 22.31979,2.3658 24.66929,2.3658 h 15.64747 c 3.14827,0 8.64595,-13.1196 11.74724,-9.5711 3.14829,3.6565 12.54613,3.6565 12.54613,3.6565 z"
       style="fill:#d6c38d;fill-opacity:1;fill-rule:evenodd;stroke:none;stroke-width:0.888574"
       inkscape:connector-curvature="0" />
    <path
       id="path60-0-1"
       d="m 155.27188,909.64405 13.62692,25.67632 2.02054,40.86516 -1.03374,17.47909 -1.36272,10.48758 6.4845,7.2326 0.89278,27.3642 c 0,0 -0.23491,19.0461 0.46993,26.0376 0.65784,6.9917 -1.03378,20.9752 -0.70484,29.1724 0.37591,8.1971 1.03376,20.9748 0,25.6764 -0.98677,4.7011 -10.38461,-67.9882 -14.47269,-79.6812 -2.39645,-12.7778 -5.92068,-130.31015 -5.92068,-130.31015 z"
       style="fill:#6e674b;fill-opacity:1;fill-rule:evenodd;stroke:none;stroke-width:0.940782"
       inkscape:connector-curvature="0" />
    <path
       id="path62-2-6"
       d="M 487.55839,912.78471 C 459.70471,862.90451 416.05264,887.8446 401.19,893.42823 c -14.80754,5.58359 -76.12969,19.35648 -85.37753,13.89697 -9.30288,-5.58362 -38.09236,-13.89697 -48.33107,-13.89697 -10.18366,0 -50.09257,13.89697 -56.58807,8.31335 -6.55056,-5.58362 -48.33108,2.72977 -55.76237,11.04313 1.87163,47.15041 5.61476,111.05169 6.55056,133.13799 13.92683,-5.4596 38.03733,2.8537 51.96413,11.1671 13.92683,8.3133 47.34024,-19.4807 63.13868,-19.4807 15.7984,0 89.1207,19.4807 108.6623,19.4807 19.48656,0 79.81783,-24.9402 95.6162,-24.9402 3.7432,-50.00408 6.49556,-119.36489 6.49556,-119.36489 z"
       style="fill:#b89f62;fill-opacity:1;fill-rule:evenodd;stroke:none;stroke-width:1.03307"
       inkscape:connector-curvature="0" />
    <text
       xml:space="preserve"
       style="font-style:italic;font-variant:normal;font-weight:normal;font-stretch:normal;font-size:21.3333px;line-height:1;font-family:Lavi;-inkscape-font-specification:'Lavi Italic';text-align:center;letter-spacing:0px;word-spacing:0px;text-anchor:middle;fill:#ececec;fill-opacity:1;stroke:none"
       x="321.82553"
       y="925.58459"
       id="text105-6"><tspan
         sodipodi:role="line"
         x="321.82553"
         y="925.58459"
         style="font-size:16px;line-height:1;text-align:center;text-anchor:middle;fill:#ececec;fill-opacity:1"
         id="tspan5606">Die Ah-Hexen trainieren in einem geheimen</tspan><tspan
         sodipodi:role="line"
         x="321.82553"
         y="946.91791"
         style="font-size:16px;line-height:1;text-align:center;text-anchor:middle;fill:#ececec;fill-opacity:1"
         id="tspan16">Tempel, der für Besucher nicht zugänglich ist.</tspan><tspan
         sodipodi:role="line"
         x="321.82553"
         y="968.25122"
         style="font-size:16px;line-height:1;text-align:center;text-anchor:middle;fill:#ececec;fill-opacity:1"
         id="tspan18">Sie versuchen immer so rein auszusehen</tspan><tspan
         sodipodi:role="line"
         x="321.82553"
         y="989.58447"
         style="font-size:16px;line-height:1;text-align:center;text-anchor:middle;fill:#ececec;fill-opacity:1"
         id="tspan19">wie die Geister selbst. Ein bisschen so,</tspan><tspan
         sodipodi:role="line"
         x="321.82553"
         y="1010.9178"
         style="font-size:16px;line-height:1;text-align:center;text-anchor:middle;fill:#ececec;fill-opacity:1"
         id="tspan4864">als wären sie die oberste Elite von Hereva.</tspan><tspan
         sodipodi:role="line"
         x="321.82553"
         y="1032.2511"
         style="font-size:16px;line-height:1;text-align:center;text-anchor:middle;fill:#ececec;fill-opacity:1"
         id="tspan27">Je angeberischer, desto besser!</tspan></text>
    <path
       id="path58-7-3-1"
       d="m 827.58648,1183.9142 c 7.5815,-5.6757 19.4952,13.9999 21.2715,12.6127 1.8196,-1.3875 13.7333,-5.6758 16.246,-12.6127 2.556,-7.0631 9.7476,12.6127 11.9138,6.9369 2.1662,-5.5495 -2.5128,23.8378 -10.0942,26.7387 -7.5816,2.7747 -15.8995,6.937 -18.4122,15.3873 -2.5127,8.4507 -1.8196,25.3516 -1.8196,25.3516 l 2.9026,5.5494 -4.6787,11.2254 c 0,0 0.6931,15.5135 2.8592,13.9999 2.1661,-1.3872 18.4121,11.2252 19.8851,14.1262 1.4296,2.7748 11.1774,29.3874 13.3434,28 2.1662,-1.3874 8.318,-5.5494 8.318,-5.5494 0,0 -5.8052,11.2251 -8.318,13.9999 -2.5126,2.7748 -20.5782,2.7748 -22.7444,2.7748 h -14.4265 c -2.9026,0 -7.9713,-15.3875 -10.8306,-11.2253 -2.9027,4.2884 -11.5672,4.2884 -11.5672,4.2884 z"
       style="fill:#d6c38d;fill-opacity:1;fill-rule:evenodd;stroke:none;stroke-width:0.92400444"
       inkscape:connector-curvature="0" />
    <path
       id="path60-0-1-8"
       d="m 840.75668,1133.1346 -12.5637,25.3273 -1.8629,40.3096 0.9531,17.2417 1.2564,10.3448 -5.9785,7.1346 -0.8231,26.9918 c 0,0 0.2165,18.7873 -0.4333,25.684 -0.6065,6.8966 0.9531,20.69 0.6498,28.7758 -0.3465,8.0857 -0.9531,20.6897 0,25.3273 0.9098,4.6373 9.5744,-67.0641 13.3435,-78.5979 2.2094,-12.6043 5.4587,-128.539 5.4587,-128.539 z"
       style="fill:#6e674b;fill-opacity:1;fill-rule:evenodd;stroke:none;stroke-width:0.89717215"
       inkscape:connector-curvature="0" />
    <path
       id="path62-2-6-0"
       d="m 549.39407,1131.0564 c 24.44457,-48.9359 62.75394,-24.4679 75.79751,-18.99 12.9952,5.478 66.81194,18.99 74.9279,13.634 8.16428,-5.478 33.43015,-13.634 42.4157,-13.634 8.93724,0 43.96164,13.634 49.66209,8.156 5.74882,-5.4779 42.41568,2.6783 48.93744,10.834 -1.64251,46.2578 -4.92752,108.9491 -5.74884,130.6172 -12.22233,-5.3561 -33.38183,2.7995 -45.60404,10.9556 -12.22233,8.156 -41.54614,-19.1118 -55.41097,-19.1118 -13.86479,0 -78.21294,19.1118 -95.3628,19.1118 -17.10155,0 -70.04868,-24.4678 -83.91345,-24.4678 -3.28505,-49.0575 -5.70054,-117.105 -5.70054,-117.105 z"
       style="fill:#b89f62;fill-opacity:1;fill-rule:evenodd;stroke:none;stroke-width:0.958582"
       inkscape:connector-curvature="0" />
    <text
       xml:space="preserve"
       style="font-style:italic;font-variant:normal;font-weight:normal;font-stretch:normal;font-size:21.3333px;line-height:1;font-family:Lavi;-inkscape-font-specification:'Lavi Italic';text-align:center;letter-spacing:0px;word-spacing:0px;text-anchor:middle;fill:#ececec;fill-opacity:1;stroke:none"
       x="695.78906"
       y="1141.9385"
       id="text105-6-7"><tspan
         sodipodi:role="line"
         x="695.78906"
         y="1141.9385"
         style="font-size:16px;line-height:1;text-align:center;text-anchor:middle;fill:#ececec;fill-opacity:1"
         id="tspan5678">Meine Tanten mögen Ah nicht und</tspan><tspan
         sodipodi:role="line"
         x="695.78906"
         y="1163.2717"
         style="font-size:16px;line-height:1;text-align:center;text-anchor:middle;fill:#ececec;fill-opacity:1"
         id="tspan34">seine derzeitige Meisterin Wasabi noch</tspan><tspan
         sodipodi:role="line"
         x="695.78906"
         y="1184.6051"
         style="font-size:16px;line-height:1;text-align:center;text-anchor:middle;fill:#ececec;fill-opacity:1"
         id="tspan36">weniger. Die Schule hat im großen</tspan><tspan
         sodipodi:role="line"
         x="695.78906"
         y="1205.9384"
         style="font-size:16px;line-height:1;text-align:center;text-anchor:middle;fill:#ececec;fill-opacity:1"
         id="tspan38">Krieg eine wichtige Rolle gespielt, aber</tspan><tspan
         sodipodi:role="line"
         x="695.78906"
         y="1227.2717"
         style="font-size:16px;line-height:1;text-align:center;text-anchor:middle;fill:#ececec;fill-opacity:1"
         id="tspan41">mehr wollen sie mir nicht erzählen.</tspan><tspan
         sodipodi:role="line"
         x="695.78906"
         y="1248.605"
         style="font-size:16px;line-height:1;text-align:center;text-anchor:middle;fill:#ececec;fill-opacity:1"
         id="tspan4954">Es muss katastrophal gewesen sein!</tspan></text>
    <path
       id="path58-7-3-1-7"
       d="m 170.93994,1376.1199 c -7.03051,-5.5456 -18.07836,13.679 -19.72557,12.3235 -1.68735,-1.3556 -12.73521,-5.5456 -15.06529,-12.3235 -2.37024,-6.9013 -9.03918,12.3235 -11.04795,6.7779 -2.00877,-5.4223 2.33018,23.2914 9.36059,26.1259 7.03059,2.7111 14.74398,6.778 17.07406,15.0346 2.33009,8.2569 1.68736,24.7705 1.68736,24.7705 l -2.69165,5.4222 4.33867,10.9682 c 0,0 -0.64273,15.158 -2.6514,13.679 -2.00868,-1.3554 -17.07398,10.968 -18.43992,13.8025 -1.3257,2.7112 -10.36507,28.7138 -12.37365,27.3583 -2.00877,-1.3556 -7.71348,-5.4223 -7.71348,-5.4223 0,0 5.3833,10.9679 7.71348,13.6791 2.32999,2.7112 19.08265,2.7112 21.09142,2.7112 h 13.37803 c 2.69165,0 7.39197,-15.0348 10.04347,-10.968 2.69174,4.1902 10.72654,4.1902 10.72654,4.1902 z"
       style="fill:#d6c38d;fill-opacity:1;fill-rule:evenodd;stroke:none;stroke-width:0.87953907"
       inkscape:connector-curvature="0" />
    <path
       id="path60-0-1-8-2"
       d="m 158.7269,1313.1697 11.65061,29.9657 1.72752,47.6915 -0.88384,20.3992 -1.16509,12.2392 5.54401,8.441 0.76328,31.9351 c 0,0 -0.20077,22.2279 0.40181,30.3874 0.56242,8.1597 -0.88383,24.479 -0.60258,34.0456 0.32132,9.5665 0.88383,-5.4867 0,0 -0.1339,-12.9678 -8.87856,-49.38 -12.37374,-63.0262 -2.04883,-14.9123 -5.06198,-152.0785 -5.06198,-152.0785 z"
       style="fill:#6e674b;fill-opacity:1;fill-rule:evenodd;stroke:none;stroke-width:0.93974036"
       inkscape:connector-curvature="0"
       sodipodi:nodetypes="cccccccccccc" />
    <path
       id="path62-2-6-0-3"
       d="m 523.65212,1316.5134 c -30.71566,-58.184 -78.85304,-29.092 -95.24284,-22.5789 -16.32902,6.5135 -83.95207,22.5789 -94.15015,16.2107 -10.25875,-6.5131 -42.00643,-16.2107 -53.29714,-16.2107 -11.23004,0 -55.2397,16.2107 -62.40255,9.6976 -7.22367,-6.5135 -53.29715,3.1842 -61.49203,12.8813 2.0639,54.9998 6.19165,129.5387 7.22368,155.3017 15.35785,-6.3683 41.94571,3.3289 57.30343,13.0262 15.35789,9.6973 52.20453,-22.7237 69.62632,-22.7237 17.42166,0 98.27793,22.7237 119.82743,22.7237 21.48885,0 88.01918,-29.092 105.44089,-29.092 4.1278,-58.3284 7.16296,-139.2359 7.16296,-139.2359 z"
       style="fill:#b89f62;fill-opacity:1;fill-rule:evenodd;stroke:none;stroke-width:1.17167"
       inkscape:connector-curvature="0" />
    <text
       xml:space="preserve"
       style="font-style:italic;font-variant:normal;font-weight:normal;font-stretch:normal;font-size:21.3333px;line-height:1;font-family:Lavi;-inkscape-font-specification:'Lavi Italic';text-align:center;letter-spacing:0px;word-spacing:0px;text-anchor:middle;fill:#ececec;fill-opacity:1;stroke:none"
       x="336.09152"
       y="1327.5834"
       id="text105-6-7-0"><tspan
         sodipodi:role="line"
         x="336.09152"
         y="1327.5834"
         style="font-size:16px;line-height:1;text-align:center;text-anchor:middle;fill:#ececec;fill-opacity:1"
         id="tspan53">Man spricht vom Leben nach dem Tod und von</tspan><tspan
         sodipodi:role="line"
         x="336.09152"
         y="1348.9166"
         style="font-size:16px;line-height:1;text-align:center;text-anchor:middle;fill:#ececec;fill-opacity:1"
         id="tspan44">Paralleldimensionen! In einer Schule, die ihre</tspan><tspan
         sodipodi:role="line"
         x="336.09152"
         y="1370.25"
         style="font-size:16px;line-height:1;text-align:center;text-anchor:middle;fill:#ececec;fill-opacity:1"
         id="tspan55">wertvollen Geheimnisse für sich behält...</tspan><tspan
         sodipodi:role="line"
         x="336.09152"
         y="1391.5833"
         style="font-size:16px;line-height:1;text-align:center;text-anchor:middle;fill:#ececec;fill-opacity:1"
         id="tspan56">und die den Rat von Ah leitet, wo die großen</tspan><tspan
         sodipodi:role="line"
         x="336.09152"
         y="1412.9166"
         style="font-size:16px;line-height:1;text-align:center;text-anchor:middle;fill:#ececec;fill-opacity:1"
         id="tspan45"> Entscheidungen getroffen werden! Wer weiß, was</tspan><tspan
         sodipodi:role="line"
         x="336.09152"
         y="1434.2499"
         style="font-size:16px;line-height:1;text-align:center;text-anchor:middle;fill:#ececec;fill-opacity:1"
         id="tspan58">für schrecklichen Dinge sie uns angetan haben!</tspan><tspan
         sodipodi:role="line"
         x="336.09152"
         y="1455.5831"
         style="font-size:16px;line-height:1;text-align:center;text-anchor:middle;fill:#ececec;fill-opacity:1"
         id="tspan5071">Man sollte sie alle in ihren Tempel einsperren...</tspan></text>
    <text
       xml:space="preserve"
       style="font-style:italic;font-variant:normal;font-weight:normal;font-stretch:normal;font-size:21.3333px;line-height:1.25;font-family:Lavi;-inkscape-font-specification:'Lavi Italic';letter-spacing:0px;word-spacing:0px;fill:#000000;fill-opacity:1;stroke:none"
       x="511.05029"
       y="1607.9447"
       id="text354" />
    <text
       xml:space="preserve"
       style="font-style:normal;font-variant:normal;font-weight:normal;font-stretch:normal;font-size:18.6667px;line-height:1.25;font-family:Lavi;-inkscape-font-specification:Lavi;letter-spacing:0px;word-spacing:0px;fill:#000000;fill-opacity:1;stroke:none"
       x="38.993668"
       y="2966.2625"
       id="text3929"><tspan
         sodipodi:role="line"
         x="38.993668"
         y="2966.2625"
         id="tspan3931"
         style="font-size:16px;text-align:start;text-anchor:start">Hintergrundbild von Ausschnitt 1, 3, 4 und 5: „<tspan
   style="font-style:italic;font-variant:normal;font-weight:normal;font-stretch:normal;font-family:Lavi;-inkscape-font-specification:'Lavi Italic'"
   id="tspan3950">The &quot;Chaos &amp; Evolutions&quot; impossible triangle</tspan>“ von David Revoy (Lizenz CC-BY 4.0). </tspan><tspan
         sodipodi:role="line"
         x="38.993668"
         y="2989.5957"
         style="font-size:16px;text-align:start;text-anchor:start"
         id="tspan3935">Referenz: https://www.peppercarrot.com/de/wiki/Magic-System.html</tspan></text>
    <text
       xml:space="preserve"
       style="font-style:normal;font-variant:normal;font-weight:normal;font-stretch:normal;line-height:0%;font-family:Lavi;-inkscape-font-specification:Lavi;letter-spacing:0px;word-spacing:0px;fill:#000000;fill-opacity:1;stroke:#000000;stroke-width:0.992362;stroke-miterlimit:4;stroke-dasharray:none;stroke-opacity:1;filter:url(#filter4375-4-1-1-1-9-5-2)"
       x="787.65729"
       y="0"
       id="text4580-6-6"
       transform="matrix(0.34701669,-0.14755694,-0.05330596,0.37401349,574.67911,1156.387)"><tspan
         sodipodi:role="line"
         id="tspan4582-1-9"
         x="0"
         y="0"
         style="font-size:70px;fill:#000000"><tspan
           style="font-size:114.732px"
           id="tspan4313-4" /></tspan></text>
    <text
       xml:space="preserve"
       style="font-style:normal;font-variant:normal;font-weight:normal;font-stretch:normal;line-height:0%;font-family:Lavi;-inkscape-font-specification:Lavi;letter-spacing:0px;word-spacing:0px;fill:#000000;fill-opacity:1;stroke:#000000;stroke-width:0.992362;stroke-miterlimit:4;stroke-dasharray:none;stroke-opacity:1;filter:url(#filter4375-4-1-1-1-9-5-2-0)"
       x="787.65729"
       y="1584.5073"
       id="text4580-6-6-9"
       transform="matrix(0.17672113,-0.09075352,-0.0271465,0.23003352,471.78886,1325.1649)" />
    <text
       xml:space="preserve"
       style="font-style:normal;font-variant:normal;font-weight:normal;font-stretch:normal;line-height:0%;font-family:Lavi;-inkscape-font-specification:Lavi;letter-spacing:0px;word-spacing:0px;fill:#000000;fill-opacity:1;stroke:#000000;stroke-width:0.992362;stroke-miterlimit:4;stroke-dasharray:none;stroke-opacity:1;filter:url(#filter4375-4-1-1-1-9-5-2-03)"
       x="787.65729"
       y="1584.5073"
       id="text4580-6-6-99"
       transform="matrix(0.34701669,-0.14755694,-0.05330596,0.37401349,270.24878,1759.8413)"><tspan
         sodipodi:role="line"
         id="tspan4582-1-9-1"
         x="787.65729"
         y="1584.5073"
         style="font-size:70px;fill:#000000">?!<tspan
   style="font-size:114.732px"
   id="tspan4313-4-5" /></tspan></text>
    <path
       style="color:#000000;display:inline;overflow:visible;visibility:visible;fill:#ffffff;fill-opacity:1;fill-rule:nonzero;stroke:none;stroke-width:0.294739;stroke-miterlimit:4;stroke-dasharray:none;marker:none;enable-background:accumulate"
       d="m 556.14933,2467.906 c -4.61524,-9.7532 -21.81768,-15.5709 -31.46777,-17.6243 -9.65012,-2.0533 -121.25571,-4.4487 -145.59079,-4.7908 -24.33507,-0.3424 -94.82279,-0.5135 -125.45141,5.4754 -30.62864,5.9888 -41.95696,14.031 -42.37657,18.6509 -0.41958,4.62 10.9088,16.9399 68.8095,20.7043 57.90059,3.7645 116.01467,5.2771 138.25185,4.5927 22.23724,-0.6844 98.16521,-2.0083 119.1437,-10.0504 20.97855,-8.042 18.26191,-11.1399 18.68149,-16.9578 z"
       id="path5909-8"
       inkscape:connector-curvature="0"
       sodipodi:nodetypes="csssssssc" />
    <text
       xml:space="preserve"
       style="font-style:normal;font-variant:normal;font-weight:normal;font-stretch:normal;font-size:18.6667px;line-height:1.25;font-family:Lavi;-inkscape-font-specification:'Lavi, Normal';font-variant-ligatures:normal;font-variant-caps:normal;font-variant-numeric:normal;font-feature-settings:normal;text-align:center;letter-spacing:0px;word-spacing:0px;writing-mode:lr-tb;text-anchor:middle;fill:#000000;fill-opacity:1;stroke:none"
       x="386.81421"
       y="2473.6594"
       id="text1165"><tspan
         sodipodi:role="line"
         x="386.81421"
         y="2473.6594"
         id="tspan5810">Schön... Diesmal lief es ganz gut!</tspan></text>
    <text
       xml:space="preserve"
       style="font-style:normal;font-variant:normal;font-weight:normal;font-stretch:normal;line-height:0%;font-family:Lavi;-inkscape-font-specification:Lavi;letter-spacing:0px;word-spacing:0px;fill:#000000;fill-opacity:1;stroke:#000000;stroke-width:0.992362;stroke-miterlimit:4;stroke-dasharray:none;stroke-opacity:1;filter:url(#filter4375-4-1-1-1-9-5-2-03-7)"
       x="787.65729"
       y="1584.5073"
       id="text4580-6-6-99-4"
       transform="matrix(0.15981313,-0.0815649,-0.02454923,0.20674306,339.90142,2447.7908)"><tspan
         sodipodi:role="line"
         id="tspan4582-1-9-1-6"
         x="787.65729"
         y="1584.5073"
         style="font-size:70px;fill:#000000">Puf!</tspan></text>
    <text
       xml:space="preserve"
       style="font-style:normal;font-variant:normal;font-weight:normal;font-stretch:normal;line-height:0%;font-family:Lavi;-inkscape-font-specification:Lavi;letter-spacing:0px;word-spacing:0px;fill:#000000;fill-opacity:1;stroke:#000000;stroke-width:0.992362;stroke-miterlimit:4;stroke-dasharray:none;stroke-opacity:1;filter:url(#filter4375-4-1-1-1-9-5-2-03-9-2)"
       x="787.65729"
       y="1584.5073"
       id="text4580-6-6-99-8-9"
       transform="matrix(0.27640296,-0.11455004,-0.04245883,0.29035067,321.17754,2336.7827)"><tspan
         sodipodi:role="line"
         x="787.65729"
         y="1584.5073"
         style="font-size:70px;fill:#000000"
         id="tspan1267">??</tspan><tspan
         sodipodi:role="line"
         x="787.65729"
         y="1584.5073"
         id="tspan5119" /></text>
    <text
       xml:space="preserve"
       style="font-style:normal;font-variant:normal;font-weight:normal;font-stretch:normal;font-size:18.6667px;line-height:1.25;font-family:Lavi;-inkscape-font-specification:'Lavi, Normal';font-variant-ligatures:normal;font-variant-caps:normal;font-variant-numeric:normal;font-feature-settings:normal;text-align:center;letter-spacing:0px;word-spacing:0px;writing-mode:lr-tb;text-anchor:middle;fill:#000000;fill-opacity:1;stroke:none"
       x="375.47562"
       y="1374.0082"
       id="text5009" />
    <path
       style="fill:#ffffff;fill-rule:evenodd;stroke:none;stroke-width:0.66803098px;stroke-linecap:butt;stroke-linejoin:miter;stroke-opacity:1"
       d="m 317.43055,1554.5234 c 22.86933,7.3524 43.54161,11.9235 36.51346,-18.5714 40.48017,41.4014 34.67332,13.047 41.07761,3.0952 24.06694,29.2458 44.77459,25.078 62.75748,-6.1905 10.16598,45.1034 31.43932,23.2506 50.20595,16.5081 -0.0459,12.6837 -5.16979,27.2279 50.20602,19.6033 -15.83339,11.4554 -21.73934,21.855 13.69252,27.8572 -24.61252,9.2106 -38.12937,19.0115 -11.41045,30.9525 -14.19421,17.3951 -4.70056,27.7332 14.83357,35.0795 -45.73757,1.0174 -34.72288,10.5875 -27.38507,19.6033 -38.9407,-18.5366 -44.38896,-11.1153 -41.07759,3.0952 -18.12464,-8.1519 -31.5211,-27.4195 -63.89851,-2.0635 -9.62942,-8.4152 -18.50562,-19.0438 -39.93658,7.2223 -1.51182,-22.9113 -17.1805,-22.0493 -39.9366,-9.2859 -6.00206,-21.4863 -28.53993,-10.577 -52.48808,3.0954 19.54717,-20.9712 20.96363,-38.4909 -17.11567,-48.4923 36.90203,-11.9969 30.18249,-21.674 15.97463,-30.9524 14.03691,-8.7252 23.18914,-18.2296 -13.69252,-35.0796 21.5638,2.6196 44.52424,5.9969 21.67983,-15.4764 z"
       id="path4582"
       inkscape:connector-curvature="0"
       sodipodi:nodetypes="ccccccccccccccccccc" />
    <text
       xml:space="preserve"
       style="font-style:normal;font-variant:normal;font-weight:normal;font-stretch:normal;font-size:18.6667px;line-height:1.25;font-family:Lavi;-inkscape-font-specification:'Lavi, Normal';font-variant-ligatures:normal;font-variant-caps:normal;font-variant-numeric:normal;font-feature-settings:normal;text-align:center;letter-spacing:0px;word-spacing:0px;writing-mode:lr-tb;text-anchor:middle;fill:#000000;fill-opacity:1;stroke:none"
       x="434.24747"
       y="1591.4569"
       id="text5081"><tspan
         sodipodi:role="line"
         x="434.24747"
         y="1591.4569"
         id="tspan5091">NEIN! Schlag mich nicht!</tspan><tspan
         sodipodi:role="line"
         x="434.24747"
         y="1614.7903"
         id="tspan5085">Ich nehme es zurück!</tspan><tspan
         sodipodi:role="line"
         x="434.24747"
         y="1638.1237"
         id="tspan10">Ah ist super!</tspan><tspan
         sodipodi:role="line"
         x="434.24747"
         y="1661.457"
         id="tspan5087">Ich bitte dich, Shichimi!</tspan></text>
    <path
       style="color:#000000;display:inline;overflow:visible;visibility:visible;fill:#ffffff;fill-opacity:1;fill-rule:nonzero;stroke:none;stroke-width:0.28645724px;marker:none;enable-background:accumulate"
       d="m 377.68324,1673.3225 c -1.99241,7.043 -5.31305,15.1493 -6.30927,17.0097 -1.99238,-1.8604 -4.15081,-3.1894 -5.81114,-4.2524 -1.49428,3.5879 -7.30542,20.5976 -6.64128,24.9829 -2.15842,-10.7639 1.16221,-23.9199 4.15081,-29.634 2.49047,1.0631 3.81873,1.9933 5.14699,2.5249 1.66034,-2.7907 4.64894,-12.7573 4.64894,-12.7573 z"
       id="path5066"
       inkscape:connector-curvature="0" />
    <path
       style="display:inline;fill:#ffffff;fill-rule:evenodd;stroke:none;stroke-width:0.491851px;stroke-linecap:butt;stroke-linejoin:miter;stroke-opacity:1"
       d="m 295.40742,2038.1653 c 26.55804,9.562 41.68588,5.6735 41.23001,-16.5532 12.67068,24.0187 21.46355,29.3906 26.67828,17.5565 16.77511,10.1719 27.2526,7.3186 35.57103,0 3.10048,9.4123 9.74952,5.614 15.50385,5.1465 1.89528,2.1294 -4.61413,7.42 21.68398,0.3712 1.70348,2.8185 3.99821,5.2458 19.40234,-1.0033 3.99073,11.4402 16.79485,-0.634 29.91203,-13.5435 -8.17238,15.8711 -4.7836,18.1129 5.65906,12.0387 -4.77435,6.5358 -7.62985,11.5954 10.50954,0.5016 -6.20997,12.0639 10.08197,3.7833 36.37947,-13.5436 -13.15439,12.8079 -48.03695,34.3946 -25.06138,32.6048 -3.20407,3.7758 -14.63288,7.0656 19.40237,13.042 -6.35393,2.5621 -25.75226,-1.1819 -9.57054,9.6664 2.16801,1.268 -5.09001,2.0424 8.76212,5.382 -8.17706,-0.2273 -13.19182,0.5844 -5.65905,5.5176 -14.92612,-0.2666 -9.34142,4.9209 1.6169,11.5371 -21.61516,-8.4868 -22.8047,-5.4023 -23.44461,-2.0064 -27.09007,-11.5706 -28.68029,-7.9277 -32.33719,-5.5177 -13.20439,0.09 -26.40883,-1.3669 -39.61323,11.5371 -3.45807,-8.026 -10.39105,-14.2038 -39.61312,-8.5275 12.83073,-10.2102 -5.42269,-3.7052 -19.40235,0.5017 7.65554,-12.7552 -11.77325,-4.384 -36.3795,8.0258 13.77941,-14.0853 -1.87074,-8.9975 -25.0614,1.0032 8.76212,-13.8374 -5.50785,-20.5295 -39.61317,-21.0678 16.32385,-4.9913 25.84301,-11.2727 8.89281,-22.5724 19.10772,3.3271 24.80727,0.2366 11.31801,-12.0388 20.84144,10.0756 11.36562,-4.5385 3.23374,-18.058 z"
       id="path4508"
       inkscape:connector-curvature="0"
       sodipodi:nodetypes="cccccccccccccccccccccccccccc" />
    <text
       xml:space="preserve"
       style="font-style:normal;font-variant:normal;font-weight:normal;font-stretch:normal;font-size:18.6667px;line-height:1.25;font-family:Lavi;-inkscape-font-specification:'Lavi, Normal';font-variant-ligatures:normal;font-variant-caps:normal;font-variant-numeric:normal;font-feature-settings:normal;text-align:center;letter-spacing:0px;word-spacing:0px;writing-mode:lr-tb;text-anchor:middle;fill:#000000;fill-opacity:1;stroke:none"
       x="404.82858"
       y="2078.8235"
       id="text5107"><tspan
         sodipodi:role="line"
         id="tspan5105"
         x="404.82858"
         y="2078.8235">DAS WAR UNHÖFLICH!</tspan></text>
    <path
       style="color:#000000;display:inline;overflow:visible;visibility:visible;fill:#ffffff;fill-opacity:1;fill-rule:nonzero;stroke:none;stroke-width:0.23273778px;marker:none;enable-background:accumulate"
       d="m 330.48076,2479.9709 c 5.90186,11.0006 8.99332,31.535 -2.81041,60.5031 14.89517,-21.6345 14.3331,-47.6691 13.771,-55.3695 -0.56207,-7.7004 -10.96059,-5.1336 -10.96059,-5.1336 z"
       id="path4008"
       inkscape:connector-curvature="0" />
    <text
       xml:space="preserve"
       style="font-style:normal;font-variant:normal;font-weight:normal;font-stretch:normal;font-size:18.6667px;line-height:1.25;font-family:Lavi;-inkscape-font-specification:'Lavi, Normal';font-variant-ligatures:normal;font-variant-caps:normal;font-variant-numeric:normal;font-feature-settings:normal;text-align:center;letter-spacing:0px;word-spacing:0px;writing-mode:lr-tb;text-anchor:middle;fill:#000000;fill-opacity:1;stroke:none"
       x="-169.63832"
       y="1714.7042"
       id="text5123"><tspan
         sodipodi:role="line"
         x="-169.63832"
         y="1714.7042"
         id="tspan5131">Ändern Sie einfach diesen Text</tspan><tspan
         sodipodi:role="line"
         x="-169.63832"
         y="1738.0376"
         id="tspan2">und alle Referenzen werden wie von</tspan><tspan
         sodipodi:role="line"
         x="-169.63832"
         y="1761.371"
         id="tspan3">Zauberhand aktualisiert! :D</tspan></text>
    <flowRoot
       transform="matrix(0.59544465,0,-0.14507357,0.87133245,-464.55107,1950.1905)"
       style="font-style:normal;font-variant:normal;font-weight:normal;font-stretch:normal;line-height:0.01%;font-family:Lavi;-inkscape-font-specification:Lavi;text-align:center;letter-spacing:0px;word-spacing:0px;text-anchor:middle;fill:#000000;fill-opacity:1;stroke:#000000;stroke-width:4.7;stroke-miterlimit:4;stroke-dasharray:none;stroke-opacity:1"
       id="flowRoot4212-3-7-8-6"
       xml:space="preserve"><flowRegion
         id="flowRegion4214-6-7-8-3"><rect
           style="font-style:normal;font-variant:normal;font-weight:normal;font-stretch:normal;font-family:Lavi;-inkscape-font-specification:Lavi;text-align:center;text-anchor:middle;stroke:#000000;stroke-width:4.69999981;stroke-miterlimit:4;stroke-dasharray:none;stroke-opacity:1"
           y="265.53046"
           x="120.55251"
           height="352.5954"
           width="509.1297"
           id="rect4216-4-0-26-5" /></flowRegion><flowPara
         style="font-size:48px;text-align:center;letter-spacing:5.20896px;text-anchor:middle;stroke:#000000;stroke-width:4.7;stroke-miterlimit:4;stroke-dasharray:none;stroke-opacity:1"
         id="flowPara4358-7-1" /></flowRoot>
    <text
       xml:space="preserve"
       style="font-style:normal;font-variant:normal;font-weight:normal;font-stretch:normal;font-size:22.677px;line-height:1.25;font-family:Lavi;-inkscape-font-specification:'Lavi, Normal';font-variant-ligatures:normal;font-variant-caps:normal;font-variant-numeric:normal;font-feature-settings:normal;text-align:center;letter-spacing:0px;word-spacing:0px;writing-mode:lr-tb;text-anchor:middle;fill:#000000;fill-opacity:1;stroke:none;stroke-width:1.21484"
       x="-198.82324"
       y="1772.2155"
       id="text5123-8"
       transform="scale(0.96123789,1.0403252)"
       inkscape:tile-cx="-190.57693"
       inkscape:tile-cy="1830.2191"
       inkscape:tile-w="44.468783"
       inkscape:tile-h="20.40063"
       inkscape:tile-x0="-212.81133"
       inkscape:tile-y0="1820.0188"><tspan
         sodipodi:role="line"
         x="-198.82324"
         y="1772.2155"
         id="tspan5131-6"
         style="stroke-width:1.21484">Bitte</tspan></text>
    <path
       style="fill:none;stroke:#000000;stroke-width:1px;stroke-linecap:butt;stroke-linejoin:miter;stroke-opacity:1"
       d="m -193.06118,1774.3262 c 0,9.7004 0,19.4007 0,29.1011 0,1.8928 0,3.7855 0,5.6783 0,0.2366 0.1673,0.5425 0,0.7098 -0.1673,0.1673 -0.47319,0 -0.70978,0 -0.2366,0 -0.54249,0.1673 -0.70979,0 -0.1673,-0.1673 0.1673,-0.5425 0,-0.7098 -0.33459,-0.3346 -1.08497,0.3346 -1.41957,0 -0.16729,-0.1673 0.1673,-0.5425 0,-0.7098 -1.89275,0 0.2366,0.2366 -0.70978,-0.7098 -0.1673,-0.1673 -0.54249,0.1673 -0.70978,0 -0.1673,-0.1673 0.16729,-0.5425 0,-0.7098 -0.1673,-0.1673 -0.54249,0.1673 -0.70979,0 -0.1673,-0.1673 0.10581,-0.4981 0,-0.7097 -0.23659,-0.2366 -0.47319,-0.4732 -0.70978,-0.7098 -0.2366,-0.2366 -0.56015,-0.4105 -0.70978,-0.7098 -0.10581,-0.2116 0.16729,-0.5425 0,-0.7098 -0.1673,-0.1673 -0.54249,0.1673 -0.70979,0 -0.1673,-0.1673 0.10581,-0.4982 0,-0.7098 -0.42587,-0.8517 -1.70348,-1.2776 -2.12935,-2.1293 -0.10581,-0.2116 0.1673,-0.5425 0,-0.7098 -0.1673,-0.1673 -0.54249,0.1673 -0.70978,0 -0.3346,-0.3346 0.33459,-1.085 0,-1.4196 -0.1673,-0.1673 -0.54249,0.1673 -0.70979,0 -0.1673,-0.1673 0.1673,-0.5425 0,-0.7098 -0.1673,-0.1673 -0.54248,0.1673 -0.70978,0 -0.1673,-0.1673 0.1673,-0.5425 0,-0.7098 -0.1673,-0.1672 -0.70979,0.2366 -0.70979,0 0,-0.2365 0.47319,0 0.70979,0"
       id="path5182"
       inkscape:connector-curvature="0" />
    <path
       style="fill:none;stroke:#000000;stroke-width:1px;stroke-linecap:butt;stroke-linejoin:miter;stroke-opacity:1"
       d="m -195.90032,1808.3958 c 2.12935,0.2366 4.2456,0.7098 6.38806,0.7098 0.23659,0 -0.1673,-0.5425 0,-0.7098 0.33459,-0.3346 1.08497,0.3346 1.41957,0 0.16729,-0.1673 -0.10581,-0.4982 0,-0.7098 0.14963,-0.2992 0.56014,-0.4105 0.70978,-0.7098 0.10581,-0.2116 -0.1673,-0.5424 0,-0.7097 0.33459,-0.3346 1.08497,0.3345 1.41957,0 0.16729,-0.1673 -0.1673,-0.5425 0,-0.7098 0.16729,-0.1673 0.54248,0.1673 0.70978,0 1.46857,-1.4686 -2.24417,0.057 0.70978,-1.4196 1.89276,0 -0.23659,0.2366 0.70979,-0.7098 0.1673,-0.1673 0.54248,0.1673 0.70978,0 0.1673,-0.1673 -0.1673,-0.5425 0,-0.7098 0.1673,-0.1673 0.54249,0.1673 0.70979,0 0.16729,-0.1673 -0.1673,-0.5425 0,-0.7097 0.16729,-0.1673 0.54248,0.1672 0.70978,0 0.1673,-0.1673 -0.1673,-0.5425 0,-0.7098 0.1673,-0.1673 0.54249,0.1673 0.70978,0 0.3346,-0.3346 -0.33459,-1.085 0,-1.4196 0.1673,-0.1673 0.54249,0.1673 0.70979,0 0.94637,-0.9464 -1.18298,-0.7098 0.70978,-0.7098"
       id="path5184"
       inkscape:connector-curvature="0" />
    <use
       x="0"
       y="0"
       inkscape:tiled-clone-of="#text5123-8"
       xlink:href="#text5123-8"
       id="use5186"
       transform="matrix(0.27227706,0.73603143,-0.68479772,0.2926477,1795.3761,2259.813)"
       width="100%"
       height="100%" />
    <use
       x="0"
       y="0"
       inkscape:tiled-clone-of="#text5123-8"
       xlink:href="#text5123-8"
       transform="matrix(0.70000766,-0.16911561,0.15388423,0.77163806,260.04823,281.23513)"
       id="use5188"
       width="100%"
       height="100%"
       inkscape:tile-cx="408.53345"
       inkscape:tile-cy="1728.461"
       inkscape:tile-w="33.822892"
       inkscape:tile-h="23.004495"
       inkscape:tile-x0="391.62201"
       inkscape:tile-y0="1716.9588" />
    <use
       x="0"
       y="0"
       inkscape:tiled-clone-of="#use5188"
       xlink:href="#use5188"
       id="use5192"
       transform="translate(-1.2902162,456.39096)"
       width="100%"
       height="100%" />
    <path
       style="color:#000000;display:inline;overflow:visible;visibility:visible;fill:#ffffff;fill-opacity:1;fill-rule:nonzero;stroke:none;stroke-width:0.292594px;marker:none;enable-background:accumulate"
       d="m 505.45703,2097.8314 c 2.0787,7.043 5.54315,15.1493 6.58251,17.0097 2.07867,-1.8604 4.33058,-3.1894 6.06281,-4.2524 1.559,3.5879 7.62181,20.5976 6.9289,24.9829 2.2519,-10.7639 -1.21254,-23.9199 -4.33057,-29.634 -2.59833,1.0631 -3.98411,1.9933 -5.3699,2.5249 -1.73224,-2.7907 -4.85027,-12.7573 -4.85027,-12.7573 z"
       id="path5066-0"
       inkscape:connector-curvature="0" />
    <text
       xml:space="preserve"
       style="font-style:normal;font-variant:normal;font-weight:normal;font-stretch:normal;line-height:0%;font-family:Lavi;-inkscape-font-specification:Lavi;letter-spacing:0px;word-spacing:0px;fill:#fff4bf;fill-opacity:1;stroke:#98b9ca;stroke-width:0.992362;stroke-miterlimit:4;stroke-dasharray:none;stroke-opacity:1;filter:url(#filter4375-4-1-1-1-9-5-8-8-3)"
       x="787.65729"
       y="1584.5073"
       id="text4580-6-0-0"
       transform="matrix(0.16827615,-0.08266215,-0.02700063,0.23609675,462.38485,1770.4146)"><tspan
         sodipodi:role="line"
         id="tspan4582-1-1-0"
         x="787.65729"
         y="1584.5073"
         style="font-size:70px;fill:#fff4bf;fill-opacity:1;stroke:#98b9ca;stroke-opacity:1">Krr!!</tspan></text>
  </g>
</svg>
