<?xml version="1.0" encoding="UTF-8" standalone="no"?>
<!-- Created with Inkscape (http://www.inkscape.org/) -->

<svg
   xmlns:dc="http://purl.org/dc/elements/1.1/"
   xmlns:cc="http://creativecommons.org/ns#"
   xmlns:rdf="http://www.w3.org/1999/02/22-rdf-syntax-ns#"
   xmlns:svg="http://www.w3.org/2000/svg"
   xmlns="http://www.w3.org/2000/svg"
   xmlns:xlink="http://www.w3.org/1999/xlink"
   xmlns:sodipodi="http://sodipodi.sourceforge.net/DTD/sodipodi-0.dtd"
   xmlns:inkscape="http://www.inkscape.org/namespaces/inkscape"
   version="1.1"
   id="svg2"
   width="1020.48"
   height="1436.16"
   viewBox="0 0 1020.48 1436.16"
   sodipodi:docname="PCMINI_E02.svg"
   inkscape:version="0.92.2 2405546, 2018-03-11"
   inkscape:export-xdpi="300"
   inkscape:export-ydpi="300">
  <metadata
     id="metadata8">
    <rdf:RDF>
      <cc:Work
         rdf:about="">
        <dc:format>image/svg+xml</dc:format>
        <dc:type
           rdf:resource="http://purl.org/dc/dcmitype/StillImage" />
        <dc:title />
      </cc:Work>
    </rdf:RDF>
  </metadata>
  <defs
     id="defs6">
    <filter
       style="color-interpolation-filters:sRGB"
       id="filter4375-4-1-1-1-9"
       inkscape:label="deevad outline effect">
      <feFlood
         id="feFlood4377-7-9-0-8-1"
         flood-opacity="1"
         flood-color="rgb(0,0,0)"
         result="flood" />
      <feComposite
         id="feComposite4379-3-8-8-2-77"
         in2="SourceGraphic"
         in="flood"
         operator="in"
         result="composite1" />
      <feMorphology
         id="feMorphology4393-1-0-49-8-9"
         operator="dilate"
         radius="4"
         result="result3" />
      <feComposite
         id="feComposite4385-9-5-7-0-8"
         in2="result3"
         in="SourceGraphic"
         operator="over"
         result="composite2" />
    </filter>
    <filter
       style="color-interpolation-filters:sRGB"
       id="filter4375-4-1-1-1-9-5"
       inkscape:label="deevad outline effect">
      <feFlood
         id="feFlood4377-7-9-0-8-1-7"
         flood-opacity="1"
         flood-color="rgb(0,0,0)"
         result="flood" />
      <feComposite
         id="feComposite4379-3-8-8-2-77-4"
         in2="SourceGraphic"
         in="flood"
         operator="in"
         result="composite1" />
      <feMorphology
         id="feMorphology4393-1-0-49-8-9-3"
         operator="dilate"
         radius="1.3999999999999999"
         result="result3" />
      <feComposite
         id="feComposite4385-9-5-7-0-8-8"
         in2="result3"
         in="SourceGraphic"
         operator="over"
         result="composite2" />
    </filter>
  </defs>
  <sodipodi:namedview
     pagecolor="#ffffff"
     bordercolor="#666666"
     borderopacity="1"
     objecttolerance="10"
     gridtolerance="10"
     guidetolerance="10"
     inkscape:pageopacity="0"
     inkscape:pageshadow="2"
     inkscape:window-width="1280"
     inkscape:window-height="967"
     id="namedview4"
     showgrid="false"
     inkscape:zoom="1"
     inkscape:cx="484.40671"
     inkscape:cy="77.514745"
     inkscape:window-x="0"
     inkscape:window-y="0"
     inkscape:window-maximized="1"
     inkscape:current-layer="svg2" />
  <g inkscape:label="text" id="layer2" inkscape:groupmode="layer"><image sodipodi:insensitive="true"
     sodipodi:absref="../../img/02/gfx_Pepper-and-Carrot-MINI_by_Nicolas_Artance_E02.png"
     xlink:href="../../img/02/gfx_Pepper-and-Carrot-MINI_by_Nicolas_Artance_E02.png"
     y="0"
     x="0"
     id="image10"
     preserveAspectRatio="none"
     height="1436.16"
     width="1020.48" />
  <flowRoot
     xml:space="preserve"
     id="flowRoot3682"
     style="font-style:normal;font-variant:normal;font-weight:normal;font-stretch:normal;font-size:40px;line-height:1.25;font-family:Lavi;-inkscape-font-specification:Lavi;letter-spacing:0px;word-spacing:0px;fill:#000000;fill-opacity:1;stroke:none"
     transform="matrix(1.1663727,0,0,1.2391611,13.006813,29.381684)"
     inkscape:export-xdpi="300"
     inkscape:export-ydpi="300"><flowRegion
       id="flowRegion3684"
       style="font-style:normal;font-variant:normal;font-weight:normal;font-stretch:normal;font-family:Lavi;-inkscape-font-specification:Lavi"><rect
         id="rect3686"
         width="533.60773"
         height="58.385712"
         x="17.29627"
         y="-14.053221"
         style="font-style:normal;font-variant:normal;font-weight:normal;font-stretch:normal;font-family:Lavi;-inkscape-font-specification:Lavi" /></flowRegion><flowPara
       style="font-style:normal;font-variant:normal;font-weight:normal;font-stretch:normal;font-family:Lavi;-inkscape-font-specification:Lavi"
       id="flowPara283">Перчинка та Морквик МІНІ </flowPara></flowRoot>  <flowRoot
     xml:space="preserve"
     id="flowRoot3690"
     style="font-style:normal;font-variant:normal;font-weight:normal;font-stretch:normal;font-size:18.66666603px;line-height:1.25;font-family:Lavi;-inkscape-font-specification:Lavi;text-align:end;letter-spacing:0px;word-spacing:0px;text-anchor:end;fill:#000000;fill-opacity:1;stroke:none"
     transform="matrix(1.2002711,0,0,1.2122625,-138.09306,9.8282406)"><flowRegion
       id="flowRegion3692"
       style="font-style:normal;font-variant:normal;font-weight:normal;font-stretch:normal;font-size:18.66666603px;font-family:Lavi;-inkscape-font-specification:Lavi;text-align:end;text-anchor:end"><rect
         id="rect3694"
         width="378.35593"
         height="104.85864"
         x="562.12878"
         y="6.4861007"
         style="font-style:normal;font-variant:normal;font-weight:normal;font-stretch:normal;font-size:18.66666603px;font-family:Lavi;-inkscape-font-specification:Lavi;text-align:end;text-anchor:end" /></flowRegion><flowPara
       style="font-style:normal;font-variant:normal;font-weight:normal;font-stretch:normal;font-size:18.66666603px;font-family:Lavi;-inkscape-font-specification:Lavi"
       id="flowPara80">Автор: Ніколас Артенс</flowPara><flowPara
       style="font-style:normal;font-variant:normal;font-weight:normal;font-stretch:normal;font-size:18.66666603px;font-family:Lavi;-inkscape-font-specification:Lavi"
       id="flowPara292">На основі CC-BY коміксу </flowPara><flowPara
       style="font-style:normal;font-variant:normal;font-weight:normal;font-stretch:normal;font-size:18.66666603px;font-family:Lavi;-inkscape-font-specification:Lavi"
       id="flowPara294">Pepper&amp;Carrot від Давіда Ревуа</flowPara></flowRoot>  <flowRoot
     xml:space="preserve"
     id="flowRoot3706"
     style="font-style:normal;font-variant:normal;font-weight:normal;font-stretch:normal;font-size:40px;line-height:1.25;font-family:Lavi;-inkscape-font-specification:Lavi;text-align:center;letter-spacing:0px;word-spacing:0px;text-anchor:middle;fill:#000000;fill-opacity:1;stroke:none"
     transform="matrix(1.7946554,0,0,2.0343253,-31.377364,-127.79631)"><flowRegion
       id="flowRegion3708"
       style="font-style:normal;font-variant:normal;font-weight:normal;font-stretch:normal;font-family:Lavi;-inkscape-font-specification:Lavi;text-align:center;text-anchor:middle"><rect
         id="rect3710"
         width="281.06439"
         height="82.157288"
         x="153.50441"
         y="79.995255"
         style="font-style:normal;font-variant:normal;font-weight:normal;font-stretch:normal;font-family:Lavi;-inkscape-font-specification:Lavi;text-align:center;text-anchor:middle" /></flowRegion><flowPara
       id="flowPara3712"
       style="font-style:normal;font-variant:normal;font-weight:normal;font-stretch:normal;font-size:14.66666698px;font-family:Lavi;-inkscape-font-specification:Lavi;text-align:center;text-anchor:middle">#2 - Покарання</flowPara></flowRoot>  <rect
     style="fill:#ffffff;stroke:#feffff;stroke-width:1.72776461;stroke-opacity:1"
     id="rect4571"
     width="398.85538"
     height="48.27895"
     x="37.821495"
     y="134.21996" />
  <text
     xml:space="preserve"
     style="font-style:normal;font-weight:normal;font-size:40px;line-height:1.25;font-family:sans-serif;text-align:center;letter-spacing:0px;word-spacing:0px;text-anchor:middle;fill:#000000;fill-opacity:1;stroke:none"
     x="234.22141"
     y="165.14827"
     id="text52"><tspan
       sodipodi:role="line"
       id="tspan50"
       x="234.22141"
       y="165.14827"
       style="font-style:normal;font-variant:normal;font-weight:normal;font-stretch:normal;font-size:24px;font-family:Lavi;-inkscape-font-specification:'Lavi, Normal';font-variant-ligatures:normal;font-variant-caps:normal;font-variant-numeric:normal;font-feature-settings:normal;text-align:center;writing-mode:lr-tb;text-anchor:middle">Після магічного конкурсу*...</tspan></text>
  <path
     style="color:#000000;display:inline;overflow:visible;visibility:visible;fill:#ffffff;fill-opacity:1;fill-rule:nonzero;stroke:none;stroke-width:0.6888718px;marker:none;enable-background:accumulate"
     d="m 266.24371,249.89741 c -0.55262,-13.66944 3.86827,-12.2305 6.07875,-14.38884 -2.21048,-11.51117 2.76303,-24.46114 21.55162,-28.77782 4.97351,-8.63329 20.44652,-14.38891 30.39354,-6.47502 7.73647,-6.47495 19.34121,-5.75555 23.7621,0 5.52613,-5.75555 12.15736,1.43894 12.70998,2.87781 6.6313,-2.87781 15.47301,0 18.78866,3.59721 8.84178,-4.31668 26.5252,4.31668 25.42003,14.38891 9.39432,7.91389 9.39432,16.54725 6.07868,21.58333 7.18391,6.47502 9.39432,34.53337 -12.15736,35.97224 -6.63137,10.07223 -23.20962,13.66944 -30.3934,7.19442 -10.49964,2.15834 -17.13094,4.31668 -19.34142,-1.43887 -5.52606,5.75555 -18.78859,5.03608 -14.3677,-5.03615 -6.82613,6.43315 -14.34294,4.26184 -20.03011,-0.26296 -10.42651,7.40419 -23.06467,3.70206 -22.43287,-4.11346 -14.21801,2.46806 -15.79779,-9.87232 -14.84981,-14.39704 -2.21179,-0.82274 -7.58306,-1.6454 -11.21069,-10.72376 z"
     id="path4043"
     inkscape:connector-curvature="0" />
  <path
     style="color:#000000;display:inline;overflow:visible;visibility:visible;fill:#ffffff;fill-opacity:1;fill-rule:nonzero;stroke:none;stroke-width:0.6888718px;marker:none;enable-background:accumulate"
     d="m 276.67992,301.15648 c 8.61483,-9.04959 22.56261,-8.63826 21.3319,3.70206 6.15345,5.34753 3.28187,20.56725 -20.92168,11.51766 -9.43526,-4.5248 -12.71707,-13.57439 -0.41022,-15.21972 z"
     id="path4051"
     inkscape:connector-curvature="0" />
  <path
     style="color:#000000;display:inline;overflow:visible;visibility:visible;fill:#ffffff;fill-opacity:1;fill-rule:nonzero;stroke:none;stroke-width:0.6888718px;marker:none;enable-background:accumulate"
     d="m 252.09484,326.04758 c 3.15261,-0.70443 5.77695,0.80004 7.8281,2.85677 5.33296,-2.8794 20.51147,7.81559 -0.41021,13.57438 -7.79433,2.05673 -15.58872,-6.58152 -9.84548,-10.28358 -2.2142,-2.22022 -0.72502,-5.44321 2.42759,-6.14757 z"
     id="path4059"
     inkscape:connector-curvature="0"
     sodipodi:nodetypes="zcccz" />
  <path
     style="color:#000000;display:inline;overflow:visible;visibility:visible;fill:#ffffff;fill-opacity:1;fill-rule:nonzero;stroke:none;stroke-width:0.6888718px;marker:none;enable-background:accumulate"
     d="m 247.00907,356.4182 c 3.15261,-0.70443 5.77695,0.80004 7.8281,2.85677 5.33296,-2.8794 20.51147,7.81559 -0.41021,13.57438 -7.79433,2.05673 -15.58872,-6.58152 -9.84548,-10.28358 -2.2142,-2.22022 -0.72502,-5.44321 2.42759,-6.14757 z"
     id="path4059-2"
     inkscape:connector-curvature="0"
     sodipodi:nodetypes="zcccz" />
  <path
     style="color:#000000;display:inline;overflow:visible;visibility:visible;fill:#ffffff;fill-opacity:1;fill-rule:nonzero;stroke:none;stroke-width:0.6888718px;marker:none;enable-background:accumulate"
     d="m 271.10862,388.92953 c 8.61483,-9.04959 22.56261,-8.63826 21.3319,3.70206 6.15345,5.34753 3.28187,20.56725 -20.92168,11.51766 -9.43526,-4.5248 -12.71707,-13.57439 -0.41022,-15.21972 z"
     id="path4051-2"
     inkscape:connector-curvature="0" />
  <path
     style="color:#000000;display:inline;overflow:visible;visibility:visible;fill:#ffffff;fill-opacity:1;fill-rule:nonzero;stroke:none;stroke-width:0.35464525px;marker:none;enable-background:accumulate"
     d="m 338.14532,404.02657 c -2.488,0.33861 -4.68808,1.56132 -6.06099,3.56914 -3.79225,-5.32929 -8.81319,0.80574 -9.2596,2.06277 -4.68509,-2.81513 -11.15638,-0.60171 -13.66698,2.46571 -6.23077,-4.17961 -19.26824,2.80444 -18.80752,11.79745 -7.03725,6.66672 -7.32543,14.33786 -5.10296,18.94179 -5.39554,5.47414 -7.92528,30.31993 7.56523,32.43675 4.44506,9.20795 16.27781,13.04985 21.67329,7.57566 7.49811,2.32629 12.20717,4.5015 13.99294,-0.52684 3.07703,4.32428 9.96807,5.05773 10.93468,0.30751 5.42816,4.44783 12.84371,5.44771 16.8005,1.43322 7.49812,2.32629 12.20724,4.50228 13.99302,-0.52607 3.79214,5.32926 10.07124,6.4578 13.3123,-0.5777 6.44754,3.26962 7.41413,1.0062 11.6655,-2.79322 7.27033,6.98476 13.72072,3.56094 16.31104,-2.78239 10.16868,2.74613 11.71908,-8.1578 11.1866,-12.21523 8.86297,-4.20951 11.24183,-14.02741 4.53815,-22.11516 1.97784,-10.14268 -1.17622,-21.84263 -14.57858,-26.40916 -3.29773,-7.86485 -14.26159,-13.58139 -21.69731,-6.93614 -5.36192,-6.05447 -13.75266,-5.86662 -17.13214,-0.92428 -2.72253,-3.82602 -6.06948,-1.74341 -7.91126,0.2012 -4.80871,-3.78828 -11.57843,-5.05509 -16.68476,-0.49159 -3.18364,-3.59485 -7.43485,-4.98846 -11.07115,-4.49342 z"
     id="path4043-4"
     inkscape:connector-curvature="0"
     sodipodi:nodetypes="ccccccccccccccccccccccc" />
  <text
     xml:space="preserve"
     style="font-style:normal;font-variant:normal;font-weight:normal;font-stretch:normal;font-size:16px;line-height:1.25;font-family:Lavi;-inkscape-font-specification:'Lavi, Normal';font-variant-ligatures:normal;font-variant-caps:normal;font-variant-numeric:normal;font-feature-settings:normal;text-align:center;letter-spacing:0px;word-spacing:0px;writing-mode:lr-tb;text-anchor:middle;fill:#000000;fill-opacity:1;stroke:none"
     x="343.25092"
     y="227.15607"
     id="text110"><tspan
       sodipodi:role="line"
       x="343.25092"
       y="227.15607"
       id="tspan114">Останнє</tspan><tspan
       sodipodi:role="line"
       x="343.25092"
       y="247.15607"
       id="tspan87">місце... що</tspan><tspan
       sodipodi:role="line"
       x="343.25092"
       y="267.15607"
       id="tspan89">за сором!</tspan></text>
  <text
     xml:space="preserve"
     style="font-style:normal;font-variant:normal;font-weight:normal;font-stretch:normal;font-size:16px;line-height:1.25;font-family:Lavi;-inkscape-font-specification:'Lavi, Normal';font-variant-ligatures:normal;font-variant-caps:normal;font-variant-numeric:normal;font-feature-settings:normal;text-align:center;letter-spacing:0px;word-spacing:0px;writing-mode:lr-tb;text-anchor:middle;fill:#000000;fill-opacity:1;stroke:none"
     x="355.53903"
     y="431.39914"
     id="text118"><tspan
       sodipodi:role="line"
       x="355.53903"
       y="431.39914"
       id="tspan122">Я сподіваюсь,</tspan><tspan
       sodipodi:role="line"
       x="355.53903"
       y="451.39914"
       id="tspan98">Майстер не побачить</tspan><tspan
       sodipodi:role="line"
       x="355.53903"
       y="471.39914"
       id="tspan304">це...</tspan></text>
  <text
     xml:space="preserve"
     style="font-style:normal;font-variant:normal;font-weight:normal;font-stretch:normal;line-height:0%;font-family:Lavi;-inkscape-font-specification:Lavi;letter-spacing:0px;word-spacing:0px;fill:#000000;fill-opacity:1;stroke:#000000;stroke-width:0.99236238;stroke-miterlimit:4;stroke-dasharray:none;stroke-opacity:1;filter:url(#filter4375-4-1-1-1-9)"
     x="787.65729"
     y="1584.5073"
     id="text4580"
     transform="matrix(0.31292805,-0.16109368,-0.05777113,0.4268683,297.71318,-347.75768)"><tspan
       sodipodi:role="line"
       id="tspan4582"
       x="787.65729"
       y="1584.5073"
       style="font-size:70px;line-height:1.25;fill:#ffffff"><tspan
         style="font-size:80.40014648px"
         id="tspan4617">БАМ!</tspan></tspan></text>
  <text
     xml:space="preserve"
     style="font-style:normal;font-variant:normal;font-weight:normal;font-stretch:normal;line-height:0%;font-family:Lavi;-inkscape-font-specification:Lavi;letter-spacing:0px;word-spacing:0px;fill:#000000;fill-opacity:1;stroke:#000000;stroke-width:0.99236238;stroke-miterlimit:4;stroke-dasharray:none;stroke-opacity:1;filter:url(#filter4375-4-1-1-1-9-5)"
     x="787.65729"
     y="1584.5073"
     id="text4580-6"
     transform="matrix(0.35223638,-0.15604375,-0.05410777,0.39552507,619.78926,-275.16116)"><tspan
       sodipodi:role="line"
       id="tspan4582-1"
       x="787.65729"
       y="1584.5073"
       style="font-size:70px;line-height:1.25;fill:#000000">??</tspan></text>
  <path
     style="display:inline;fill:#ffffff;stroke:none;stroke-width:0.44813704"
     d="m 50.508116,573.99068 9.943186,12.61052 -5.773487,6.14357 2.886719,3.55679 -4.490456,3.55684 8.980963,2.58677 c -5.794637,7.89841 -13.596412,14.58278 -21.810869,21.01749 l 12.188391,-1.94006 c -0.597556,4.5379 -3.288899,8.54811 -5.773438,12.61051 l 12.829905,-5.49689 c 0.335264,3.06685 -2.180584,4.98401 -4.169699,7.11362 l 9.30167,-1.9401 -1.28298,2.58677 c 3.760144,-0.8805 7.3339,-1.5731 11.546925,-2.91011 l -5.452729,8.73035 11.226166,-5.4969 2.886719,3.55683 2.886768,-3.88017 3.207477,13.2572 6.094195,-13.90387 4.031618,8.17643 3.34561,-7.52976 c 4.13244,3.72343 6.21226,7.93471 7.69794,12.28718 3.26995,-5.17355 6.52563,-10.34712 11.22617,-15.52063 2.01402,1.53988 4.85893,5.03426 8.33945,10.02374 l 2.24525,-6.79029 c 6.06191,4.5377 11.29308,9.35454 14.43364,14.87392 v -13.90386 l 8.01869,7.11362 2.56596,-10.99379 7.05648,7.7603 0.6415,-9.0537 9.30167,6.46695 -0.32076,-5.49689 9.30173,4.20351 c 0,0 -2.31895,-8.88199 -0.77813,-10.62404 1.54078,-1.74204 12.64576,2.54036 12.64576,2.54036 0,0 -3.66391,-6.4979 -2.56595,-7.76029 1.09795,-1.26243 12.18843,0.32333 12.18843,0.32333 l -9.30172,-10.67041 c 6.89616,-3.50285 13.80248,-6.99545 22.13163,-9.05373 0,0 -10.38772,-6.82621 -10.67604,-8.45265 -0.28827,-1.62643 4.90255,-3.51114 4.90255,-3.51114 l -9.94245,-4.75738 11.22543,-5.91304 -19.24486,0.64667 8.6602,-11.31712 -14.43364,9.7004 6.0942,-21.01749 c -7.00079,9.002 -16.39574,15.5905 -26.30133,21.66421 l 3.52824,-7.437 -12.82991,8.73034 -1.28303,-17.13731 -5.13197,13.25719 c -4.48987,-7.12921 -6.94926,-14.84321 -8.01869,-22.95759 -0.89618,7.32919 -4.17684,14.65834 -8.98091,21.98754 l -3.52824,-16.16732 -7.69793,12.61052 -4.16975,-9.70039 -7.05642,11.96379 -7.69799,-18.4307 -1.60374,17.46069 -4.490454,-7.11362 -2.566011,8.40697 -7.056418,-11.9638 1.603737,13.2572 C 84.042772,569.64217 79.181102,565.71113 73.281207,560.73349 l 6.414953,17.13737 -9.943186,-8.08368 3.848991,11.9638 -8.339448,-4.52684 1.28298,7.43696 z"
     id="path3497"
     inkscape:connector-curvature="0"
     sodipodi:nodetypes="ccccccccccccccccccccccccccccccccccczczccczccccccccccccccccccccccccccccccc" />
  <text
     xml:space="preserve"
     style="font-style:normal;font-variant:normal;font-weight:normal;font-stretch:normal;font-size:16px;line-height:1.25;font-family:Lavi;-inkscape-font-specification:'Lavi, Normal';font-variant-ligatures:normal;font-variant-caps:normal;font-variant-numeric:normal;font-feature-settings:normal;text-align:center;letter-spacing:0px;word-spacing:0px;writing-mode:lr-tb;text-anchor:middle;fill:#000000;fill-opacity:1;stroke:none"
     x="129.62921"
     y="611.05127"
     id="text174"><tspan
       sodipodi:role="line"
       id="tspan172"
       x="129.62921"
       y="611.05127"
       style="font-size:21.33333397px">МАЙСТЕР!!</tspan></text>
  <path
     style="fill:#ffffff;fill-opacity:1;stroke:none;stroke-width:0.38263446"
     d="m 377.91515,593.00694 c 12.73874,3.09258 17.63822,5.96422 15.35174,7.73144 5.22617,0.88358 7.186,23.85702 2.28648,28.05408 -0.32665,0.44188 -2.61308,1.76722 -1.63319,1.98811 0.9799,0.22089 6.85931,-0.44176 7.83921,0.44178 0.9799,0.88364 -8.8191,13.47484 -7.51261,13.91664 1.30659,0.44177 31.35689,-7.95236 35.60309,-5.96425 4.24623,1.98807 1.95982,7.06871 3.26638,7.28967 1.30645,0.22089 13.39198,-1.10449 15.02516,-0.88365 1.63311,0.22092 4.57276,6.84787 6.20595,7.06875 1.63318,0.22092 9.14579,-2.87164 10.45233,-2.65077 1.30655,0.22093 0.65322,5.74338 2.2864,5.96422 1.63319,0.22093 8.8191,-4.6388 9.79905,-4.41795 0.97986,0.22093 4.57287,11.2659 6.20602,11.92851 1.63319,0.66273 12.08544,-12.14936 13.06538,-12.37027 0.97985,-0.22093 7.18587,15.02111 8.49246,15.24199 1.30655,0.22092 7.83917,-10.38228 8.81911,-10.16135 0.9799,0.22088 7.18592,6.40613 8.49243,6.84786 1.30654,0.44177 9.79904,-13.6957 11.10554,-13.6957 1.30659,0 12.41208,5.96426 13.39202,7.06872 0.9799,1.1045 1.95976,-5.74334 3.26629,-5.74334 1.30656,0 16.33168,3.97619 16.65837,3.75531 0.3266,-0.22093 -2.28648,-4.418 -1.30658,-4.418 0.97989,0 16.33167,5.52249 16.98501,4.418 0.6532,-1.10451 33.31659,5.52244 35.60303,4.63886 2.28644,-0.88364 -14.69852,-18.11368 -13.06542,-19.43906 1.6332,-1.32541 7.51269,0.22089 7.83929,-0.4418 0.32661,-0.66269 -3.59297,-3.53437 -2.61316,-4.41799 0.97998,-0.88358 12.08553,-4.41794 13.06538,-5.52241 0.97994,-1.1045 -4.89948,-3.97625 -3.59299,-4.63894 1.30659,-0.66269 20.57803,-4.85976 20.90464,-5.96425 0.3266,-1.1045 -9.799,-6.40599 -8.49251,-7.95229 1.30655,-1.54631 4.89953,-2.209 4.57288,-3.3135 -0.32664,-1.10449 -6.53271,-2.42991 -6.20606,-3.5344 0.32669,-1.10451 3.59298,-6.62695 4.57288,-7.51053 0.97989,-0.8836 -6.85932,-0.4418 -6.85932,-1.32542 0,-0.88356 28.7438,-24.51973 28.09047,-31.14668 -10.12561,4.19707 -44.74879,11.70762 -55.52764,9.94048 -10.779,-1.76726 -6.53268,-12.81212 -8.16582,-13.47485 -1.63319,-0.66269 -13.71867,3.7553 -15.35186,2.20899 -1.63316,-1.54626 -2.28641,-4.41795 -3.59298,-4.41795 -1.30647,0 -8.81912,6.18511 -10.45222,5.96426 -1.63319,-0.22093 -16.98496,-9.9404 -19.27144,-10.16135 -2.2864,-0.22085 -11.10551,3.75529 -13.06534,3.97617 -1.95979,0.22092 -3.59294,-5.30152 -5.22613,-4.85972 -1.63319,0.44173 -12.08545,4.41795 -13.71855,3.97615 -1.6332,-0.44182 -2.93973,-2.20896 -4.24631,-1.76716 -1.30646,0.44174 -7.18592,2.20896 -7.18592,2.20896 0,0 -4.24624,-1.32542 -6.20603,-1.32542 -1.95979,0 -15.35173,7.28968 -16.98492,7.73144 -1.63319,0.44178 -16.16372,-7.64429 -15.18382,-8.96971 0.97993,-1.32538 -14.21324,9.19064 -16.49968,9.85333 -2.28639,0.66265 -9.14575,-1.32538 -9.79896,-0.66269 -0.65329,0.66269 -2.61309,4.19703 -4.57292,4.41795 -1.95979,0.22088 -6.53267,1.10446 -6.53267,1.10446 l 0.65326,1.32541 c 0,0 -13.7186,-3.53437 -15.35178,-4.85975 -1.63316,-1.32538 0.97993,5.74333 1.95983,7.51055 -5.87938,-1.76722 -23.19099,-5.52248 -24.49745,-6.62697 -1.30658,-1.10451 2.28636,3.97617 4.24615,5.52248 -2.61305,-0.66273 -4.89953,-0.88362 -4.89953,-0.88362 l 7.51261,5.30156 -2.28647,0.44184 c 0,0 4.89952,2.42989 4.89952,3.53439 0,1.10445 -12.73866,2.42987 -12.73866,2.42987 0,0 5.22613,1.98803 3.91959,3.09254 -1.30659,1.10449 -4.57293,1.76718 -4.57293,1.76718 l -0.65319,2.87172 z"
     id="path5888"
     inkscape:connector-curvature="0"
     sodipodi:nodetypes="cccsccccccccccccccscscsccccccccccccsccccscccccccsccccccccccccccsccccc" />
  <text
     xml:space="preserve"
     style="font-style:normal;font-variant:normal;font-weight:normal;font-stretch:normal;font-size:16px;line-height:1.25;font-family:Lavi;-inkscape-font-specification:'Lavi, Normal';font-variant-ligatures:normal;font-variant-caps:normal;font-variant-numeric:normal;font-feature-settings:normal;text-align:center;letter-spacing:0px;word-spacing:0px;writing-mode:lr-tb;text-anchor:middle;fill:#000000;fill-opacity:1;stroke:none"
     x="511.16824"
     y="589.68756"
     id="text184"><tspan
       sodipodi:role="line"
       id="tspan182"
       x="511.16824"
       y="589.68756">МЕНІ ДУЖЕ ШКОДА!</tspan><tspan
       sodipodi:role="line"
       x="511.16824"
       y="609.68756"
       id="tspan188">Я зганьбила Ах з моїм</tspan><tspan
       sodipodi:role="line"
       x="511.16824"
       y="629.68756"
       id="tspan102">поганим виступом!</tspan></text>
  <path
     style="color:#000000;display:inline;overflow:visible;visibility:visible;fill:#ffffff;fill-opacity:1;fill-rule:nonzero;stroke:none;stroke-width:0.42790252px;marker:none;enable-background:accumulate"
     d="m 442.54413,902.04507 c 11.1306,-1.59881 15.11507,-14.30189 -0.90883,-21.71826 1.44803,0.68974 5.82363,12.51312 4.23627,-16.35808 3.33924,2.98474 6.06885,1.73942 4.99118,-25.92436 2.72398,-0.85355 9.84367,14.34634 4.43657,-16.20286 5.85549,10.32485 9.68127,9.97496 12.7552,5.67107 10.44582,21.60836 10.66869,9.08151 13.86431,6.48112 3.46479,6.09466 7.34203,6.1643 11.9233,-4.05073 1.05093,8.1415 5.0418,6.46623 9.98228,1.62027 3.63458,19.17754 14.00071,8.85401 21.62835,10.53179 9.61807,18.86877 24.56451,4.00724 37.15641,4.05073 10.31083,-3.09097 23.34184,1.76572 29.11511,-14.58252 -1.30704,14.52765 2.77459,7.01394 6.93214,-0.81013 0.81573,2.83671 -4.48579,16.39701 9.15044,-3.24053 -0.36817,6.71451 -1.86216,15.48492 6.37758,6.48112 0.936,4.1538 -5.73809,20.5005 11.09149,-0.8102 0.0898,5.87191 -3.09808,17.40248 8.59586,3.24061 -9.48636,34.88701 -4.22866,31.15312 2.21828,24.3041 -5.01969,20.58012 -11.49392,46.10618 1.26304,45.16786 -9.98883,4.75435 -9.81419,11.82384 -8.47247,22.88357 -12.51924,-22.27098 -13.99018,-5.34577 -19.41006,-2.43047 -5.72173,-3.70494 -10.9929,-17.28207 -17.7463,1.62035 -10.34589,-7.77861 -12.39708,-0.64389 -15.80537,4.05073 -18.07505,-14.92764 -17.64808,-2.82701 -25.78765,-3.24061 -4.81242,-18.46531 -15.67234,-4.53777 -23.56937,-6.48105 -9.98229,-15.14171 -22.27094,-5.71051 -29.9469,1.62026 -3.13806,-6.25722 -5.36502,-15.76803 -13.30975,-4.86078 -5.17956,-11.99654 -10.62128,-12.50438 -16.35991,0 -1.50248,-7.5389 -5.66827,-8.75549 -16.08258,4.86078 4.69624,-12.48702 -1.49669,-17.39917 -8.31862,-21.87378 z"
     id="path3557"
     inkscape:connector-curvature="0"
     sodipodi:nodetypes="cccccccccccccccccccccccccccccc" />
  <text
     xml:space="preserve"
     style="font-style:normal;font-variant:normal;font-weight:normal;font-stretch:normal;font-size:16px;line-height:1.25;font-family:Lavi;-inkscape-font-specification:'Lavi, Normal';font-variant-ligatures:normal;font-variant-caps:normal;font-variant-numeric:normal;font-feature-settings:normal;text-align:center;letter-spacing:0px;word-spacing:0px;writing-mode:lr-tb;text-anchor:middle;fill:#000000;fill-opacity:1;stroke:none"
     x="539.4942"
     y="865.09753"
     id="text213"><tspan
       sodipodi:role="line"
       x="539.4942"
       y="865.09753"
       id="tspan109">Я обіцяю зробити</tspan><tspan
       sodipodi:role="line"
       x="539.4942"
       y="885.09753"
       id="tspan111">це, та працювати</tspan><tspan
       sodipodi:role="line"
       x="539.4942"
       y="905.09753"
       id="tspan312">дуже старанно...</tspan></text>
  <path
     style="fill:#ffffff;fill-opacity:1;stroke:none;stroke-width:0.2080649"
     d="m 542.48079,1039.1911 c -1.84818,-21.349 17.74256,-28.3845 69.12206,-27.4141 51.3795,0.9704 63.57751,13.3432 67.27388,20.8638 3.69637,7.5207 -4.43563,26.2011 -36.22439,34.4496 -31.78875,8.2484 -85.01646,-3.3965 -91.66991,-9.4615 -6.65345,-6.0651 -8.13201,-12.858 -8.50164,-18.4378 z"
     id="path3238"
     inkscape:connector-curvature="0" />
  <text
     xml:space="preserve"
     style="font-style:normal;font-variant:normal;font-weight:normal;font-stretch:normal;font-size:16px;line-height:1.25;font-family:Lavi;-inkscape-font-specification:'Lavi, Normal';font-variant-ligatures:normal;font-variant-caps:normal;font-variant-numeric:normal;font-feature-settings:normal;text-align:center;letter-spacing:0px;word-spacing:0px;writing-mode:lr-tb;text-anchor:middle;fill:#000000;fill-opacity:1;stroke:none"
     x="612.10809"
     y="1035.5072"
     id="text231"><tspan
       sodipodi:role="line"
       id="tspan229"
       x="614.92059"
       y="1035.5072">Дякую, </tspan><tspan
       sodipodi:role="line"
       x="612.10809"
       y="1055.5072"
       id="tspan113">Майстру...</tspan></text>
  <path
     style="color:#000000;display:inline;overflow:visible;visibility:visible;fill:#ffffff;fill-opacity:1;fill-rule:nonzero;stroke:none;stroke-width:0.19187529px;marker:none;enable-background:accumulate"
     d="m 619.12499,1083.8569 c -14.7274,-5.8547 -20.897,-8.2497 -24.67835,-21.2896 -3.78137,-13.0399 -6.56763,-1.3307 -6.56763,-1.3307 0,0 1.39312,22.8864 31.24598,22.6203 z"
     id="path3984"
     inkscape:connector-curvature="0" />
  <text
     xml:space="preserve"
     style="font-style:normal;font-variant:normal;font-weight:normal;font-stretch:normal;font-size:16px;line-height:1.25;font-family:Lavi;-inkscape-font-specification:'Lavi, Normal';font-variant-ligatures:normal;font-variant-caps:normal;font-variant-numeric:normal;font-feature-settings:normal;text-align:center;letter-spacing:0px;word-spacing:0px;writing-mode:lr-tb;text-anchor:middle;fill:#000000;fill-opacity:1;stroke:none"
     x="34.845879"
     y="1391.516"
     id="text241"><tspan
       sodipodi:role="line"
       id="tspan239"
       x="34.845879"
       y="1391.516"
       style="text-align:start;text-anchor:start">* Дивись 22 епізод коміксу Pepper&amp;Carrot, &quot;Голосування&quot;</tspan><tspan
       sodipodi:role="line"
       x="34.845879"
       y="1411.516"
       style="text-align:start;text-anchor:start"
       id="tspan243">(https://www.peppercarrot.com/uk/webcomic/ep22_The-Voting-System.html)</tspan></text>
</g></svg>
