<?xml version="1.0" encoding="UTF-8" standalone="no"?>
<!-- Created with Inkscape (http://www.inkscape.org/) -->

<svg
   xmlns:dc="http://purl.org/dc/elements/1.1/"
   xmlns:cc="http://creativecommons.org/ns#"
   xmlns:rdf="http://www.w3.org/1999/02/22-rdf-syntax-ns#"
   xmlns:svg="http://www.w3.org/2000/svg"
   xmlns="http://www.w3.org/2000/svg"
   xmlns:xlink="http://www.w3.org/1999/xlink"
   xmlns:sodipodi="http://sodipodi.sourceforge.net/DTD/sodipodi-0.dtd"
   xmlns:inkscape="http://www.inkscape.org/namespaces/inkscape"
   version="1.1"
   id="svg2"
   width="1285.12"
   height="2789.4399"
   viewBox="0 0 1285.12 2789.4399"
   sodipodi:docname="PCMINI_E14.svg"
   inkscape:version="0.92.1 r15371"
   inkscape:export-xdpi="300"
   inkscape:export-ydpi="300">
  <metadata
     id="metadata8">
    <rdf:RDF>
      <cc:Work
         rdf:about="">
        <dc:format>image/svg+xml</dc:format>
        <dc:type
           rdf:resource="http://purl.org/dc/dcmitype/StillImage" />
      </cc:Work>
    </rdf:RDF>
  </metadata>
  <defs
     id="defs6">
    <filter
       style="color-interpolation-filters:sRGB;"
       x="-0.15"
       width="1.3"
       y="-0.15"
       height="1.3"
       inkscape:label="text"
       id="filter10537">
      <feGaussianBlur
         in="SourceGraphic"
         stdDeviation="0.17 0.32"
         result="blur1"
         id="feGaussianBlur10527" />
      <feTurbulence
         type="turbulence"
         baseFrequency="0.0418"
         numOctaves="1"
         seed="10"
         result="turbulence"
         id="feTurbulence10529" />
      <feDisplacementMap
         in="blur1"
         in2="turbulence"
         xChannelSelector="R"
         yChannelSelector="G"
         scale="5.20833"
         result="map"
         id="feDisplacementMap10531" />
      <feGaussianBlur
         in="map"
         stdDeviation="0.79"
         result="blur2"
         id="feGaussianBlur10533" />
      <feComposite
         in="blur2"
         in2="map"
         operator="over"
         result="composite"
         id="feComposite10535" />
    </filter>
    <filter
       inkscape:label="honk"
       inkscape:menu="Pixel tools"
       inkscape:menu-tooltip="Reduce or remove antialiasing around shapes"
       height="1.3"
       y="-0.15"
       width="1.3"
       x="-0.15"
       style="color-interpolation-filters:sRGB;"
       id="filter10609">
      <feGaussianBlur
         result="result1"
         in="SourceGraphic"
         stdDeviation="1"
         id="feGaussianBlur10593" />
      <feTurbulence
         result="result0"
         numOctaves="5"
         baseFrequency="0.05"
         type="fractalNoise"
         id="feTurbulence10595" />
      <feDisplacementMap
         result="result2"
         scale="10"
         yChannelSelector="G"
         xChannelSelector="R"
         in="result1"
         in2="result0"
         id="feDisplacementMap10597" />
      <feColorMatrix
         values="1 0 0 0 0 0 1 0 0 0 0 0 1 0 0 0 0 0 10 0 "
         result="result3"
         id="feColorMatrix10599" />
      <feBlend
         mode="multiply"
         in="result2"
         result="result5"
         in2="result3"
         id="feBlend10601" />
      <feGaussianBlur
         result="result4"
         in="result3"
         stdDeviation="5"
         id="feGaussianBlur10603" />
      <feComposite
         k1="0.5"
         k3="1.5"
         k2="0.15"
         in="result4"
         in2="result5"
         operator="arithmetic"
         result="result6"
         id="feComposite10605" />
      <feComposite
         operator="in"
         in="result6"
         in2="result4"
         id="feComposite10607"
         result="fbSourceGraphic" />
      <feColorMatrix
         result="fbSourceGraphicAlpha"
         in="fbSourceGraphic"
         values="0 0 0 -1 0 0 0 0 -1 0 0 0 0 -1 0 0 0 0 1 0"
         id="feColorMatrix10677" />
      <feColorMatrix
         id="feColorMatrix10679"
         values="1 0 0 0 0 0 1 0 0 0 0 0 1 0 0 0 0 0 1000 -500 "
         in="fbSourceGraphic"
         result="fbSourceGraphic" />
      <feColorMatrix
         result="fbSourceGraphicAlpha"
         in="fbSourceGraphic"
         values="0 0 0 -1 0 0 0 0 -1 0 0 0 0 -1 0 0 0 0 1 0"
         id="feColorMatrix10681" />
      <feTurbulence
         id="feTurbulence10683"
         type="fractalNoise"
         numOctaves="3"
         seed="85"
         baseFrequency="3.0215 2.8132"
         result="turbulence"
         in="fbSourceGraphic" />
      <feDisplacementMap
         in2="turbulence"
         id="feDisplacementMap10685"
         in="fbSourceGraphic"
         scale="5.2"
         yChannelSelector="G"
         xChannelSelector="R"
         result="fbSourceGraphic" />
      <feColorMatrix
         result="fbSourceGraphicAlpha"
         in="fbSourceGraphic"
         values="0 0 0 -1 0 0 0 0 -1 0 0 0 0 -1 0 0 0 0 1 0"
         id="feColorMatrix10687" />
      <feGaussianBlur
         id="feGaussianBlur10689"
         in="fbSourceGraphic"
         stdDeviation="0.17 0.32"
         result="blur1" />
      <feTurbulence
         id="feTurbulence10691"
         type="turbulence"
         baseFrequency="0.0418"
         numOctaves="1"
         seed="10"
         result="turbulence" />
      <feDisplacementMap
         in2="turbulence"
         id="feDisplacementMap10693"
         in="blur1"
         xChannelSelector="R"
         yChannelSelector="G"
         scale="5.21"
         result="map" />
      <feGaussianBlur
         id="feGaussianBlur10695"
         in="map"
         stdDeviation="0.79"
         result="blur2" />
      <feComposite
         in2="map"
         id="feComposite10697"
         in="blur2"
         operator="over"
         result="fbSourceGraphic" />
      <feColorMatrix
         result="fbSourceGraphicAlpha"
         in="fbSourceGraphic"
         values="0 0 0 -1 0 0 0 0 -1 0 0 0 0 -1 0 0 0 0 1 0"
         id="feColorMatrix10815" />
      <feTurbulence
         id="feTurbulence10817"
         type="fractalNoise"
         numOctaves="3"
         seed="85"
         baseFrequency="0.001 2.8132"
         result="turbulence"
         in="fbSourceGraphic" />
      <feDisplacementMap
         in2="turbulence"
         id="feDisplacementMap10819"
         in="fbSourceGraphic"
         scale="5.2"
         yChannelSelector="G"
         xChannelSelector="R" />
    </filter>
  </defs>
  <sodipodi:namedview
     pagecolor="#ffffff"
     bordercolor="#666666"
     borderopacity="1"
     objecttolerance="10"
     gridtolerance="10"
     guidetolerance="10"
     inkscape:pageopacity="0"
     inkscape:pageshadow="2"
     inkscape:window-width="1920"
     inkscape:window-height="1057"
     id="namedview4"
     showgrid="false"
     inkscape:zoom="0.67683837"
     inkscape:cx="484.34438"
     inkscape:cy="692.91963"
     inkscape:window-x="-8"
     inkscape:window-y="-8"
     inkscape:window-maximized="1"
     inkscape:current-layer="svg2" />
  <g inkscape:label="text" id="layer2" inkscape:groupmode="layer"><image sodipodi:insensitive="true"
     width="1285.12"
     height="2789.4399"
     preserveAspectRatio="none"
     xlink:href="../../img/14/gfx_Pepper-and-Carrot-MINI_by_Nicolas_Artance_E14.png"
     id="image10"
     x="0"
     y="0"
     sodipodi:absref="../../img/14/gfx_Pepper-and-Carrot-MINI_by_Nicolas_Artance_E14.png" />
  <flowRoot
     xml:space="preserve"
     id="flowRoot3682"
     style="font-style:normal;font-variant:normal;font-weight:normal;font-stretch:normal;font-size:40px;line-height:1.25;font-family:Lavi;-inkscape-font-specification:Lavi;letter-spacing:0px;word-spacing:0px;fill:#000000;fill-opacity:1;stroke:none;filter:url(#filter10537)"
     transform="matrix(1.3961783,0,0,1.5356972,15.570288,32.625569)"
     inkscape:export-xdpi="300"
     inkscape:export-ydpi="300"><flowRegion
       id="flowRegion3684"
       style="font-style:normal;font-variant:normal;font-weight:normal;font-stretch:normal;font-family:Lavi;-inkscape-font-specification:Lavi"><rect
         id="rect3686"
         width="480.8848"
         height="57.081871"
         x="17.29627"
         y="-14.053221"
         style="font-style:normal;font-variant:normal;font-weight:normal;font-stretch:normal;font-family:Lavi;-inkscape-font-specification:Lavi" /></flowRegion><flowPara
       id="flowPara3688"
       style="font-style:normal;font-variant:normal;font-weight:normal;font-stretch:normal;font-family:Lavi;-inkscape-font-specification:Lavi">Pepper and Carrot MINI</flowPara></flowRoot>  <flowRoot
     xml:space="preserve"
     id="flowRoot3690"
     style="font-style:normal;font-variant:normal;font-weight:normal;font-stretch:normal;font-size:18.66666603px;line-height:1.25;font-family:Lavi;-inkscape-font-specification:Lavi;text-align:end;letter-spacing:0px;word-spacing:0px;text-anchor:end;fill:#000000;fill-opacity:1;stroke:none;filter:url(#filter10537)"
     transform="matrix(1.4367555,0,0,1.5023619,-96.640793,10.888449)"><flowRegion
       id="flowRegion3692"
       style="font-style:normal;font-variant:normal;font-weight:normal;font-stretch:normal;font-size:18.66666603px;font-family:Lavi;-inkscape-font-specification:Lavi;text-align:end;text-anchor:end"><rect
         id="rect3694"
         width="378.35593"
         height="104.85864"
         x="562.12878"
         y="6.4861007"
         style="font-style:normal;font-variant:normal;font-weight:normal;font-stretch:normal;font-size:18.66666603px;font-family:Lavi;-inkscape-font-specification:Lavi;text-align:end;text-anchor:end" /></flowRegion><flowPara
       style="font-style:normal;font-variant:normal;font-weight:normal;font-stretch:normal;font-size:19.96561623px;font-family:Lavi;-inkscape-font-specification:Lavi"
       id="flowPara3704">By Nicolas Artance</flowPara><flowPara
       style="font-style:normal;font-variant:normal;font-weight:normal;font-stretch:normal;font-size:19.96561623px;font-family:Lavi;-inkscape-font-specification:Lavi"
       id="flowPara4539">based on the CC-BY webcomic </flowPara><flowPara
       style="font-style:normal;font-variant:normal;font-weight:normal;font-stretch:normal;font-size:19.96561623px;font-family:Lavi;-inkscape-font-specification:Lavi"
       id="flowPara4541">Pepper&amp;Carrot by David Revoy</flowPara></flowRoot>  <flowRoot
     xml:space="preserve"
     id="flowRoot3706"
     style="font-style:normal;font-variant:normal;font-weight:normal;font-stretch:normal;font-size:40px;line-height:1.25;font-family:Lavi;-inkscape-font-specification:Lavi;text-align:center;letter-spacing:0px;word-spacing:0px;text-anchor:middle;fill:#000000;fill-opacity:1;stroke:none;filter:url(#filter10537)"
     transform="matrix(2.3997225,0,0,2.5211475,-52.535102,-107.38655)"><flowRegion
       id="flowRegion3708"
       style="font-style:normal;font-variant:normal;font-weight:normal;font-stretch:normal;font-family:Lavi;-inkscape-font-specification:Lavi;text-align:center;text-anchor:middle"><rect
         id="rect3710"
         width="533.49255"
         height="78.641144"
         x="24.21192"
         y="82.339355"
         style="font-style:normal;font-variant:normal;font-weight:normal;font-stretch:normal;font-family:Lavi;-inkscape-font-specification:Lavi;text-align:center;text-anchor:middle" /></flowRegion><flowPara
       id="flowPara3712"
       style="font-style:normal;font-variant:normal;font-weight:normal;font-stretch:normal;font-size:16.04188156px;font-family:Lavi;-inkscape-font-specification:Lavi;text-align:center;text-anchor:middle">#14 - Camomystery Saga - A last peaceful walk</flowPara></flowRoot>  <text
     xml:space="preserve"
     style="font-style:normal;font-variant:normal;font-weight:normal;font-stretch:normal;font-size:26.66666603px;line-height:1.25;font-family:Lavi;-inkscape-font-specification:'Lavi, Normal';font-variant-ligatures:normal;font-variant-caps:normal;font-variant-numeric:normal;font-feature-settings:normal;text-align:center;letter-spacing:0px;word-spacing:0px;writing-mode:lr-tb;text-anchor:middle;fill:#000000;fill-opacity:1;stroke:none;filter:url(#filter10537)"
     x="542.77307"
     y="906.854"
     id="text7661"><tspan
       sodipodi:role="line"
       id="tspan7659"
       x="542.77307"
       y="906.854"
       style="font-size:53.33333206px">!!</tspan></text>
  <text
     xml:space="preserve"
     style="font-style:normal;font-variant:normal;font-weight:normal;font-stretch:normal;font-size:26.66666603px;line-height:1.25;font-family:Lavi;-inkscape-font-specification:'Lavi, Normal';font-variant-ligatures:normal;font-variant-caps:normal;font-variant-numeric:normal;font-feature-settings:normal;text-align:center;letter-spacing:0px;word-spacing:0px;writing-mode:lr-tb;text-anchor:middle;fill:#000000;fill-opacity:1;stroke:none;filter:url(#filter10609)"
     x="632.69409"
     y="1507.0068"
     id="text10565"><tspan
       sodipodi:role="line"
       id="tspan10563"
       x="632.69409"
       y="1507.0068"
       style="font-size:85.33333588px">HONK!</tspan></text>
  <path
     style="color:#000000;display:inline;overflow:visible;visibility:visible;fill:#000000;fill-opacity:1;fill-rule:nonzero;stroke:none;stroke-width:0.3815681px;marker:none;filter:url(#filter10609);enable-background:accumulate"
     d="m 575.07125,2152.7971 c 4.92724,6.073 10.17629,8.2365 12.19441,8.2927 2.01801,0.056 7.10799,0.3898 9.50406,0.8995 1.97887,0.4316 4.98248,0.4334 4.46423,2.1066 -0.51823,1.6734 -7.73721,10.3389 -4.76774,14.6504 2.96944,4.3116 5.91854,4.0056 10.37223,2.694 4.45377,-1.3115 10.29642,-2.953 12.85315,0.048 2.55674,3.0004 1.21833,7.0951 -0.1303,8.881 -1.34863,1.786 -11.05582,11.4479 -12.27852,14.8669 -1.2227,3.4189 -2.88783,14.1582 2.0895,16.2171 -1.14783,-6.4916 -1.38805,-9.6959 0.36313,-12.4793 1.75115,-2.7836 4.49706,-8.1225 7.96434,-10.1017 3.46735,-1.9791 10.65866,-5.4066 11.32272,-8.6083 0.66411,-3.2017 0.20571,-11.0127 -3.09584,-13.7233 -3.30151,-2.7108 -8.39455,-4.094 -14.91155,-1.5595 -4.45372,1.3115 -6.75859,1.5772 -7.45819,0.5878 -0.69956,-0.9893 0.63884,-5.0841 3.86448,-8.0205 3.22573,-2.9364 4.63461,-6.4277 2.86304,-8.2617 -1.77157,-1.834 -8.92144,-3.6194 -10.89431,-4.9546 -1.97283,-1.3352 -14.08804,-7.8259 -14.08804,-7.8259 z"
     id="path5058"
     inkscape:connector-curvature="0"
     sodipodi:nodetypes="cscsssssscssssccscccc" />
  <path
     style="color:#000000;display:inline;overflow:visible;visibility:visible;fill:#000000;fill-opacity:1;fill-rule:nonzero;stroke:none;stroke-width:0.38066044px;marker:none;enable-background:accumulate;filter:url(#filter10609)"
     d="m 452.88456,2060.7306 c -11.11481,6.151 -13.76119,13.7666 -12.70264,17.2815 1.05856,3.5149 15.87828,19.9176 16.93684,24.3112 1.05855,4.3936 -14.81973,24.0183 -11.64407,30.4623 3.17566,6.4439 12.70262,25.7757 54.51545,27.5331 41.81285,1.7574 52.92764,-2.0504 66.15947,-2.0504 13.23198,0 62.45467,5.5653 69.86447,4.6866 7.40996,-0.8788 11.11485,-2.3433 16.40761,-2.9291 5.2927,-0.5858 44.98846,0.2929 58.74962,-14.0595 13.76117,-14.3524 14.81974,-19.3318 7.93919,-29.2906 -6.88062,-9.9588 -2.1171,-20.5034 3.70489,-32.5126 5.82204,-12.0092 -7.14465,-24.6312 -15.87831,-26.6544 -22.75882,-5.2724 -228.118,-13.7667 -254.05252,3.2219 z"
     id="path4464"
     inkscape:connector-curvature="0"
     sodipodi:nodetypes="csssssssssssc" />
  <text
     xml:space="preserve"
     style="font-style:normal;font-variant:normal;font-weight:normal;font-stretch:normal;font-size:26.66666603px;line-height:1.25;font-family:Lavi;-inkscape-font-specification:'Lavi, Normal';font-variant-ligatures:normal;font-variant-caps:normal;font-variant-numeric:normal;font-feature-settings:normal;text-align:center;letter-spacing:0px;word-spacing:0px;writing-mode:lr-tb;text-anchor:middle;fill:#000000;fill-opacity:1;stroke:none;filter:url(#filter10537)"
     x="583.59576"
     y="2094.1699"
     id="text10853"
       inkscape:export-xdpi="300"
     inkscape:export-ydpi="300"><tspan
       sodipodi:role="line"
       x="583.59576"
       y="2094.1699"
       style="fill:#ffffff"
       id="tspan10861">That sound... what</tspan><tspan
       sodipodi:role="line"
       x="583.59576"
       y="2127.5032"
       style="fill:#ffffff"
       id="tspan4545">was that...?!</tspan></text>
</g></svg>
