<?xml version="1.0" encoding="UTF-8" standalone="no"?>
<!-- Created with Inkscape (http://www.inkscape.org/) -->

<svg
   version="1.1"
   id="svg2"
   width="1436.16"
   height="1889.92"
   viewBox="0 0 1436.16 1889.92"
   sodipodi:docname="PCMINI_E07.svg"
   inkscape:version="1.3 (0e150ed6c4, 2023-07-21)"
   inkscape:export-xdpi="300"
   inkscape:export-ydpi="300"
   xmlns:inkscape="http://www.inkscape.org/namespaces/inkscape"
   xmlns:sodipodi="http://sodipodi.sourceforge.net/DTD/sodipodi-0.dtd"
   xmlns:xlink="http://www.w3.org/1999/xlink"
   xmlns="http://www.w3.org/2000/svg"
   xmlns:svg="http://www.w3.org/2000/svg"
   xmlns:rdf="http://www.w3.org/1999/02/22-rdf-syntax-ns#"
   xmlns:cc="http://creativecommons.org/ns#"
   xmlns:dc="http://purl.org/dc/elements/1.1/">
  <metadata
     id="metadata8">
    <rdf:RDF>
      <cc:Work
         rdf:about="">
        <dc:format>image/svg+xml</dc:format>
        <dc:type
           rdf:resource="http://purl.org/dc/dcmitype/StillImage" />
        <dc:title />
      </cc:Work>
    </rdf:RDF>
  </metadata>
  <defs
     id="defs6" />
  <sodipodi:namedview
     pagecolor="#ffffff"
     bordercolor="#666666"
     borderopacity="1"
     objecttolerance="10"
     gridtolerance="10"
     guidetolerance="10"
     inkscape:pageopacity="0"
     inkscape:pageshadow="2"
     inkscape:window-width="1888"
     inkscape:window-height="1144"
     id="namedview4"
     showgrid="false"
     inkscape:zoom="1.4127768"
     inkscape:cx="713.84241"
     inkscape:cy="1483.2492"
     inkscape:window-x="32"
     inkscape:window-y="0"
     inkscape:window-maximized="1"
     inkscape:current-layer="layer2"
     inkscape:pagecheckerboard="0"
     inkscape:showpageshadow="0"
     inkscape:deskcolor="#d1d1d1" />
  <g
     inkscape:label="text"
     id="layer2"
     inkscape:groupmode="layer">
    <image
       sodipodi:insensitive="true"
       width="1436.16"
       height="1889.92"
       preserveAspectRatio="none"
       xlink:href="../../img/07/gfx_Pepper-and-Carrot-MINI_by_Nicolas_Artance_E07.png"
       id="image10"
       x="0"
       y="0" />
    <flowRoot
       xml:space="preserve"
       id="flowRoot3682"
       style="font-style:normal;font-variant:normal;font-weight:normal;font-stretch:normal;font-size:40px;line-height:1.25;font-family:Lavi;-inkscape-font-specification:Lavi;letter-spacing:0px;word-spacing:0px;fill:#000000;fill-opacity:1;stroke:none"
       transform="matrix(1.4957896,0,0,1.5770409,64.44536,29.626442)"
       inkscape:export-xdpi="300"
       inkscape:export-ydpi="300"><flowRegion
         id="flowRegion3684"
         style="font-style:normal;font-variant:normal;font-weight:normal;font-stretch:normal;font-family:Lavi;-inkscape-font-specification:Lavi"><rect
           id="rect3686"
           width="583.07959"
           height="57.079281"
           x="17.29627"
           y="-14.053221"
           style="font-style:normal;font-variant:normal;font-weight:normal;font-stretch:normal;font-family:Lavi;-inkscape-font-specification:Lavi" /></flowRegion><flowPara
         id="flowPara3688"
         style="font-style:normal;font-variant:normal;font-weight:normal;font-stretch:normal;font-family:Lavi;-inkscape-font-specification:Lavi">MICENA Paprika in Korenček</flowPara></flowRoot>
    <flowRoot
       xml:space="preserve"
       id="flowRoot3690"
       style="font-style:normal;font-variant:normal;font-weight:normal;font-stretch:normal;font-size:18.6667px;line-height:1.25;font-family:Lavi;-inkscape-font-specification:Lavi;text-align:end;letter-spacing:0px;word-spacing:0px;text-anchor:end;fill:#000000;fill-opacity:1;stroke:none"
       transform="matrix(1.5392619,0,0,1.542808,-129.32943,4.7414007)"><flowRegion
         id="flowRegion3692"
         style="font-style:normal;font-variant:normal;font-weight:normal;font-stretch:normal;font-size:18.6667px;font-family:Lavi;-inkscape-font-specification:Lavi;text-align:end;text-anchor:end"><rect
           id="rect3694"
           width="378.35593"
           height="104.85864"
           x="562.12878"
           y="6.4861007"
           style="font-style:normal;font-variant:normal;font-weight:normal;font-stretch:normal;font-size:18.6667px;font-family:Lavi;-inkscape-font-specification:Lavi;text-align:end;text-anchor:end;stroke-width:1" /></flowRegion><flowPara
         style="font-style:normal;font-variant:normal;font-weight:normal;font-stretch:normal;font-size:18.6667px;font-family:Lavi;-inkscape-font-specification:Lavi"
         id="flowPara4520">Nicolas Artance</flowPara><flowPara
         style="font-style:normal;font-variant:normal;font-weight:normal;font-stretch:normal;font-size:18.6667px;font-family:Lavi;-inkscape-font-specification:Lavi"
         id="flowPara3001">Po stripu Paprika in Korenček</flowPara><flowPara
         style="font-style:normal;font-variant:normal;font-weight:normal;font-stretch:normal;font-size:18.6667px;font-family:Lavi;-inkscape-font-specification:Lavi"
         id="flowPara3003">Davida Revoyja</flowPara><flowPara
         style="font-style:normal;font-variant:normal;font-weight:normal;font-stretch:normal;font-size:18.6667px;font-family:Lavi;-inkscape-font-specification:Lavi"
         id="flowPara2997" /><flowPara
         style="font-style:normal;font-variant:normal;font-weight:normal;font-stretch:normal;font-size:18.6667px;font-family:Lavi;-inkscape-font-specification:Lavi"
         id="flowPara2999" /></flowRoot>
    <flowRoot
       xml:space="preserve"
       id="flowRoot3706"
       style="font-style:normal;font-variant:normal;font-weight:normal;font-stretch:normal;font-size:40px;line-height:1.25;font-family:Lavi;-inkscape-font-specification:Lavi;text-align:center;letter-spacing:0px;word-spacing:0px;text-anchor:middle;fill:#000000;fill-opacity:1;stroke:none"
       transform="matrix(2.3015173,0,0,2.5890211,7.5258322,-170.40901)"><flowRegion
         id="flowRegion3708"
         style="font-style:normal;font-variant:normal;font-weight:normal;font-stretch:normal;font-family:Lavi;-inkscape-font-specification:Lavi;text-align:center;text-anchor:middle"><rect
           id="rect3710"
           width="281.06439"
           height="82.157288"
           x="153.50441"
           y="79.995255"
           style="font-style:normal;font-variant:normal;font-weight:normal;font-stretch:normal;font-family:Lavi;-inkscape-font-specification:Lavi;text-align:center;text-anchor:middle" /></flowRegion><flowPara
         id="flowPara3712"
         style="font-style:normal;font-variant:normal;font-weight:normal;font-stretch:normal;font-size:14.6667px;font-family:Lavi;-inkscape-font-specification:Lavi;text-align:center;text-anchor:middle">#7 -  Vajenka</flowPara></flowRoot>
    <path
       style="fill:#f5f5f5;fill-opacity:1;stroke:none;stroke-width:0.423524"
       d="m 490.04991,1259.8462 c 5.19594,-38.7 49.59705,-46.0481 55.73761,-49.4772 6.14057,-3.4291 41.29315,-5.8324 45.54432,-5.3425 4.25119,0.4899 49.79557,4.1494 54.99143,3.6595 5.19585,-0.4899 44.32582,4.9278 54.71753,10.3164 10.39174,5.3886 41.71768,36.4349 41.71768,50.6412 0,14.2063 -11.80884,43.1088 -40.14998,56.3354 -28.34112,13.2266 -82.66169,24.4936 -116.19869,22.0443 -33.53701,-2.4494 -58.57166,-8.8177 -68.49104,-19.1051 -9.9194,-10.2873 -32.59233,-49.967 -27.86886,-69.072 z"
       id="path3061"
       inkscape:connector-curvature="0"
       sodipodi:nodetypes="cssssssssc" />
    <path
       style="fill:#f5f5f5;fill-opacity:1;stroke:none;stroke-width:0.47588134"
       d="m 473.67252,1366.052 c 27.02988,2.9125 55.30147,-15.4185 51.99042,-53.4726 -2.00617,-23.057 -5.46652,-36.955 -5.46652,-36.955 l 18.86841,11.7424 3.55148,26.0368 c 0,0 -4.85967,66.1968 -68.94379,52.6484 z"
       id="path3063"
       inkscape:connector-curvature="0"
       sodipodi:nodetypes="cscccc" />
    <text
       xml:space="preserve"
       style="font-style:normal;font-variant:normal;font-weight:normal;font-stretch:normal;font-size:26.6667px;line-height:1.25;font-family:Lavi;-inkscape-font-specification:'Lavi, Normal';font-variant-ligatures:normal;font-variant-caps:normal;font-variant-numeric:normal;font-feature-settings:normal;text-align:center;letter-spacing:0px;word-spacing:0px;writing-mode:lr-tb;text-anchor:middle;fill:#000000;fill-opacity:1;stroke:none"
       x="615.15149"
       y="1245.2512"
       id="text5153"><tspan
         sodipodi:role="line"
         x="615.15149"
         y="1245.2512"
         id="tspan4529">Pa kaj se</tspan><tspan
         sodipodi:role="line"
         x="615.15149"
         y="1278.5846"
         id="tspan7840">spet tako pačiš</tspan><tspan
         sodipodi:role="line"
         x="615.15149"
         y="1311.918"
         id="tspan13542">pred zrcalom?</tspan></text>
    <path
       style="fill:#f5f5f5;fill-opacity:1;stroke:none;stroke-width:0.374909"
       d="m 477.60178,1511.4161 c 3.79688,-44.5284 39.69451,-95.6392 123.91587,-88.2823 84.22135,7.3569 116.32212,39.1074 113.90593,99.8983 -2.41618,60.7909 -47.97856,84.4104 -118.7383,80.9256 -70.75976,-3.4849 -123.22553,-28.266 -119.0835,-92.5416 z"
       id="path3274"
       inkscape:connector-curvature="0" />
    <path
       style="display:inline;fill:#f5f5f5;fill-opacity:1;fill-rule:evenodd;stroke:none;stroke-width:0.845449px;stroke-linecap:butt;stroke-linejoin:miter;stroke-opacity:1"
       d="m 474.36714,1576.3353 c 33.35666,22.4945 52.35711,13.347 51.78454,-38.9408 15.91425,56.5033 26.95803,69.1404 33.50769,41.3009 21.06941,23.9292 34.22904,17.2169 44.6769,0 3.89421,22.1421 12.24532,13.207 19.47274,12.1071 2.38044,5.0095 -5.79533,17.4553 27.23487,0.8732 2.13958,6.6306 5.02174,12.3406 24.3692,-2.3601 5.01233,26.9129 21.09418,-1.4915 37.56926,-31.8607 -10.26445,37.3363 -6.00817,42.6098 7.10772,28.3206 -5.99651,15.3754 -9.58301,27.2777 13.19991,1.1801 -7.79969,28.3798 12.66288,8.9 45.69234,-31.8607 -16.52185,30.13 -60.33405,80.9119 -31.47692,76.7016 -4.0243,8.8824 -18.37878,16.6214 24.3692,30.6806 -7.98046,6.0274 -32.34461,-2.7804 -12.0205,22.7399 2.72299,2.9831 -6.39299,4.8048 11.00515,12.6608 -10.27033,-0.5344 -16.56883,1.3749 -7.10771,12.9803 -18.74711,-0.6276 -11.73275,11.5757 2.03078,27.1405 -27.14843,-19.9652 -28.64248,-12.709 -29.4462,-4.72 -34.02493,-27.2194 -36.02221,-18.6496 -40.61525,-12.9804 -16.58463,0.2124 -33.16927,-3.2153 -49.7539,27.1406 -4.34331,-18.8806 -13.05107,-33.4137 -49.75375,-20.0604 16.11528,-24.0194 -6.81085,-8.7165 -24.3692,1.18 9.6153,-30.0062 -14.7871,-10.3132 -45.69233,18.8804 17.3068,-33.1352 -2.34964,-21.166 -31.47691,2.3601 11.00515,-32.5521 -6.91784,-48.2947 -49.75383,-49.561 20.50263,-11.742 32.45861,-26.5189 11.16928,-53.1011 23.99915,7.8272 31.15776,0.5568 14.21535,-28.3206 26.17667,23.7023 14.27512,-10.6767 4.06157,-42.4809 z"
       id="path4508"
       inkscape:connector-curvature="0"
       sodipodi:nodetypes="cccccccccccccccccccccccccccc" />
    <path
       style="fill:#f5f5f5;fill-opacity:1;stroke:none;stroke-width:0.867042"
       d="m 671.08939,1463.3066 c 39.43776,-6.7274 54.46256,27.0462 54.85177,49.998 0.38918,22.9517 40.07641,24.2455 55.0897,5.4247 -30.97578,47.3299 -72.66791,35.6101 -92.18709,-2.133 -5.73051,-11.0808 -25.0641,-4.6083 -37.67725,17.9658 -11.65769,20.8643 -32.9224,26.2162 -32.9224,26.2162 z"
       id="path3276"
       inkscape:connector-curvature="0"
       sodipodi:nodetypes="cscsscc" />
    <text
       xml:space="preserve"
       style="font-style:normal;font-variant:normal;font-weight:normal;font-stretch:normal;font-size:26.6667px;line-height:1.25;font-family:Lavi;-inkscape-font-specification:'Lavi, Normal';font-variant-ligatures:normal;font-variant-caps:normal;font-variant-numeric:normal;font-feature-settings:normal;text-align:center;letter-spacing:0px;word-spacing:0px;writing-mode:lr-tb;text-anchor:middle;fill:#000000;fill-opacity:1;stroke:none"
       x="597.69397"
       y="1471.4696"
       id="text5179"><tspan
         sodipodi:role="line"
         x="597.69397"
         y="1471.4696"
         id="tspan4544">Poskušam</tspan><tspan
         sodipodi:role="line"
         x="597.69397"
         y="1504.803"
         id="tspan16419">narediti res grd</tspan><tspan
         sodipodi:role="line"
         x="597.69397"
         y="1538.1364"
         id="tspan16421">coprniški obraz</tspan><tspan
         sodipodi:role="line"
         x="597.69397"
         y="1571.4697"
         id="tspan16423">kot vi ...</tspan></text>
    <text
       xml:space="preserve"
       style="font-style:normal;font-variant:normal;font-weight:normal;font-stretch:normal;font-size:32px;line-height:1.25;font-family:Lavi;-inkscape-font-specification:'Lavi, Normal';font-variant-ligatures:normal;font-variant-caps:normal;font-variant-numeric:normal;font-feature-settings:normal;text-align:start;letter-spacing:0px;word-spacing:0px;writing-mode:lr-tb;text-anchor:start;fill:#000000;fill-opacity:1;stroke:none"
       x="611.16467"
       y="1650.8717"
       id="text5189"><tspan
         sodipodi:role="line"
         x="611.16467"
         y="1650.8717"
         style="font-size:32px;text-align:center;text-anchor:middle;stroke:#000000;stroke-opacity:1"
         id="tspan4556">AMPAK NE</tspan><tspan
         sodipodi:role="line"
         x="611.16467"
         y="1690.8717"
         style="font-size:32px;text-align:center;text-anchor:middle;stroke:#000000;stroke-opacity:1"
         id="tspan22043">ZNAAAAAAM!!!</tspan></text>
  </g>
</svg>
