<?xml version="1.0" encoding="UTF-8" standalone="no"?>
<!-- Created with Inkscape (http://www.inkscape.org/) -->

<svg
   version="1.1"
   id="svg2"
   width="992"
   height="3042"
   viewBox="0 0 991.99998 3042"
   sodipodi:docname="PCMINI_E19.svg"
   inkscape:version="1.3 (0e150ed6c4, 2023-07-21)"
   inkscape:export-xdpi="300"
   inkscape:export-ydpi="300"
   xmlns:inkscape="http://www.inkscape.org/namespaces/inkscape"
   xmlns:sodipodi="http://sodipodi.sourceforge.net/DTD/sodipodi-0.dtd"
   xmlns:xlink="http://www.w3.org/1999/xlink"
   xmlns="http://www.w3.org/2000/svg"
   xmlns:svg="http://www.w3.org/2000/svg"
   xmlns:rdf="http://www.w3.org/1999/02/22-rdf-syntax-ns#"
   xmlns:cc="http://creativecommons.org/ns#"
   xmlns:dc="http://purl.org/dc/elements/1.1/">
  <metadata
     id="metadata8">
    <rdf:RDF>
      <cc:Work
         rdf:about="">
        <dc:format>image/svg+xml</dc:format>
        <dc:type
           rdf:resource="http://purl.org/dc/dcmitype/StillImage" />
        <dc:title />
      </cc:Work>
    </rdf:RDF>
  </metadata>
  <defs
     id="defs6">
    <linearGradient
       id="linearGradient1964"
       inkscape:swatch="gradient">
      <stop
         style="stop-color:#3a830f;stop-opacity:1;"
         offset="0"
         id="stop1960" />
      <stop
         style="stop-color:#3a830f;stop-opacity:0;"
         offset="1"
         id="stop1962" />
    </linearGradient>
    <linearGradient
       id="linearGradient1224"
       inkscape:swatch="solid">
      <stop
         style="stop-color:#98caff;stop-opacity:1;"
         offset="0"
         id="stop1222" />
    </linearGradient>
    <linearGradient
       inkscape:collect="always"
       id="linearGradient1218">
      <stop
         style="stop-color:#ffffff;stop-opacity:1;"
         offset="0"
         id="stop1214" />
      <stop
         style="stop-color:#ffffff;stop-opacity:0;"
         offset="1"
         id="stop1216" />
    </linearGradient>
    <pattern
       y="0"
       x="0"
       height="6"
       width="6"
       patternUnits="userSpaceOnUse"
       id="EMFhbasepattern" />
    <filter
       style="color-interpolation-filters:sRGB"
       id="filter4375-4-1-1-1-9-5-8-8"
       inkscape:label="Drop Shadow">
      <feFlood
         id="feFlood4377-7-9-0-8-1-7-3-1"
         flood-opacity="1"
         flood-color="rgb(190,113,27)"
         result="flood" />
      <feComposite
         id="feComposite4379-3-8-8-2-77-4-1-0"
         in2="SourceGraphic"
         in="flood"
         operator="in"
         result="composite1"
         baseFrequency="0.053999999999999999 0.053999999999999999" />
      <feMorphology
         id="feMorphology4393-1-0-49-8-9-3-0-1"
         operator="dilate"
         radius="6.2000000000000002"
         result="result3" />
      <feComposite
         id="feComposite4385-9-5-7-0-8-8-7-5"
         in2="result3"
         in="SourceGraphic"
         operator="over"
         result="fbSourceGraphic" />
      <feColorMatrix
         result="fbSourceGraphicAlpha"
         in="fbSourceGraphic"
         values="0 0 0 -1 0 0 0 0 -1 0 0 0 0 -1 0 0 0 0 1 0"
         id="feColorMatrix4544-9" />
      <feTurbulence
         id="feTurbulence4546-3"
         type="fractalNoise"
         numOctaves="5"
         seed="174"
         baseFrequency="0.053999999999999999 0.054054054054054057"
         result="turbulence" />
      <feDisplacementMap
         id="feDisplacementMap4548-8"
         in2="turbulence"
         in="fbSourceGraphic"
         scale="6.6"
         yChannelSelector="G"
         xChannelSelector="R"
         result="fbSourceGraphic" />
      <feColorMatrix
         result="fbSourceGraphicAlpha"
         in="fbSourceGraphic"
         values="0 0 0 -1 0 0 0 0 -1 0 0 0 0 -1 0 0 0 0 1 0"
         id="feColorMatrix4670-7" />
      <feFlood
         id="feFlood4672-4"
         flood-opacity="1"
         flood-color="rgb(141,82,22)"
         result="flood"
         in="fbSourceGraphic" />
      <feComposite
         id="feComposite4674-8"
         in2="fbSourceGraphic"
         in="flood"
         operator="in"
         result="composite1" />
      <feGaussianBlur
         id="feGaussianBlur4676-3"
         in="composite1"
         stdDeviation="0"
         result="blur" />
      <feOffset
         id="feOffset4678-6"
         dx="6"
         dy="6"
         result="offset" />
      <feComposite
         id="feComposite4680-4"
         in2="offset"
         in="fbSourceGraphic"
         operator="over"
         result="composite2" />
    </filter>
    <filter
       style="color-interpolation-filters:sRGB"
       id="filter4375-4-1-1-1-9-5"
       inkscape:label="deevad outline effect">
      <feFlood
         id="feFlood4377-7-9-0-8-1-7"
         flood-opacity="1"
         flood-color="rgb(0,0,0)"
         result="flood" />
      <feComposite
         id="feComposite4379-3-8-8-2-77-4"
         in2="SourceGraphic"
         in="flood"
         operator="in"
         result="composite1" />
      <feMorphology
         id="feMorphology4393-1-0-49-8-9-3"
         operator="dilate"
         radius="1.3999999999999999"
         result="result3" />
      <feComposite
         id="feComposite4385-9-5-7-0-8-8"
         in2="result3"
         in="SourceGraphic"
         operator="over"
         result="composite2" />
    </filter>
    <filter
       style="color-interpolation-filters:sRGB"
       id="filter4375-4-1-1-1-9-5-8"
       inkscape:label="Drop Shadow">
      <feFlood
         id="feFlood4377-7-9-0-8-1-7-3"
         flood-opacity="1"
         flood-color="rgb(108,125,133)"
         result="flood" />
      <feComposite
         id="feComposite4379-3-8-8-2-77-4-1"
         in2="SourceGraphic"
         in="flood"
         operator="in"
         result="composite1" />
      <feMorphology
         id="feMorphology4393-1-0-49-8-9-3-0"
         operator="dilate"
         radius="6.2000000000000002"
         result="result3" />
      <feComposite
         id="feComposite4385-9-5-7-0-8-8-7"
         in2="result3"
         in="SourceGraphic"
         operator="over"
         result="fbSourceGraphic" />
      <feColorMatrix
         result="fbSourceGraphicAlpha"
         in="fbSourceGraphic"
         values="0 0 0 -1 0 0 0 0 -1 0 0 0 0 -1 0 0 0 0 1 0"
         id="feColorMatrix4544" />
      <feTurbulence
         id="feTurbulence4546"
         type="fractalNoise"
         numOctaves="3"
         seed="37"
         baseFrequency="0.129 0.0050000000000000001"
         result="turbulence" />
      <feDisplacementMap
         id="feDisplacementMap4548"
         in2="turbulence"
         in="fbSourceGraphic"
         scale="6.6"
         yChannelSelector="G"
         xChannelSelector="R"
         result="fbSourceGraphic" />
      <feColorMatrix
         result="fbSourceGraphicAlpha"
         in="fbSourceGraphic"
         values="0 0 0 -1 0 0 0 0 -1 0 0 0 0 -1 0 0 0 0 1 0"
         id="feColorMatrix4670" />
      <feFlood
         id="feFlood4672"
         flood-opacity="1"
         flood-color="rgb(17,52,65)"
         result="flood"
         in="fbSourceGraphic" />
      <feComposite
         id="feComposite4674"
         in2="fbSourceGraphic"
         in="flood"
         operator="in"
         result="composite1" />
      <feGaussianBlur
         id="feGaussianBlur4676"
         in="composite1"
         stdDeviation="0"
         result="blur" />
      <feOffset
         id="feOffset4678"
         dx="6"
         dy="6"
         result="offset" />
      <feComposite
         id="feComposite4680"
         in2="offset"
         in="fbSourceGraphic"
         operator="over"
         result="composite2" />
    </filter>
    <filter
       style="color-interpolation-filters:sRGB"
       id="filter4375-4-1-1-1-9-5-2"
       inkscape:label="deevad outline effect">
      <feFlood
         id="feFlood4377-7-9-0-8-1-7-0"
         flood-opacity="1"
         flood-color="rgb(0,0,0)"
         result="flood" />
      <feComposite
         id="feComposite4379-3-8-8-2-77-4-3"
         in2="SourceGraphic"
         in="flood"
         operator="in"
         result="composite1" />
      <feMorphology
         id="feMorphology4393-1-0-49-8-9-3-7"
         operator="dilate"
         radius="1.3999999999999999"
         result="result3" />
      <feComposite
         id="feComposite4385-9-5-7-0-8-8-2"
         in2="result3"
         in="SourceGraphic"
         operator="over"
         result="composite2" />
    </filter>
    <filter
       style="color-interpolation-filters:sRGB"
       id="filter4375-4-1-1-1-9-5-2-0"
       inkscape:label="deevad outline effect">
      <feFlood
         id="feFlood4377-7-9-0-8-1-7-0-2"
         flood-opacity="1"
         flood-color="rgb(0,0,0)"
         result="flood" />
      <feComposite
         id="feComposite4379-3-8-8-2-77-4-3-1"
         in2="SourceGraphic"
         in="flood"
         operator="in"
         result="composite1" />
      <feMorphology
         id="feMorphology4393-1-0-49-8-9-3-7-0"
         operator="dilate"
         radius="1.3999999999999999"
         result="result3" />
      <feComposite
         id="feComposite4385-9-5-7-0-8-8-2-2"
         in2="result3"
         in="SourceGraphic"
         operator="over"
         result="composite2" />
    </filter>
    <filter
       style="color-interpolation-filters:sRGB"
       id="filter4375-4-1-1-1-9-5-2-0-0"
       inkscape:label="deevad outline effect">
      <feFlood
         id="feFlood4377-7-9-0-8-1-7-0-2-5"
         flood-opacity="1"
         flood-color="rgb(0,0,0)"
         result="flood" />
      <feComposite
         id="feComposite4379-3-8-8-2-77-4-3-1-5"
         in2="SourceGraphic"
         in="flood"
         operator="in"
         result="composite1" />
      <feMorphology
         id="feMorphology4393-1-0-49-8-9-3-7-0-5"
         operator="dilate"
         radius="1.3999999999999999"
         result="result3" />
      <feComposite
         id="feComposite4385-9-5-7-0-8-8-2-2-4"
         in2="result3"
         in="SourceGraphic"
         operator="over"
         result="composite2" />
    </filter>
    <filter
       style="color-interpolation-filters:sRGB"
       id="filter4375-4-1-1-1-9-5-2-03"
       inkscape:label="deevad outline effect"
       x="-0.036330608"
       y="-0.034608134"
       width="1.0726612"
       height="1.0692163">
      <feFlood
         id="feFlood4377-7-9-0-8-1-7-0-8"
         flood-opacity="1"
         flood-color="rgb(0,0,0)"
         result="flood" />
      <feComposite
         id="feComposite4379-3-8-8-2-77-4-3-9"
         in2="SourceGraphic"
         in="flood"
         operator="in"
         result="composite1" />
      <feMorphology
         id="feMorphology4393-1-0-49-8-9-3-7-3"
         operator="dilate"
         radius="1.3999999999999999"
         result="result3" />
      <feComposite
         id="feComposite4385-9-5-7-0-8-8-2-20"
         in2="result3"
         in="SourceGraphic"
         operator="over"
         result="composite2" />
    </filter>
    <filter
       style="color-interpolation-filters:sRGB"
       id="filter4375-4-1-1-1-9-5-2-03-2"
       inkscape:label="deevad outline effect">
      <feFlood
         id="feFlood4377-7-9-0-8-1-7-0-8-0"
         flood-opacity="1"
         flood-color="rgb(0,0,0)"
         result="flood" />
      <feComposite
         id="feComposite4379-3-8-8-2-77-4-3-9-3"
         in2="SourceGraphic"
         in="flood"
         operator="in"
         result="composite1" />
      <feMorphology
         id="feMorphology4393-1-0-49-8-9-3-7-3-9"
         operator="dilate"
         radius="1.3999999999999999"
         result="result3" />
      <feComposite
         id="feComposite4385-9-5-7-0-8-8-2-20-6"
         in2="result3"
         in="SourceGraphic"
         operator="over"
         result="composite2" />
    </filter>
    <linearGradient
       inkscape:collect="always"
       xlink:href="#linearGradient1218"
       id="linearGradient1220"
       x1="753.18929"
       y1="1549.6741"
       x2="1195.7326"
       y2="1549.6741"
       gradientUnits="userSpaceOnUse" />
    <linearGradient
       inkscape:collect="always"
       xlink:href="#linearGradient1224"
       id="linearGradient1968"
       x1="789.57104"
       y1="1549.6741"
       x2="1159.3508"
       y2="1549.6741"
       gradientUnits="userSpaceOnUse" />
    <filter
       style="color-interpolation-filters:sRGB"
       id="filter4375-4-1-1-1-9-5-8-8-5"
       inkscape:label="soundFX1">
      <feFlood
         id="feFlood4377-7-9-0-8-1-7-3-1-2"
         flood-opacity="1"
         flood-color="rgb(43,143,96)"
         result="flood" />
      <feComposite
         id="feComposite4379-3-8-8-2-77-4-1-0-6"
         in2="SourceGraphic"
         in="flood"
         operator="in"
         result="composite1"
         baseFrequency="0.053999999999999999 0.053999999999999999" />
      <feMorphology
         id="feMorphology4393-1-0-49-8-9-3-0-1-9"
         operator="dilate"
         radius="6.2000000000000002"
         result="result3" />
      <feComposite
         id="feComposite4385-9-5-7-0-8-8-7-5-4"
         in2="result3"
         in="SourceGraphic"
         operator="over"
         result="fbSourceGraphic" />
      <feColorMatrix
         result="fbSourceGraphicAlpha"
         in="fbSourceGraphic"
         values="0 0 0 -1 0 0 0 0 -1 0 0 0 0 -1 0 0 0 0 1 0"
         id="feColorMatrix4544-9-4" />
      <feTurbulence
         id="feTurbulence4546-3-6"
         type="fractalNoise"
         numOctaves="5"
         seed="174"
         baseFrequency="0.053999999999999999 0.054054054054054057"
         result="turbulence" />
      <feDisplacementMap
         id="feDisplacementMap4548-8-0"
         in2="turbulence"
         in="fbSourceGraphic"
         scale="6.6"
         yChannelSelector="G"
         xChannelSelector="R"
         result="fbSourceGraphic" />
      <feColorMatrix
         result="fbSourceGraphicAlpha"
         in="fbSourceGraphic"
         values="0 0 0 -1 0 0 0 0 -1 0 0 0 0 -1 0 0 0 0 1 0"
         id="feColorMatrix4670-7-7" />
      <feFlood
         id="feFlood4672-4-4"
         flood-opacity="1"
         flood-color="rgb(39,84,60)"
         result="flood"
         in="fbSourceGraphic" />
      <feComposite
         id="feComposite4674-8-3"
         in2="fbSourceGraphic"
         in="flood"
         operator="in"
         result="composite1" />
      <feGaussianBlur
         id="feGaussianBlur4676-3-7"
         in="composite1"
         stdDeviation="0"
         result="blur" />
      <feOffset
         id="feOffset4678-6-9"
         dx="6"
         dy="6"
         result="offset" />
      <feComposite
         id="feComposite4680-4-0"
         in2="offset"
         in="fbSourceGraphic"
         operator="over"
         result="composite2" />
    </filter>
    <linearGradient
       gradientTransform="matrix(0.9620232,0,0,1.1282469,-764.28464,-38.250005)"
       inkscape:collect="always"
       xlink:href="#linearGradient964"
       id="linearGradient966"
       x1="483.93088"
       y1="252.79726"
       x2="521.5141"
       y2="254.66634"
       gradientUnits="userSpaceOnUse" />
    <linearGradient
       inkscape:collect="always"
       id="linearGradient964">
      <stop
         style="stop-color:#918a6f;stop-opacity:1;"
         offset="0"
         id="stop960" />
      <stop
         style="stop-color:#c2bb9f;stop-opacity:1"
         offset="1"
         id="stop962" />
    </linearGradient>
    <radialGradient
       inkscape:collect="always"
       xlink:href="#linearGradient928"
       id="radialGradient932"
       cx="322.14978"
       cy="230.87151"
       fx="322.14978"
       fy="230.87151"
       r="182.11266"
       gradientTransform="matrix(1.0760297,-0.00865386,0.00801478,1.3707011,-845.99625,-48.45967)"
       gradientUnits="userSpaceOnUse" />
    <linearGradient
       inkscape:collect="always"
       id="linearGradient928">
      <stop
         style="stop-color:#f3efe0;stop-opacity:1"
         offset="0"
         id="stop924" />
      <stop
         style="stop-color:#d9cc9d;stop-opacity:1"
         offset="1"
         id="stop926" />
    </linearGradient>
    <filter
       style="color-interpolation-filters:sRGB"
       id="filter4375-4-1-1-1-9"
       inkscape:label="deevad outline effect"
       x="-0.018569369"
       y="-0.082473611"
       width="1.0371387"
       height="1.1649472">
      <feFlood
         id="feFlood4377-7-9-0-8-1"
         flood-opacity="1"
         flood-color="rgb(0,0,0)"
         result="flood" />
      <feComposite
         id="feComposite4379-3-8-8-2-77"
         in2="SourceGraphic"
         in="flood"
         operator="in"
         result="composite1" />
      <feMorphology
         id="feMorphology4393-1-0-49-8-9"
         operator="dilate"
         radius="4"
         result="result3" />
      <feComposite
         id="feComposite4385-9-5-7-0-8"
         in2="result3"
         in="SourceGraphic"
         operator="over"
         result="composite2" />
    </filter>
    <filter
       style="color-interpolation-filters:sRGB"
       id="filter4375-4-1-1-1-9-30-2-7-6"
       inkscape:label="Roughen"
       x="-0.22834843"
       y="-0.070033189"
       width="1.4566969"
       height="1.1400664">
      <feFlood
         id="feFlood4377-7-9-0-8-1-78-6-7-3"
         flood-opacity="1"
         flood-color="rgb(0,0,0)"
         result="flood" />
      <feComposite
         id="feComposite4379-3-8-8-2-77-68-1-1-9"
         in2="SourceGraphic"
         in="flood"
         operator="in"
         result="composite1" />
      <feMorphology
         id="feMorphology4393-1-0-49-8-9-8-0-1-4"
         operator="dilate"
         radius="4"
         result="result3" />
      <feComposite
         id="feComposite4385-9-5-7-0-8-4-6-5-8"
         in2="result3"
         in="SourceGraphic"
         operator="over"
         result="fbSourceGraphic" />
      <feColorMatrix
         result="fbSourceGraphicAlpha"
         in="fbSourceGraphic"
         values="0 0 0 -1 0 0 0 0 -1 0 0 0 0 -1 0 0 0 0 1 0"
         id="feColorMatrix333-3-1-9-1" />
      <feTurbulence
         id="feTurbulence335-1-5-7-2"
         type="fractalNoise"
         numOctaves="5"
         seed="1"
         baseFrequency="0.013 0.013"
         result="turbulence" />
      <feDisplacementMap
         in2="turbulence"
         id="feDisplacementMap337-4-9-7-9"
         in="fbSourceGraphic"
         scale="6.6"
         yChannelSelector="G"
         xChannelSelector="R"
         result="fbSourceGraphic" />
      <feColorMatrix
         result="fbSourceGraphicAlpha"
         in="fbSourceGraphic"
         values="0 0 0 -1 0 0 0 0 -1 0 0 0 0 -1 0 0 0 0 1 0"
         id="feColorMatrix435-92-4-6-3" />
      <feTurbulence
         id="feTurbulence437-06-9-7-9"
         type="fractalNoise"
         numOctaves="5"
         seed="27"
         baseFrequency="0.001 0.4414"
         result="turbulence" />
      <feDisplacementMap
         in2="turbulence"
         id="feDisplacementMap439-8-0-3-0"
         in="fbSourceGraphic"
         scale="4.27461"
         yChannelSelector="G"
         xChannelSelector="R" />
    </filter>
    <filter
       style="color-interpolation-filters:sRGB"
       id="filter4375-4-1-1-1-9-30-2"
       inkscape:label="Roughen"
       x="-0.11679405"
       y="-0.075114165"
       width="1.2335881"
       height="1.1502283">
      <feFlood
         id="feFlood4377-7-9-0-8-1-78-6"
         flood-opacity="1"
         flood-color="rgb(0,0,0)"
         result="flood" />
      <feComposite
         id="feComposite4379-3-8-8-2-77-68-1"
         in2="SourceGraphic"
         in="flood"
         operator="in"
         result="composite1" />
      <feMorphology
         id="feMorphology4393-1-0-49-8-9-8-0"
         operator="dilate"
         radius="4"
         result="result3" />
      <feComposite
         id="feComposite4385-9-5-7-0-8-4-6"
         in2="result3"
         in="SourceGraphic"
         operator="over"
         result="fbSourceGraphic" />
      <feColorMatrix
         result="fbSourceGraphicAlpha"
         in="fbSourceGraphic"
         values="0 0 0 -1 0 0 0 0 -1 0 0 0 0 -1 0 0 0 0 1 0"
         id="feColorMatrix333-3-1" />
      <feTurbulence
         id="feTurbulence335-1-5"
         type="fractalNoise"
         numOctaves="5"
         seed="1"
         baseFrequency="0.013 0.013"
         result="turbulence" />
      <feDisplacementMap
         in2="turbulence"
         id="feDisplacementMap337-4-9"
         in="fbSourceGraphic"
         scale="6.6"
         yChannelSelector="G"
         xChannelSelector="R"
         result="fbSourceGraphic" />
      <feColorMatrix
         result="fbSourceGraphicAlpha"
         in="fbSourceGraphic"
         values="0 0 0 -1 0 0 0 0 -1 0 0 0 0 -1 0 0 0 0 1 0"
         id="feColorMatrix435-92-4" />
      <feTurbulence
         id="feTurbulence437-06-9"
         type="fractalNoise"
         numOctaves="5"
         seed="27"
         baseFrequency="0.001 0.4414"
         result="turbulence" />
      <feDisplacementMap
         in2="turbulence"
         id="feDisplacementMap439-8-0"
         in="fbSourceGraphic"
         scale="4.27461"
         yChannelSelector="G"
         xChannelSelector="R" />
    </filter>
    <filter
       style="color-interpolation-filters:sRGB"
       id="filter4375-4-1-1-1-9-30-2-7"
       inkscape:label="Roughen"
       x="-0.10542835"
       y="-0.075500431"
       width="1.2108567"
       height="1.1510009">
      <feFlood
         id="feFlood4377-7-9-0-8-1-78-6-7"
         flood-opacity="1"
         flood-color="rgb(0,0,0)"
         result="flood" />
      <feComposite
         id="feComposite4379-3-8-8-2-77-68-1-1"
         in2="SourceGraphic"
         in="flood"
         operator="in"
         result="composite1" />
      <feMorphology
         id="feMorphology4393-1-0-49-8-9-8-0-1"
         operator="dilate"
         radius="4"
         result="result3" />
      <feComposite
         id="feComposite4385-9-5-7-0-8-4-6-5"
         in2="result3"
         in="SourceGraphic"
         operator="over"
         result="fbSourceGraphic" />
      <feColorMatrix
         result="fbSourceGraphicAlpha"
         in="fbSourceGraphic"
         values="0 0 0 -1 0 0 0 0 -1 0 0 0 0 -1 0 0 0 0 1 0"
         id="feColorMatrix333-3-1-9" />
      <feTurbulence
         id="feTurbulence335-1-5-7"
         type="fractalNoise"
         numOctaves="5"
         seed="1"
         baseFrequency="0.013 0.013"
         result="turbulence" />
      <feDisplacementMap
         in2="turbulence"
         id="feDisplacementMap337-4-9-7"
         in="fbSourceGraphic"
         scale="6.6"
         yChannelSelector="G"
         xChannelSelector="R"
         result="fbSourceGraphic" />
      <feColorMatrix
         result="fbSourceGraphicAlpha"
         in="fbSourceGraphic"
         values="0 0 0 -1 0 0 0 0 -1 0 0 0 0 -1 0 0 0 0 1 0"
         id="feColorMatrix435-92-4-6" />
      <feTurbulence
         id="feTurbulence437-06-9-7"
         type="fractalNoise"
         numOctaves="5"
         seed="27"
         baseFrequency="0.001 0.4414"
         result="turbulence" />
      <feDisplacementMap
         in2="turbulence"
         id="feDisplacementMap439-8-0-3"
         in="fbSourceGraphic"
         scale="4.27461"
         yChannelSelector="G"
         xChannelSelector="R" />
    </filter>
    <filter
       style="color-interpolation-filters:sRGB"
       id="filter4375-4-1-1-1-9-3"
       inkscape:label="Roughen"
       x="-0.1200751"
       y="-0.074537877"
       width="1.2401502"
       height="1.1490758">
      <feFlood
         id="feFlood4377-7-9-0-8-1-6"
         flood-opacity="1"
         flood-color="rgb(0,0,0)"
         result="flood" />
      <feComposite
         id="feComposite4379-3-8-8-2-77-75"
         in2="SourceGraphic"
         in="flood"
         operator="in"
         result="composite1" />
      <feMorphology
         id="feMorphology4393-1-0-49-8-9-35"
         operator="dilate"
         radius="4"
         result="result3" />
      <feComposite
         id="feComposite4385-9-5-7-0-8-6"
         in2="result3"
         in="SourceGraphic"
         operator="over"
         result="fbSourceGraphic" />
      <feColorMatrix
         result="fbSourceGraphicAlpha"
         in="fbSourceGraphic"
         values="0 0 0 -1 0 0 0 0 -1 0 0 0 0 -1 0 0 0 0 1 0"
         id="feColorMatrix333" />
      <feTurbulence
         id="feTurbulence335"
         type="fractalNoise"
         numOctaves="5"
         seed="1"
         baseFrequency="0.013 0.013"
         result="turbulence" />
      <feDisplacementMap
         in2="turbulence"
         id="feDisplacementMap337"
         in="fbSourceGraphic"
         scale="6.6"
         yChannelSelector="G"
         xChannelSelector="R"
         result="fbSourceGraphic" />
      <feColorMatrix
         result="fbSourceGraphicAlpha"
         in="fbSourceGraphic"
         values="0 0 0 -1 0 0 0 0 -1 0 0 0 0 -1 0 0 0 0 1 0"
         id="feColorMatrix435" />
      <feTurbulence
         id="feTurbulence437"
         type="fractalNoise"
         numOctaves="5"
         seed="27"
         baseFrequency="0.001 0.4414"
         result="turbulence" />
      <feDisplacementMap
         in2="turbulence"
         id="feDisplacementMap439"
         in="fbSourceGraphic"
         scale="4.27461"
         yChannelSelector="G"
         xChannelSelector="R" />
    </filter>
    <filter
       style="color-interpolation-filters:sRGB"
       id="filter4375-4-1-1-1-9-30"
       inkscape:label="Roughen"
       x="-0.11679405"
       y="-0.075114165"
       width="1.2335881"
       height="1.1502283">
      <feFlood
         id="feFlood4377-7-9-0-8-1-78"
         flood-opacity="1"
         flood-color="rgb(0,0,0)"
         result="flood" />
      <feComposite
         id="feComposite4379-3-8-8-2-77-68"
         in2="SourceGraphic"
         in="flood"
         operator="in"
         result="composite1" />
      <feMorphology
         id="feMorphology4393-1-0-49-8-9-8"
         operator="dilate"
         radius="4"
         result="result3" />
      <feComposite
         id="feComposite4385-9-5-7-0-8-4"
         in2="result3"
         in="SourceGraphic"
         operator="over"
         result="fbSourceGraphic" />
      <feColorMatrix
         result="fbSourceGraphicAlpha"
         in="fbSourceGraphic"
         values="0 0 0 -1 0 0 0 0 -1 0 0 0 0 -1 0 0 0 0 1 0"
         id="feColorMatrix333-3" />
      <feTurbulence
         id="feTurbulence335-1"
         type="fractalNoise"
         numOctaves="5"
         seed="1"
         baseFrequency="0.013 0.013"
         result="turbulence" />
      <feDisplacementMap
         in2="turbulence"
         id="feDisplacementMap337-4"
         in="fbSourceGraphic"
         scale="6.6"
         yChannelSelector="G"
         xChannelSelector="R"
         result="fbSourceGraphic" />
      <feColorMatrix
         result="fbSourceGraphicAlpha"
         in="fbSourceGraphic"
         values="0 0 0 -1 0 0 0 0 -1 0 0 0 0 -1 0 0 0 0 1 0"
         id="feColorMatrix435-92" />
      <feTurbulence
         id="feTurbulence437-06"
         type="fractalNoise"
         numOctaves="5"
         seed="27"
         baseFrequency="0.001 0.4414"
         result="turbulence" />
      <feDisplacementMap
         in2="turbulence"
         id="feDisplacementMap439-8"
         in="fbSourceGraphic"
         scale="4.27461"
         yChannelSelector="G"
         xChannelSelector="R" />
    </filter>
    <filter
       style="color-interpolation-filters:sRGB"
       id="filter4375-4-1-1-1-9-5-2-03-9"
       inkscape:label="deevad outline effect"
       x="-0.011679334"
       y="-0.033179927"
       width="1.0233587"
       height="1.0663599">
      <feFlood
         id="feFlood4377-7-9-0-8-1-7-0-8-07"
         flood-opacity="1"
         flood-color="rgb(0,0,0)"
         result="flood" />
      <feComposite
         id="feComposite4379-3-8-8-2-77-4-3-9-5"
         in2="SourceGraphic"
         in="flood"
         operator="in"
         result="composite1" />
      <feMorphology
         id="feMorphology4393-1-0-49-8-9-3-7-3-5"
         operator="dilate"
         radius="1.3999999999999999"
         result="result3" />
      <feComposite
         id="feComposite4385-9-5-7-0-8-8-2-20-8"
         in2="result3"
         in="SourceGraphic"
         operator="over"
         result="composite2" />
    </filter>
    <filter
       style="color-interpolation-filters:sRGB"
       id="filter4375-4-1-1-1-9-5-2-03-7"
       inkscape:label="deevad outline effect"
       x="-0.036330608"
       y="-0.034608134"
       width="1.0726612"
       height="1.0692163">
      <feFlood
         id="feFlood4377-7-9-0-8-1-7-0-8-9"
         flood-opacity="1"
         flood-color="rgb(0,0,0)"
         result="flood" />
      <feComposite
         id="feComposite4379-3-8-8-2-77-4-3-9-7"
         in2="SourceGraphic"
         in="flood"
         operator="in"
         result="composite1" />
      <feMorphology
         id="feMorphology4393-1-0-49-8-9-3-7-3-90"
         operator="dilate"
         radius="1.3999999999999999"
         result="result3" />
      <feComposite
         id="feComposite4385-9-5-7-0-8-8-2-20-4"
         in2="result3"
         in="SourceGraphic"
         operator="over"
         result="composite2" />
    </filter>
    <filter
       style="color-interpolation-filters:sRGB"
       id="filter4375-4-1-1-1-9-5-2-03-9-2"
       inkscape:label="deevad outline effect"
       x="-0.0096835116"
       y="-0.032884907"
       width="1.019367"
       height="1.0657698">
      <feFlood
         id="feFlood4377-7-9-0-8-1-7-0-8-07-7"
         flood-opacity="1"
         flood-color="rgb(0,0,0)"
         result="flood" />
      <feComposite
         id="feComposite4379-3-8-8-2-77-4-3-9-5-3"
         in2="SourceGraphic"
         in="flood"
         operator="in"
         result="composite1" />
      <feMorphology
         id="feMorphology4393-1-0-49-8-9-3-7-3-5-0"
         operator="dilate"
         radius="1.3999999999999999"
         result="result3" />
      <feComposite
         id="feComposite4385-9-5-7-0-8-8-2-20-8-3"
         in2="result3"
         in="SourceGraphic"
         operator="over"
         result="composite2" />
    </filter>
  </defs>
  <sodipodi:namedview
     pagecolor="#ffffff"
     bordercolor="#666666"
     borderopacity="1"
     objecttolerance="10"
     gridtolerance="10"
     guidetolerance="10"
     inkscape:pageopacity="0"
     inkscape:pageshadow="2"
     inkscape:window-width="1888"
     inkscape:window-height="1144"
     id="namedview4"
     showgrid="false"
     inkscape:zoom="0.99622846"
     inkscape:cx="409.54461"
     inkscape:cy="1085.0925"
     inkscape:window-x="32"
     inkscape:window-y="0"
     inkscape:window-maximized="1"
     inkscape:current-layer="layer2"
     fit-margin-top="0"
     fit-margin-left="0"
     fit-margin-right="0"
     fit-margin-bottom="0"
     inkscape:measure-start="0,0"
     inkscape:measure-end="0,0"
     inkscape:showpageshadow="2"
     inkscape:pagecheckerboard="0"
     inkscape:deskcolor="#d1d1d1" />
  <g
     inkscape:label="text"
     id="layer2"
     inkscape:groupmode="layer">
    <image
       sodipodi:insensitive="true"
       xlink:href="../../img/19/gfx_Pepper-and-Carrot-MINI_by_Nicolas_Artance_E19.png"
       height="3042"
       width="992"
       preserveAspectRatio="none"
       id="image10"
       x="0"
       y="0" />
    <flowRoot
       xml:space="preserve"
       id="flowRoot3682"
       style="font-style:normal;font-variant:normal;font-weight:normal;font-stretch:normal;font-size:40px;line-height:1.25;font-family:Lavi;-inkscape-font-specification:Lavi;letter-spacing:0px;word-spacing:0px;fill:#000000;fill-opacity:1;stroke:none"
       transform="matrix(1.1663727,0,0,1.2391611,0.7955986,35.976788)"
       inkscape:export-xdpi="300"
       inkscape:export-ydpi="300"><flowRegion
         id="flowRegion3684"
         style="font-style:normal;font-variant:normal;font-weight:normal;font-stretch:normal;font-family:Lavi;-inkscape-font-specification:Lavi"><rect
           id="rect3686"
           width="449.13834"
           height="55.157722"
           x="17.29627"
           y="-14.053221"
           style="font-style:normal;font-variant:normal;font-weight:normal;font-stretch:normal;font-family:Lavi;-inkscape-font-specification:Lavi" /></flowRegion><flowPara
         id="flowPara3688"
         style="font-style:normal;font-variant:normal;font-weight:normal;font-stretch:normal;font-family:Lavi;-inkscape-font-specification:Lavi">Pepper &amp; Carrot MINI</flowPara></flowRoot>
    <flowRoot
       xml:space="preserve"
       id="flowRoot3690"
       style="font-style:normal;font-variant:normal;font-weight:normal;font-stretch:normal;font-size:18.6667px;line-height:1.25;font-family:Lavi;-inkscape-font-specification:Lavi;text-align:end;letter-spacing:0px;word-spacing:0px;text-anchor:end;fill:#000000;fill-opacity:1;stroke:none"
       transform="matrix(1.2002711,0,0,1.2122625,-156.30426,8.423348)"><flowRegion
         id="flowRegion3692"
         style="font-style:normal;font-variant:normal;font-weight:normal;font-stretch:normal;font-size:18.6667px;font-family:Lavi;-inkscape-font-specification:Lavi;text-align:end;text-anchor:end"><rect
           id="rect3694"
           width="378.35593"
           height="104.85864"
           x="562.12878"
           y="6.4861007"
           style="font-style:normal;font-variant:normal;font-weight:normal;font-stretch:normal;font-size:18.66666603px;font-family:Lavi;-inkscape-font-specification:Lavi;text-align:end;text-anchor:end" /></flowRegion><flowPara
         id="flowPara3696"
         style="font-style:normal;font-variant:normal;font-weight:normal;font-stretch:normal;font-size:18.6667px;font-family:Lavi;-inkscape-font-specification:Lavi">Von Nicolas Artance</flowPara><flowPara
         style="font-style:normal;font-variant:normal;font-weight:normal;font-stretch:normal;font-size:18.6667px;font-family:Lavi;-inkscape-font-specification:Lavi"
         id="flowPara3700">Basierend auf dem CC-BY Webcomic</flowPara><flowPara
         style="font-style:normal;font-variant:normal;font-weight:normal;font-stretch:normal;font-size:18.6667px;font-family:Lavi;-inkscape-font-specification:Lavi"
         id="flowPara3704">Pepper&amp;Carrot von David Revoy</flowPara></flowRoot>
    <flowRoot
       xml:space="preserve"
       id="flowRoot3706"
       style="font-style:normal;font-variant:normal;font-weight:normal;font-stretch:normal;font-size:40px;line-height:1.25;font-family:Lavi;-inkscape-font-specification:Lavi;text-align:center;letter-spacing:0px;word-spacing:0px;text-anchor:middle;fill:#000000;fill-opacity:1;stroke:none"
       transform="matrix(1.7946554,0,0,2.0343253,-19.588571,-89.20121)"><flowRegion
         id="flowRegion3708"
         style="font-style:normal;font-variant:normal;font-weight:normal;font-stretch:normal;font-family:Lavi;-inkscape-font-specification:Lavi;text-align:center;text-anchor:middle"><rect
           id="rect3710"
           width="281.06439"
           height="82.157288"
           x="153.50441"
           y="79.995255"
           style="font-style:normal;font-variant:normal;font-weight:normal;font-stretch:normal;font-family:Lavi;-inkscape-font-specification:Lavi;text-align:center;text-anchor:middle" /></flowRegion><flowPara
         id="flowPara3712"
         style="font-style:normal;font-variant:normal;font-weight:normal;font-stretch:normal;font-size:14.6667px;font-family:Lavi;-inkscape-font-specification:Lavi;text-align:center;text-anchor:middle">#19 - Zombiah</flowPara></flowRoot>
    <path
       style="color:#000000;display:inline;overflow:visible;visibility:visible;fill:#ffffff;fill-opacity:1;fill-rule:nonzero;stroke:none;stroke-width:0.441282px;marker:none;enable-background:accumulate"
       d="m 408.71622,288.71614 c 1.71468,25.00773 19.7188,35.90857 25.72017,38.47348 6.00135,2.56489 12.00268,24.36653 109.73928,28.85509 59.15635,2.56489 86.59117,-13.46566 92.59255,-14.74815 6.00135,-1.28242 52.07134,-34.04774 41.38237,-61.71395 -7.71606,-19.97129 -16.83096,-27.24815 -32.5999,-30.9666 -18.14346,-4.2785 -129.66712,-5.42681 -154.52998,-0.29701 -24.86284,5.12975 -72.01643,-2.56489 -82.30449,40.39714 z"
       id="path4472"
       inkscape:connector-curvature="0"
       sodipodi:nodetypes="cscssssc" />
    <path
       style="color:#000000;display:inline;overflow:visible;visibility:visible;fill:#ffffff;fill-opacity:1;fill-rule:nonzero;stroke:none;stroke-width:0.26245689px;marker:none;enable-background:accumulate"
       d="m 457.56338,336.35014 c -2.19034,16.17802 -14.92928,30.96749 -19.6058,35.21909 14.78845,-8.8465 26.43119,-20.71459 27.41287,-31.69459 0.9817,-10.98003 -7.80707,-3.5245 -7.80707,-3.5245 z"
       id="path4480"
       inkscape:connector-curvature="0" />
    <text
       xml:space="preserve"
       style="font-style:normal;font-variant:normal;font-weight:normal;font-stretch:normal;font-size:21.3333px;line-height:1.25;font-family:Lavi;-inkscape-font-specification:Lavi;letter-spacing:0px;word-spacing:0px;fill:#000000;fill-opacity:1;stroke:none"
       x="544.1286"
       y="280.63831"
       id="text35"><tspan
         sodipodi:role="line"
         x="544.1286"
         y="280.63831"
         style="font-size:18.6667px;text-align:center;text-anchor:middle"
         id="tspan4">Jetzt können wir von einer</tspan><tspan
         sodipodi:role="line"
         x="544.1286"
         y="307.30493"
         style="font-size:18.6667px;text-align:center;text-anchor:middle"
         id="tspan6">sehr speziellen und seltsamen</tspan><tspan
         sodipodi:role="line"
         x="544.1286"
         y="333.97156"
         style="font-size:18.6667px;text-align:center;text-anchor:middle"
         id="tspan5">Schule sprechen...</tspan></text>
    <path
       style="fill:#ffffff;stroke:none;stroke-width:0.21515264"
       d="m 225.37682,271.74806 c -0.37629,-7.7366 7.90202,-16.93291 21.44829,-18.39265 13.54631,-1.45973 97.45804,-2.91946 104.60746,-1.89766 7.14947,1.02182 15.80404,2.91947 22.95347,5.69296 7.14942,2.77349 12.79373,7.44464 11.66484,11.23995 -1.12884,3.79531 -6.39686,11.53189 -11.28858,13.57552 -4.8917,2.04362 -18.0617,6.86075 -31.23171,7.73658 -13.17001,0.87585 -28.59773,1.60571 -34.61831,1.45974 -6.02058,-0.14598 -36.87602,-1.02181 -36.87602,-1.02181 0,0 -16.55656,0.5839 -21.82458,-0.87584 -5.26799,-1.45974 -18.81428,-3.94129 -22.95342,-10.07216 -4.13915,-6.13087 -1.88144,-2.1896 -1.88144,-7.44463 z"
       id="path3971"
       inkscape:connector-curvature="0" />
    <path
       style="color:#000000;display:inline;overflow:visible;visibility:visible;fill:#ffffff;fill-opacity:1;fill-rule:nonzero;stroke:none;stroke-width:0.28963736px;marker:none;enable-background:accumulate"
       d="m 311.08028,327.63693 c -5.53767,-24.92053 -7.9299,-35.33736 5.1653,-46.31854 13.09515,-10.98124 -4.08049,-10.60468 -4.08049,-10.60468 0,0 -27.57794,11.22845 -1.08481,56.92322 z"
       id="path3984"
       inkscape:connector-curvature="0" />
    <text
       xml:space="preserve"
       style="font-style:normal;font-variant:normal;font-weight:normal;font-stretch:normal;font-size:21.3333px;line-height:1.25;font-family:Lavi;-inkscape-font-specification:Lavi;letter-spacing:0px;word-spacing:0px;fill:#000000;fill-opacity:1;stroke:none"
       x="303.76245"
       y="276.00693"
       id="text49"><tspan
         sodipodi:role="line"
         x="303.76245"
         y="276.00693"
         style="font-size:18.6667px;text-align:center;text-anchor:middle"
         id="tspan5510">Pfiu! Endlich!</tspan></text>
    <path
       id="path58"
       d="m 623.04551,396.49653 c -5.50561,-1.43363 -14.15726,3.53628 -15.44721,3.18584 -1.32138,-0.35044 -9.97298,-1.43363 -11.79772,-3.18584 -1.85618,-1.78407 -7.07865,3.18584 -8.6517,1.75221 -1.57308,-1.40176 1.82474,6.02124 7.33031,6.75398 5.50568,0.70088 11.54614,1.75221 13.37079,3.88672 1.82476,2.13451 1.32138,6.40354 1.32138,6.40354 l -2.10786,1.40177 3.39772,2.83539 c 0,0 -0.50337,3.91859 -2.07634,3.53628 -1.57306,-0.35044 -13.37079,2.8354 -14.44048,3.56814 -1.03817,0.70089 -8.11691,7.42301 -9.68987,7.07257 -1.57307,-0.35045 -6.04047,-1.40177 -6.04047,-1.40177 0,0 4.21572,2.83539 6.04047,3.53628 1.82465,0.70088 14.94375,0.70088 16.51682,0.70088 h 10.47645 c 2.10786,0 5.78872,-3.88672 7.86512,-2.83539 2.10787,1.08318 8.40001,1.08318 8.40001,1.08318 z"
       style="fill:#d6c38d;fill-opacity:1;fill-rule:evenodd;stroke:none;stroke-width:0.39573929"
       inkscape:connector-curvature="0" />
    <path
       id="path60"
       d="m 614.17358,379.51956 9.12362,6.78583 1.35281,10.8 -0.69212,4.61946 -0.91238,2.77168 4.34157,1.9115 0.59775,7.23186 c 0,0 -0.15729,5.03362 0.31462,6.88141 0.44044,1.84778 -0.69215,5.54336 -0.47191,7.70973 0.25168,2.16637 0.69213,5.54336 0,6.78584 -0.66068,1.24247 -6.95281,-17.96814 -9.68989,-21.0584 -1.6045,-3.37699 -3.96407,-34.43891 -3.96407,-34.43891 z"
       style="fill:#6e674b;fill-opacity:1;fill-rule:evenodd;stroke:none;stroke-width:0.39573929"
       inkscape:connector-curvature="0" />
    <path
       id="path62"
       d="m 804.38487,379.77442 c -15.91911,-12.80707 -40.86743,-6.40354 -49.36181,-4.96991 -8.46291,1.43363 -43.51012,4.96991 -48.7955,3.56814 -5.31685,-1.43363 -21.7708,-3.56814 -27.62249,-3.56814 -5.82022,0 -28.62922,3.56814 -32.34157,2.13451 -3.74382,-1.43363 -27.62249,0.70089 -31.86967,2.8354 1.06969,12.10619 3.209,28.51325 3.74382,34.18405 7.95955,-1.40177 21.73934,0.73274 29.69888,2.86725 7.95954,2.13451 27.05619,-5.00177 36.08541,-5.00177 9.0292,0 50.93483,5.00177 62.10337,5.00177 11.13709,0 45.61799,-6.40353 54.64719,-6.40353 2.13933,-12.83893 3.71237,-30.64777 3.71237,-30.64777 z"
       style="fill:#b89f62;fill-opacity:1;fill-rule:evenodd;stroke:none;stroke-width:0.39573929"
       inkscape:connector-curvature="0" />
    <g
       id="g101"
       style="fill:#4d4d4d"
       transform="translate(394.16206,-122.83762)">
      <text
         id="text76"
         y="526.26331"
         x="319.22635"
         style="font-style:normal;font-variant:normal;font-weight:normal;font-stretch:normal;font-size:21.3333px;line-height:1.25;font-family:Lavi;-inkscape-font-specification:Lavi;text-align:center;letter-spacing:0px;word-spacing:0px;text-anchor:middle;fill:#4d4d4d;fill-opacity:1;stroke:none"
         xml:space="preserve"><tspan
           style="font-style:normal;font-variant:normal;font-weight:bold;font-stretch:normal;font-size:24px;font-family:Lavi;-inkscape-font-specification:'Lavi, Bold';font-variant-ligatures:normal;font-variant-caps:normal;font-variant-numeric:normal;font-feature-settings:normal;text-align:center;writing-mode:lr-tb;text-anchor:middle;fill:#4d4d4d"
           y="526.26331"
           x="319.22635"
           id="tspan74"
           sodipodi:role="line">ZOMBIAH.</tspan></text>
    </g>
    <path
       id="path58-7"
       d="m 830.93523,703.55697 c 7.99898,-3.83545 20.56876,9.46076 22.44291,8.52321 1.91982,-0.93755 14.48954,-3.83543 17.14064,-8.52321 2.69681,-4.77299 10.28443,8.52321 12.56989,4.68778 2.28549,-3.75021 -2.65114,16.10887 -10.65007,18.0692 -7.99906,1.87509 -16.77513,4.68777 -19.42612,10.39832 -2.65115,5.71054 -1.9198,17.13165 -1.9198,17.13165 l 3.06246,3.75022 -4.93646,7.58564 c 0,0 0.73132,10.48358 3.01667,9.46076 2.28545,-0.93753 19.42612,7.58569 20.98024,9.54601 1.50834,1.87511 11.7929,19.85909 14.07821,18.92156 2.28548,-0.93759 8.77606,-3.75023 8.77606,-3.75023 0,0 -6.12492,7.58565 -8.77606,9.46077 -2.651,1.8751 -21.71146,1.8751 -23.99693,1.8751 h -15.221 c -3.06246,0 -8.4103,-10.39832 -11.42707,-7.58564 -3.06248,2.89787 -12.20418,2.89787 -12.20418,2.89787 z"
       style="fill:#d6c38d;fill-opacity:1;fill-rule:evenodd;stroke:none;stroke-width:0.78021359"
       inkscape:connector-curvature="0" />
    <path
       id="path60-0"
       d="m 844.83067,658.89534 -13.25552,18.15444 -1.96547,28.89371 1.00557,12.35864 1.32558,7.41519 -6.30777,5.11391 -0.86845,19.34771 c 0,0 0.22851,13.46668 -0.45712,18.41013 -0.63991,4.94346 1.00561,14.83041 0.68563,20.62619 -0.36566,5.79578 -1.00558,14.83038 0,18.15445 0.95988,3.32404 10.10158,-48.07095 14.07824,-56.33845 2.33113,-9.03461 5.75931,-92.13592 5.75931,-92.13592 z"
       style="fill:#6e674b;fill-opacity:1;fill-rule:evenodd;stroke:none;stroke-width:0.78021359"
       inkscape:connector-curvature="0" />
    <path
       id="path62-2"
       d="m 511.33834,657.55424 c 27.9544,-34.66366 71.76431,-17.33184 86.68068,-13.45157 14.86108,3.88027 76.40496,13.45157 85.68623,9.65755 9.33651,-3.88027 38.2301,-9.65755 48.50583,-9.65755 10.22047,0 50.27368,9.65755 56.79267,5.77728 6.57426,-3.88028 48.50584,1.89702 55.964,7.67429 -1.8784,32.76663 -5.63508,77.17402 -6.57424,92.52262 -13.97719,-3.79403 -38.17487,1.98324 -52.15203,7.76051 -13.97719,5.77728 -47.5114,-13.53781 -63.36698,-13.53781 -15.85551,0 -89.44292,13.53781 -109.05519,13.53781 -19.55704,0 -80.10643,-17.33181 -95.96195,-17.33181 -3.75671,-34.74987 -6.51902,-82.95132 -6.51902,-82.95132 z"
       style="fill:#b89f62;fill-opacity:1;fill-rule:evenodd;stroke:none;stroke-width:0.862754"
       inkscape:connector-curvature="0" />
    <text
       xml:space="preserve"
       style="font-style:italic;font-variant:normal;font-weight:normal;font-stretch:normal;font-size:21.3333px;line-height:1;font-family:Lavi;-inkscape-font-specification:'Lavi Italic';text-align:center;letter-spacing:0px;word-spacing:0px;text-anchor:middle;fill:#4d4d4d;fill-opacity:1;stroke:none"
       x="681.35504"
       y="671.72852"
       id="text105"><tspan
         sodipodi:role="line"
         x="681.35504"
         y="671.72852"
         style="font-size:16px;line-height:1;text-align:center;text-anchor:middle;fill:#4d4d4d;fill-opacity:1"
         id="tspan18">Die Magie von Zombiah liegt zwischen den</tspan><tspan
         sodipodi:role="line"
         x="681.35504"
         y="693.06183"
         style="font-size:16px;line-height:1;text-align:center;text-anchor:middle;fill:#4d4d4d;fill-opacity:1"
         id="tspan28">dunklen Mächten des Todes und der </tspan><tspan
         sodipodi:role="line"
         x="681.35504"
         y="714.39514"
         style="font-size:16px;line-height:1;text-align:center;text-anchor:middle;fill:#4d4d4d;fill-opacity:1"
         id="tspan5564">Verwandlung. Sie kann mit dem Tod spielen</tspan><tspan
         sodipodi:role="line"
         x="684.97321"
         y="735.72839"
         style="font-size:16px;line-height:1;text-align:center;text-anchor:middle;fill:#4d4d4d;fill-opacity:1"
         id="tspan27">und im wahrsten Sinne des Wortes recyceln.	</tspan></text>
    <path
       id="path58-7-3"
       d="m 169.55665,977.41467 c -8.2231,-4.8392 -21.14507,11.93679 -23.07173,10.75381 -1.97361,-1.18284 -14.89552,-4.83908 -17.6209,-10.75381 -2.77236,-6.02205 -10.57258,10.75381 -12.92207,5.91473 -2.34953,-4.73176 2.72542,20.3247 10.94847,22.798 8.22318,2.3658 17.24514,5.9146 19.97041,13.1196 2.72543,7.2051 1.97359,21.6153 1.97359,21.6153 l -3.14827,4.7315 5.07477,9.5711 c 0,0 -0.75181,13.227 -3.10119,11.9367 -2.34948,-1.1829 -19.97041,9.5709 -21.56807,12.0441 -1.55061,2.3659 -12.12333,25.0564 -14.47267,23.8734 -2.34951,-1.1827 -9.02195,-4.7315 -9.02195,-4.7315 0,0 6.29653,9.5708 9.02195,11.9368 2.72528,2.3658 22.31979,2.3658 24.66929,2.3658 h 15.64747 c 3.14827,0 8.64595,-13.1196 11.74724,-9.5711 3.14829,3.6565 12.54613,3.6565 12.54613,3.6565 z"
       style="fill:#d6c38d;fill-opacity:1;fill-rule:evenodd;stroke:none;stroke-width:0.88857424"
       inkscape:connector-curvature="0" />
    <path
       id="path60-0-1"
       d="m 155.27188,899.2109 13.62692,25.67632 2.02054,40.86516 -1.03374,17.47909 -1.36272,10.48756 6.4845,7.23267 0.89278,27.3642 c 0,0 -0.23491,19.0461 0.46993,26.0376 0.65784,6.9917 -1.03378,20.9752 -0.70484,29.1724 0.37591,8.1971 1.03376,20.9748 0,25.6764 -0.98677,4.7011 -10.38461,-67.9882 -14.47269,-79.6812 -2.39645,-12.7778 -5.92068,-130.3102 -5.92068,-130.3102 z"
       style="fill:#6e674b;fill-opacity:1;fill-rule:evenodd;stroke:none;stroke-width:0.94078177"
       inkscape:connector-curvature="0" />
    <path
       id="path62-2-6"
       d="m 473.46885,902.35156 c -26.67313,-49.8802 -68.47507,-24.94011 -82.70778,-19.35648 -14.17993,5.58359 -72.903,19.35648 -81.75889,13.89697 -8.9086,-5.58362 -36.47787,-13.89697 -46.28262,-13.89697 -9.75203,0 -47.96946,13.89697 -54.18965,8.31335 -6.27292,-5.58362 -46.28263,2.72977 -53.39895,11.04313 1.7923,47.15041 5.37679,111.05174 6.27293,133.13804 13.33655,-5.4596 36.42516,2.8537 49.76169,11.1671 13.33655,8.3133 45.33376,-19.4807 60.46261,-19.4807 15.12881,0 85.34342,19.4807 104.05678,19.4807 18.66066,0 76.43485,-24.9402 91.56363,-24.9402 3.58454,-50.00413 6.22025,-119.36494 6.22025,-119.36494 z"
       style="fill:#b89f62;fill-opacity:1;fill-rule:evenodd;stroke:none;stroke-width:1.01095"
       inkscape:connector-curvature="0" />
    <text
       xml:space="preserve"
       style="font-style:italic;font-variant:normal;font-weight:normal;font-stretch:normal;font-size:21.3333px;line-height:1;font-family:Lavi;-inkscape-font-specification:'Lavi Italic';text-align:center;letter-spacing:0px;word-spacing:0px;text-anchor:middle;fill:#4d4d4d;fill-opacity:1;stroke:none"
       x="313.35403"
       y="912.51691"
       id="text105-6"><tspan
         sodipodi:role="line"
         x="313.35403"
         y="912.51691"
         style="font-size:16px;line-height:1;text-align:center;text-anchor:middle;fill:#4d4d4d;fill-opacity:1"
         id="tspan37">Ja! Ihre Schülerinnen betreiben</tspan><tspan
         sodipodi:role="line"
         x="313.35403"
         y="933.85022"
         style="font-size:16px;line-height:1;text-align:center;text-anchor:middle;fill:#4d4d4d;fill-opacity:1"
         id="tspan46">„Zombifizierung“, indem sie tote Objekte</tspan><tspan
         sodipodi:role="line"
         x="313.35403"
         y="955.18353"
         style="font-size:16px;line-height:1;text-align:center;text-anchor:middle;fill:#4d4d4d;fill-opacity:1"
         id="tspan47">zum Leben erwecken. Wenn man diesen</tspan><tspan
         sodipodi:role="line"
         x="313.35403"
         y="976.51678"
         style="font-size:16px;line-height:1;text-align:center;text-anchor:middle;fill:#4d4d4d;fill-opacity:1"
         id="tspan40">Zauber auf eine Leiche anwendet, erhält</tspan><tspan
         sodipodi:role="line"
         x="313.35403"
         y="997.8501"
         style="font-size:16px;line-height:1;text-align:center;text-anchor:middle;fill:#4d4d4d;fill-opacity:1"
         id="tspan38">man einen hübschen Zombie ohne Gehirn.</tspan><tspan
         sodipodi:role="line"
         x="313.35403"
         y="1019.1834"
         style="font-size:16px;line-height:1;text-align:center;text-anchor:middle;fill:#4d4d4d;fill-opacity:1"
         id="tspan43">Mit Wiederbelebung hat das nichts zu tun.</tspan></text>
    <path
       id="path58-7-3-1"
       d="m 827.58648,1183.9142 c 7.5815,-5.6757 19.4952,13.9999 21.2715,12.6127 1.8196,-1.3875 13.7333,-5.6758 16.246,-12.6127 2.556,-7.0631 9.7476,12.6127 11.9138,6.9369 2.1662,-5.5495 -2.5128,23.8378 -10.0942,26.7387 -7.5816,2.7747 -15.8995,6.937 -18.4122,15.3873 -2.5127,8.4507 -1.8196,25.3516 -1.8196,25.3516 l 2.9026,5.5494 -4.6787,11.2254 c 0,0 0.6931,15.5135 2.8592,13.9999 2.1661,-1.3872 18.4121,11.2252 19.8851,14.1262 1.4296,2.7748 11.1774,29.3874 13.3434,28 2.1662,-1.3874 8.318,-5.5494 8.318,-5.5494 0,0 -5.8052,11.2251 -8.318,13.9999 -2.5126,2.7748 -20.5782,2.7748 -22.7444,2.7748 h -14.4265 c -2.9026,0 -7.9713,-15.3875 -10.8306,-11.2253 -2.9027,4.2884 -11.5672,4.2884 -11.5672,4.2884 z"
       style="fill:#d6c38d;fill-opacity:1;fill-rule:evenodd;stroke:none;stroke-width:0.92400444"
       inkscape:connector-curvature="0" />
    <path
       id="path60-0-1-8"
       d="m 840.75668,1133.1346 -12.5637,25.3273 -1.8629,40.3096 0.9531,17.2417 1.2564,10.3448 -5.9785,7.1346 -0.8231,26.9918 c 0,0 0.2165,18.7873 -0.4333,25.684 -0.6065,6.8966 0.9531,20.69 0.6498,28.7758 -0.3465,8.0857 -0.9531,20.6897 0,25.3273 0.9098,4.6373 9.5744,-67.0641 13.3435,-78.5979 2.2094,-12.6043 5.4587,-128.539 5.4587,-128.539 z"
       style="fill:#6e674b;fill-opacity:1;fill-rule:evenodd;stroke:none;stroke-width:0.89717215"
       inkscape:connector-curvature="0" />
    <path
       id="path62-2-6-0"
       d="m 527.79723,1131.0564 c 26.25414,-48.9359 67.39946,-24.4679 81.40862,-18.99 13.9572,5.478 71.75785,18.99 80.47462,13.634 8.76867,-5.478 35.9049,-13.634 45.55563,-13.634 9.59884,0 47.21601,13.634 53.33845,8.156 6.17439,-5.4779 45.55561,2.6783 52.56016,10.834 -1.7641,46.2578 -5.2923,108.9491 -6.17441,130.6172 -13.12711,-5.3561 -35.85301,2.7995 -48.98,10.9556 -13.12712,8.156 -44.6217,-19.1118 -59.51291,-19.1118 -14.89116,0 -84.00285,19.1118 -102.42227,19.1118 -18.36753,0 -75.2342,-24.4678 -90.12535,-24.4678 -3.52824,-49.0575 -6.12254,-117.105 -6.12254,-117.105 z"
       style="fill:#b89f62;fill-opacity:1;fill-rule:evenodd;stroke:none;stroke-width:0.993429"
       inkscape:connector-curvature="0" />
    <text
       xml:space="preserve"
       style="font-style:italic;font-variant:normal;font-weight:normal;font-stretch:normal;font-size:21.3333px;line-height:1;font-family:Lavi;-inkscape-font-specification:'Lavi Italic';text-align:center;letter-spacing:0px;word-spacing:0px;text-anchor:middle;fill:#4d4d4d;fill-opacity:1;stroke:none"
       x="687.63153"
       y="1140.5532"
       id="text105-6-7"><tspan
         sodipodi:role="line"
         x="687.63153"
         y="1140.5532"
         style="font-size:16px;line-height:1;text-align:center;text-anchor:middle;fill:#4d4d4d;fill-opacity:1"
         id="tspan5648">Diese Magie wird in der Technik sehr</tspan><tspan
         sodipodi:role="line"
         x="687.63153"
         y="1161.8865"
         style="font-size:16px;line-height:1;text-align:center;text-anchor:middle;fill:#4d4d4d;fill-opacity:1"
         id="tspan49">häufig eingesetzt, um viele komplizierte</tspan><tspan
         sodipodi:role="line"
         x="687.63153"
         y="1183.2198"
         style="font-size:16px;line-height:1;text-align:center;text-anchor:middle;fill:#4d4d4d;fill-opacity:1"
         id="tspan50">Maschinen herzustellen, die für uns </tspan><tspan
         sodipodi:role="line"
         x="687.63153"
         y="1204.5531"
         style="font-size:16px;line-height:1;text-align:center;text-anchor:middle;fill:#4d4d4d;fill-opacity:1"
         id="tspan51">arbeiten. Da kann man auch gleich mit</tspan><tspan
         sodipodi:role="line"
         x="687.63153"
         y="1225.8865"
         style="font-size:16px;line-height:1;text-align:center;text-anchor:middle;fill:#4d4d4d;fill-opacity:1"
         id="tspan5678">der Magie aufhören und die hirnlosen</tspan><tspan
         sodipodi:role="line"
         x="687.63153"
         y="1247.2197"
         style="font-size:16px;line-height:1;text-align:center;text-anchor:middle;fill:#4d4d4d;fill-opacity:1"
         id="tspan58">Zombies machen lassen, was sie wollen...</tspan></text>
    <path
       id="path58-7-3-1-7"
       d="m 170.93994,1376.1199 c -7.03051,-5.5456 -18.07836,13.679 -19.72557,12.3235 -1.68735,-1.3556 -12.73521,-5.5456 -15.06529,-12.3235 -2.37024,-6.9013 -9.03918,12.3235 -11.04795,6.7779 -2.00877,-5.4223 2.33018,23.2914 9.36059,26.1259 7.03059,2.7111 14.74398,6.778 17.07406,15.0346 2.33009,8.2569 1.68736,24.7705 1.68736,24.7705 l -2.69165,5.4222 4.33867,10.9682 c 0,0 -0.64273,15.158 -2.6514,13.679 -2.00868,-1.3554 -17.07398,10.968 -18.43992,13.8025 -1.3257,2.7112 -10.36507,28.7138 -12.37365,27.3583 -2.00877,-1.3556 -7.71348,-5.4223 -7.71348,-5.4223 0,0 5.3833,10.9679 7.71348,13.6791 2.32999,2.7112 19.08265,2.7112 21.09142,2.7112 h 13.37803 c 2.69165,0 7.39197,-15.0348 10.04347,-10.968 2.69174,4.1902 10.72654,4.1902 10.72654,4.1902 z"
       style="fill:#d6c38d;fill-opacity:1;fill-rule:evenodd;stroke:none;stroke-width:0.87953907"
       inkscape:connector-curvature="0" />
    <path
       id="path60-0-1-8-2"
       d="m 158.7269,1313.1697 11.65061,29.9657 1.72752,47.6915 -0.88384,20.3992 -1.16509,12.2392 5.54401,8.441 0.76328,31.9351 c 0,0 -0.20077,22.2279 0.40181,30.3874 0.56242,8.1597 -0.88383,24.479 -0.60258,34.0456 0.32132,9.5665 0.88383,-5.4867 0,0 -0.1339,-12.9678 -8.87856,-49.38 -12.37374,-63.0262 -2.04883,-14.9123 -5.06198,-152.0785 -5.06198,-152.0785 z"
       style="fill:#6e674b;fill-opacity:1;fill-rule:evenodd;stroke:none;stroke-width:0.93974036"
       inkscape:connector-curvature="0"
       sodipodi:nodetypes="cccccccccccc" />
    <path
       id="path62-2-6-0-3"
       d="m 503.019,1316.5134 c -28.98683,-58.184 -74.41481,-29.092 -89.88211,-22.5789 -15.40996,6.5135 -79.22687,22.5789 -88.85095,16.2107 -9.68133,-6.5131 -39.6421,-16.2107 -50.29732,-16.2107 -10.59796,0 -52.13055,16.2107 -58.89024,9.6976 -6.81709,-6.5135 -50.29733,3.1842 -58.03097,12.8813 1.94773,54.9998 5.84316,129.5387 6.8171,155.3017 14.49344,-6.3683 39.58481,3.3289 54.07812,13.0262 14.49347,9.6973 49.26621,-22.7237 65.70742,-22.7237 16.44109,0 92.74638,22.7237 113.08297,22.7237 20.27937,0 83.06506,-29.092 99.50619,-29.092 3.89546,-58.3284 6.75979,-139.2359 6.75979,-139.2359 z"
       style="fill:#b89f62;fill-opacity:1;fill-rule:evenodd;stroke:none;stroke-width:1.13822"
       inkscape:connector-curvature="0" />
    <text
       xml:space="preserve"
       style="font-style:italic;font-variant:normal;font-weight:normal;font-stretch:normal;font-size:21.3333px;line-height:1;font-family:Lavi;-inkscape-font-specification:'Lavi Italic';text-align:center;letter-spacing:0px;word-spacing:0px;text-anchor:middle;fill:#4d4d4d;fill-opacity:1;stroke:none"
       x="329.73843"
       y="1328.2429"
       id="text105-6-7-0"><tspan
         sodipodi:role="line"
         x="329.73843"
         y="1328.2429"
         style="font-size:16px;line-height:1;text-align:center;text-anchor:middle;fill:#4d4d4d;fill-opacity:1"
         id="tspan5695">Diese Schule wurde von der berühmten</tspan><tspan
         sodipodi:role="line"
         x="329.73843"
         y="1349.5762"
         style="font-size:16px;line-height:1;text-align:center;text-anchor:middle;fill:#4d4d4d;fill-opacity:1"
         id="tspan20">Ingenieur-Hexe Apiaceae gegründet. Im großen</tspan><tspan
         sodipodi:role="line"
         x="329.73843"
         y="1370.9095"
         style="font-size:16px;line-height:1;text-align:center;text-anchor:middle;fill:#4d4d4d;fill-opacity:1"
         id="tspan5722">Krieg spielte sie eine wichtige Rolle. Der heutige</tspan><tspan
         sodipodi:role="line"
         x="329.73843"
         y="1392.2428"
         style="font-size:16px;line-height:1;text-align:center;text-anchor:middle;fill:#4d4d4d;fill-opacity:1"
         id="tspan30">Meister ist ein mysteriöser Soumbala,</tspan><tspan
         sodipodi:role="line"
         x="329.73843"
         y="1413.5762"
         style="font-size:16px;line-height:1;text-align:center;text-anchor:middle;fill:#4d4d4d;fill-opacity:1"
         id="tspan23">der sich selten draußen zeigt. Er muss wohl</tspan><tspan
         sodipodi:role="line"
         x="329.73843"
         y="1434.9094"
         style="font-size:16px;line-height:1;text-align:center;text-anchor:middle;fill:#4d4d4d;fill-opacity:1"
         id="tspan25">damit beschäftigt sein, weitere hirnlose</tspan><tspan
         sodipodi:role="line"
         x="329.73843"
         y="1456.2427"
         style="font-size:16px;line-height:1;text-align:center;text-anchor:middle;fill:#4d4d4d;fill-opacity:1"
         id="tspan22">Zombies zu erschaffen, so wie Coriander...</tspan></text>
    <text
       xml:space="preserve"
       style="font-style:italic;font-variant:normal;font-weight:normal;font-stretch:normal;font-size:21.3333px;line-height:1.25;font-family:Lavi;-inkscape-font-specification:'Lavi Italic';letter-spacing:0px;word-spacing:0px;fill:#000000;fill-opacity:1;stroke:none"
       x="511.05029"
       y="1607.9447"
       id="text354" />
    <text
       xml:space="preserve"
       style="font-style:normal;font-variant:normal;font-weight:normal;font-stretch:normal;font-size:18.6667px;line-height:1.25;font-family:Lavi;-inkscape-font-specification:Lavi;letter-spacing:0px;word-spacing:0px;fill:#000000;fill-opacity:1;stroke:none"
       x="38.993668"
       y="2966.2625"
       id="text3929"><tspan
         sodipodi:role="line"
         x="38.993668"
         y="2966.2625"
         id="tspan3931"
         style="font-size:16px;text-align:start;text-anchor:start">Hintergrundbild von Ausschnitt 1, 3, 4 und 5: „<tspan
   style="font-style:italic;font-variant:normal;font-weight:normal;font-stretch:normal;font-family:Lavi;-inkscape-font-specification:'Lavi Italic'"
   id="tspan3950">The &quot;Chaos &amp; Evolutions&quot; impossible triangle</tspan>“ von David Revoy (Lizenz CC-BY 4.0). </tspan><tspan
         sodipodi:role="line"
         x="38.993668"
         y="2989.5957"
         style="font-size:16px;text-align:start;text-anchor:start"
         id="tspan3935">Referenz: https://www.peppercarrot.com/de/wiki/Magic-System.html</tspan></text>
    <path
       style="color:#000000;display:inline;overflow:visible;visibility:visible;fill:#ffffff;fill-opacity:1;fill-rule:nonzero;stroke:none;stroke-width:0.439332px;marker:none;enable-background:accumulate"
       d="m 358.81107,1613.2276 c 1.56086,-27.2296 17.94992,-39.0988 23.41293,-41.892 5.46303,-2.7924 10.92602,-26.5314 99.8952,-31.4186 53.84972,-2.7932 78.82351,14.662 84.28652,16.0583 5.46301,1.396 47.40031,37.0729 37.67019,67.1973 -7.0239,21.7459 -15.32115,29.6693 -29.67555,33.7182 -16.51589,4.6588 -118.03535,5.9091 -140.66789,0.3233 -22.63254,-5.5853 -65.55623,2.7931 -74.9214,-43.9865 z"
       id="path4472-9"
       inkscape:connector-curvature="0"
       sodipodi:nodetypes="cscssssc" />
    <path
       style="color:#000000;display:inline;overflow:visible;visibility:visible;fill:#ffffff;fill-opacity:1;fill-rule:nonzero;stroke:none;stroke-width:0.26245689px;marker:none;enable-background:accumulate"
       d="m 416.40833,1648.3624 c -6.04412,15.1656 -21.9863,26.4286 -27.5535,29.4208 16.491,-5.0006 30.66197,-13.6949 34.27425,-24.11 3.61228,-10.4152 -6.72075,-5.3108 -6.72075,-5.3108 z"
       id="path4480-1"
       inkscape:connector-curvature="0" />
    <text
       xml:space="preserve"
       style="font-style:normal;font-variant:normal;font-weight:normal;font-stretch:normal;font-size:18.6667px;line-height:1.25;font-family:Lavi;-inkscape-font-specification:'Lavi, Normal';font-variant-ligatures:normal;font-variant-caps:normal;font-variant-numeric:normal;font-feature-settings:normal;text-align:center;letter-spacing:0px;word-spacing:0px;writing-mode:lr-tb;text-anchor:middle;fill:#000000;fill-opacity:1;stroke:none"
       x="482.47446"
       y="1576.1362"
       id="text302"><tspan
         sodipodi:role="line"
         x="482.47446"
         y="1576.1362"
         id="tspan5790">... und deinem Gesicht</tspan><tspan
         sodipodi:role="line"
         x="482.47446"
         y="1599.4696"
         id="tspan11">nach zu urteilen, wirst du</tspan><tspan
         sodipodi:role="line"
         x="482.47446"
         y="1622.803"
         id="tspan12">mich mit diesem Roboter</tspan><tspan
         sodipodi:role="line"
         x="482.47446"
         y="1646.1364"
         id="tspan9">schlagen, nicht wahr?</tspan></text>
    <text
       xml:space="preserve"
       style="font-style:normal;font-variant:normal;font-weight:normal;font-stretch:normal;line-height:0%;font-family:Lavi;-inkscape-font-specification:Lavi;letter-spacing:0px;word-spacing:0px;fill:#000000;fill-opacity:1;stroke:#000000;stroke-width:0.992362;stroke-miterlimit:4;stroke-dasharray:none;stroke-opacity:1;filter:url(#filter4375-4-1-1-1-9-5-2)"
       x="787.65729"
       y="0"
       id="text4580-6-6"
       transform="matrix(0.34701669,-0.14755694,-0.05330596,0.37401349,574.67911,1156.387)"><tspan
         sodipodi:role="line"
         id="tspan4582-1-9"
         x="0"
         y="0"
         style="font-size:70px;fill:#000000"><tspan
           style="font-size:114.732px"
           id="tspan4313-4" /></tspan></text>
    <text
       xml:space="preserve"
       style="font-style:normal;font-variant:normal;font-weight:normal;font-stretch:normal;line-height:0%;font-family:Lavi;-inkscape-font-specification:Lavi;letter-spacing:0px;word-spacing:0px;fill:#000000;fill-opacity:1;stroke:#000000;stroke-width:0.992362;stroke-miterlimit:4;stroke-dasharray:none;stroke-opacity:1;filter:url(#filter4375-4-1-1-1-9-5-2-0)"
       x="787.65729"
       y="1584.5073"
       id="text4580-6-6-9"
       transform="matrix(0.17672113,-0.09075352,-0.0271465,0.23003352,471.78886,1325.1649)" />
    <text
       xml:space="preserve"
       style="font-style:normal;font-variant:normal;font-weight:normal;font-stretch:normal;line-height:0%;font-family:Lavi;-inkscape-font-specification:Lavi;letter-spacing:0px;word-spacing:0px;fill:#000000;fill-opacity:1;stroke:#000000;stroke-width:0.992362;stroke-miterlimit:4;stroke-dasharray:none;stroke-opacity:1;filter:url(#filter4375-4-1-1-1-9-5-2-03)"
       x="787.65729"
       y="1584.5073"
       id="text4580-6-6-99"
       transform="matrix(0.34701669,-0.14755694,-0.05330596,0.37401349,276.63683,1781.1348)"><tspan
         sodipodi:role="line"
         id="tspan4582-1-9-1"
         x="787.65729"
         y="1584.5073"
         style="font-size:70px;fill:#000000">?!<tspan
   style="font-size:114.732px"
   id="tspan4313-4-5" /></tspan></text>
    <path
       style="color:#000000;display:inline;overflow:visible;visibility:visible;fill:#ffffff;fill-opacity:1;fill-rule:nonzero;stroke:none;stroke-width:0.19923046;stroke-miterlimit:4;stroke-dasharray:none;marker:none;enable-background:accumulate"
       d="m 566.96462,2498.4777 c -1.64042,-12.5379 -7.75479,-20.0166 -11.18477,-22.6562 -3.43,-2.6396 -43.09863,-5.7189 -51.74819,-6.1587 -8.64955,-0.4401 -33.70342,-0.66 -44.58993,7.0387 -10.88652,7.6986 -14.91301,18.0369 -15.06215,23.9759 -0.14914,5.9391 3.87737,21.7764 24.45736,26.6156 20.57995,4.8393 41.23577,6.7838 49.13966,5.9039 7.90392,-0.8797 34.89144,-2.5816 42.34795,-12.9198 7.45652,-10.3382 6.49094,-14.3205 6.64007,-21.7994 z"
       id="path5909-8"
       inkscape:connector-curvature="0"
       sodipodi:nodetypes="csssssssc" />
    <text
       xml:space="preserve"
       style="font-style:normal;font-variant:normal;font-weight:normal;font-stretch:normal;font-size:18.6667px;line-height:1.25;font-family:Lavi;-inkscape-font-specification:'Lavi, Normal';font-variant-ligatures:normal;font-variant-caps:normal;font-variant-numeric:normal;font-feature-settings:normal;text-align:center;letter-spacing:0px;word-spacing:0px;writing-mode:lr-tb;text-anchor:middle;fill:#000000;fill-opacity:1;stroke:none"
       x="508.85242"
       y="2495.1743"
       id="text1165"><tspan
         sodipodi:role="line"
         x="508.85242"
         y="2495.1743"
         id="tspan5810">Nein, mit</tspan><tspan
         sodipodi:role="line"
         x="508.85242"
         y="2518.5078"
         id="tspan14">dem da!</tspan></text>
    <path
       style="display:inline;fill:#ffffff;stroke:none;stroke-width:0.34421474"
       d="m 539.3281,2561.6234 c -14.34533,-4.4065 -25.06944,-15.8473 -15.76438,-27.355 5.638,-6.9726 10.18254,-10.731 10.18254,-10.731 l -11.95795,0.027 -7.02136,7.6197 c 0,0 -10.77983,22.1152 24.56115,30.4394 z"
       id="path3063-1-9"
       inkscape:connector-curvature="0"
       sodipodi:nodetypes="cscccc" />
    <g
       transform="matrix(0.60856709,0,0,0.46221338,87.342282,105.31885)"
       id="g975">
      <path
         inkscape:connector-curvature="0"
         id="path101"
         d="m 524.22751,191.63146 c -3.54348,-0.0348 -7.29462,0.1157 -11.15995,0.53804 0,0 -30.0934,62.27058 -34.39246,76.5103 11.46417,0 17.19658,2.58826 28.66075,3.88278 11.46419,1.29452 32.95953,-2.58907 41.55766,-3.23633 8.59813,-0.64726 15.76193,2.58904 44.42238,0 -2.86603,0.64726 -12.18043,-6.47148 -16.47949,-9.06051 -4.29907,-2.58904 -2.86564,-7.7685 -5.73169,-13.59384 -7.1651,4.53081 -12.18133,-3e-5 -15.76388,-3.23633 -3.58256,-3.2363 0,-6.73429 0,-6.73429 l 12.77953,-8.85507 c -3.1956,-18.67125 -9.78598,-23.87711 1.97813,-29.67315 l 19.34646,-0.64645 10.74778,-5.82622 -16.48174,0.64645 c -12.78626,1.01278 -21.80405,1.84038 -32.66837,1.29495 0,0 -11.46004,-1.8597 -26.81511,-2.01033 z m 14.40511,17.99219 c 0,0 11.92148,1.46891 13.54683,3.42659 1.62535,1.95768 4.33226,0.4895 6.4994,1.95776 2.16714,1.46826 4.87786,9.7878 2.71073,10.76663 -2.16714,0.97885 -5.41927,3.42554 -7.58642,2.44669 -2.16713,-0.97883 -4.87568,-5.87327 -4.87568,-5.87327 -0.54179,-4.40479 0,-6.85113 0,-6.85113 z"
         style="fill:url(#linearGradient966);fill-opacity:1;fill-rule:evenodd;stroke:none;stroke-width:0.99999994px;stroke-linecap:butt;stroke-linejoin:miter;stroke-opacity:1"
         sodipodi:nodetypes="cccsscscccccccccccssccccc" />
      <path
         inkscape:connector-curvature="0"
         id="path958"
         d="m 479.1379,267.64029 c 0,0 8.1984,-5.23752 15.06909,-6.63932 6.87069,-1.40181 24.66762,-6.18478 30.68906,-7.94356 6.02146,-1.75878 6.02146,-1.75878 6.02146,-1.75878 l -4.64731,-30.01543 -8.70287,-22.89613 -30.68908,2.80361 -5.49655,49.06313 z"
         style="fill:#6c6753;fill-rule:evenodd;stroke:#6c6753;stroke-width:1px;stroke-linecap:butt;stroke-linejoin:miter;stroke-opacity:1" />
      <path
         inkscape:connector-curvature="0"
         id="path99"
         d="m 541.89921,152.34375 c -0.14714,0.0194 -0.29648,0.0584 -0.44937,0.11719 -4.89222,1.87969 -40.11706,-0.93945 -46.96617,3.75976 -6.84911,4.69921 -102.98621,-0.94062 -119.61976,-2.82031 -16.63354,-1.87968 -98.82297,7.8e-4 -112.52117,2.82031 -13.69822,2.81953 -48.9227,6.57969 -91.97424,2.82032 l 2.93411,9.39843 0.98007,7.51758 -3.91418,7.51953 h 2.93411 l 15.65675,5.63867 v 8.45899 l -6.85034,6.57812 -10.76248,1.88086 c 0,16.44857 -8.57201,31.59947 -15.89192,50.34227 18.59043,-1.87969 21.76302,-3.75937 44.26723,-4.69922 22.50421,-0.93984 93.93032,10.33789 108.60698,10.33789 14.67666,0 46.9658,-2.81915 67.51312,-5.63867 20.54732,-2.81953 105.92276,1.14917 116.68564,0.20932 10.76288,-0.93985 24.46114,-7.51873 39.1378,-4.69921 l 10.76249,-41.15316 c 0,-4.69921 4.89223,-6.58008 4.89223,-6.58008 l -4.89223,-9.39843 c 0,0 3.91378,-12.21799 4.89223,-18.79688 0.94786,-6.37331 -0.85928,-24.21344 -5.4209,-23.61328 z m -352.27346,74.98942 c 1.88302,0.02 3.3984,0.6712 3.61122,2.30664 0.48646,3.73815 2.43327,8.87803 -0.97194,11.68164 -3.40522,2.80361 -12.16143,-0.46687 -12.16143,-2.33594 0,-1.86907 2.43188,-9.3457 2.43188,-9.3457 1.64181,-1.31419 4.66925,-2.33231 7.09027,-2.30664 z"
         style="fill:url(#radialGradient932);fill-opacity:1;fill-rule:evenodd;stroke:none;stroke-width:0.99999994px;stroke-linecap:butt;stroke-linejoin:miter;stroke-opacity:1"
         sodipodi:nodetypes="ccsssccccccccccsssscccccccccscc" />
      <path
         inkscape:connector-curvature="0"
         id="path111"
         d="m 515.27248,172.97336 c 7.29689,-4.20541 14.59379,-4.20541 16.05316,0.93454 1.45939,5.13994 4.8646,8.87808 0.48646,10.74716 -4.37813,1.86907 -10.7021,9.81262 -13.62086,4.20541 -2.91876,-5.60722 -9.72919,-8.41082 -8.75627,-9.81263 0.97291,-1.4018 5.83751,-6.07448 5.83751,-6.07448 z"
         style="opacity:0.53299997;vector-effect:none;fill:#cbc29a;fill-opacity:1;fill-rule:evenodd;stroke:none;stroke-width:0.99999994px;stroke-linecap:butt;stroke-linejoin:miter;stroke-miterlimit:4;stroke-dasharray:none;stroke-dashoffset:0;stroke-opacity:1" />
      <path
         inkscape:connector-curvature="0"
         id="path113"
         d="m 508.02036,204.75351 c 4.8646,-2.80361 8.75627,0 8.75627,3.27087 0,3.27088 2.4323,6.54175 -2.91875,6.54175 -5.35106,0 -9.72919,0.46727 -9.72919,-3.27087 0,-3.73814 3.89167,-6.54175 3.89167,-6.54175 z"
         style="opacity:0.53299997;vector-effect:none;fill:#cbc29a;fill-opacity:1;fill-rule:evenodd;stroke:none;stroke-width:0.99999994px;stroke-linecap:butt;stroke-linejoin:miter;stroke-miterlimit:4;stroke-dasharray:none;stroke-dashoffset:0;stroke-opacity:1" />
      <path
         inkscape:connector-curvature="0"
         id="path115"
         d="m 487.65472,226.68348 c 3.40522,-6.07449 6.81043,-4.67268 6.81043,-4.67268 l 4.37813,4.67268 -5.35104,5.60721 z"
         style="opacity:0.53299997;vector-effect:none;fill:#cbc29a;fill-opacity:1;fill-rule:evenodd;stroke:none;stroke-width:0.99999994px;stroke-linecap:butt;stroke-linejoin:miter;stroke-miterlimit:4;stroke-dasharray:none;stroke-dashoffset:0;stroke-opacity:1" />
    </g>
    <text
       xml:space="preserve"
       style="font-style:normal;font-variant:normal;font-weight:normal;font-stretch:normal;font-size:21.3333px;line-height:1.25;font-family:Lavi;-inkscape-font-specification:Lavi;letter-spacing:0px;word-spacing:0px;fill:#000000;fill-opacity:1;stroke:none"
       x="311.29895"
       y="205.31169"
       id="text49-0"><tspan
         sodipodi:role="line"
         x="311.29895"
         y="205.31169"
         style="font-size:18.6667px;text-align:center;text-anchor:middle"
         id="tspan982-5">Zwei Monate später...</tspan></text>
    <text
       xml:space="preserve"
       style="font-style:normal;font-variant:normal;font-weight:normal;font-stretch:normal;line-height:0%;font-family:Lavi;-inkscape-font-specification:Lavi;letter-spacing:0px;word-spacing:0px;fill:#000000;fill-opacity:1;stroke:#000000;stroke-width:0.992362;stroke-miterlimit:4;stroke-dasharray:none;stroke-opacity:1;filter:url(#filter4375-4-1-1-1-9)"
       x="787.65729"
       y="1584.5073"
       id="text4580"
       transform="matrix(0.51284192,-0.24788815,-0.09467818,0.65685749,-126.10452,1307.7186)"><tspan
         sodipodi:role="line"
         id="tspan4582"
         x="787.65729"
         y="1584.5073"
         style="font-size:70px;fill:#ffffff">ZBAFF!</tspan></text>
    <text
       xml:space="preserve"
       style="font-style:normal;font-variant:normal;font-weight:normal;font-stretch:normal;line-height:0%;font-family:Lavi;-inkscape-font-specification:Lavi;letter-spacing:0px;word-spacing:0px;fill:#000000;fill-opacity:1;stroke:#000000;stroke-width:0;stroke-linecap:square;stroke-miterlimit:4;stroke-dasharray:none;stroke-opacity:1;filter:url(#filter4375-4-1-1-1-9-3)"
       x="787.65729"
       y="1584.5073"
       id="text4580-2"
       transform="matrix(0.19604004,-0.11664874,0.07339428,0.2736431,331.15966,2005.1655)"><tspan
         sodipodi:role="line"
         id="tspan4582-9"
         x="787.65729"
         y="1584.5073"
         style="font-style:normal;font-variant:normal;font-weight:normal;font-stretch:normal;font-size:70px;line-height:1.25;font-family:ComicSpice;-inkscape-font-specification:ComicSpice;fill:#ffffff;stroke-width:0;stroke-linecap:square;stroke-miterlimit:4;stroke-dasharray:none">G</tspan></text>
    <text
       xml:space="preserve"
       style="font-style:normal;font-variant:normal;font-weight:normal;font-stretch:normal;line-height:0%;font-family:Lavi;-inkscape-font-specification:Lavi;letter-spacing:0px;word-spacing:0px;fill:#000000;fill-opacity:1;stroke:#000000;stroke-width:0;stroke-linecap:square;stroke-miterlimit:4;stroke-dasharray:none;stroke-opacity:1;filter:url(#filter4375-4-1-1-1-9-30)"
       x="787.65729"
       y="1584.5073"
       id="text4580-9-1"
       transform="matrix(0.17271836,-0.10340664,0.0646531,0.24256183,372.70862,2040.9587)"><tspan
         sodipodi:role="line"
         id="tspan4582-26"
         x="787.65729"
         y="1584.5073"
         style="font-style:normal;font-variant:normal;font-weight:normal;font-stretch:normal;font-size:70px;line-height:1.25;font-family:ComicSpice;-inkscape-font-specification:ComicSpice;fill:#ffffff;stroke-width:0;stroke-linecap:square;stroke-miterlimit:4;stroke-dasharray:none">Z</tspan></text>
    <text
       xml:space="preserve"
       style="font-style:normal;font-variant:normal;font-weight:normal;font-stretch:normal;line-height:0%;font-family:Lavi;-inkscape-font-specification:Lavi;letter-spacing:0px;word-spacing:0px;fill:#000000;fill-opacity:1;stroke:#000000;stroke-width:0;stroke-linecap:square;stroke-miterlimit:4;stroke-dasharray:none;stroke-opacity:1;filter:url(#filter4375-4-1-1-1-9-30-2)"
       x="787.65729"
       y="1584.5073"
       id="text4580-9-9"
       transform="matrix(0.16320657,-0.09088318,0.05321749,0.22557144,405.52575,2056.6301)"><tspan
         sodipodi:role="line"
         id="tspan4582-26-1"
         x="787.65729"
         y="1584.5073"
         style="font-style:normal;font-variant:normal;font-weight:normal;font-stretch:normal;font-size:70px;line-height:1.25;font-family:ComicSpice;-inkscape-font-specification:ComicSpice;fill:#ffffff;stroke-width:0;stroke-linecap:square;stroke-miterlimit:4;stroke-dasharray:none">Z</tspan></text>
    <text
       xml:space="preserve"
       style="font-style:normal;font-variant:normal;font-weight:normal;font-stretch:normal;line-height:0%;font-family:Lavi;-inkscape-font-specification:Lavi;letter-spacing:0px;word-spacing:0px;fill:#000000;fill-opacity:1;stroke:#000000;stroke-width:0;stroke-linecap:square;stroke-miterlimit:4;stroke-dasharray:none;stroke-opacity:1;filter:url(#filter4375-4-1-1-1-9-30-2-7)"
       x="787.65729"
       y="1584.5073"
       id="text4580-9-9-6"
       transform="matrix(0.13498819,-0.07748742,0.04397888,0.19225484,449.96104,2096.8817)"><tspan
         sodipodi:role="line"
         id="tspan4582-26-1-5"
         x="787.65729"
         y="1584.5073"
         style="font-style:normal;font-variant:normal;font-weight:normal;font-stretch:normal;font-size:70px;line-height:1.25;font-family:ComicSpice;-inkscape-font-specification:ComicSpice;fill:#ffffff;stroke-width:0;stroke-linecap:square;stroke-miterlimit:4;stroke-dasharray:none">T</tspan></text>
    <text
       xml:space="preserve"
       style="font-style:normal;font-variant:normal;font-weight:normal;font-stretch:normal;line-height:0%;font-family:Lavi;-inkscape-font-specification:Lavi;letter-spacing:0px;word-spacing:0px;fill:#000000;fill-opacity:1;stroke:#000000;stroke-width:0;stroke-linecap:square;stroke-miterlimit:4;stroke-dasharray:none;stroke-opacity:1;filter:url(#filter4375-4-1-1-1-9-30-2-7-6)"
       x="787.65729"
       y="1584.5073"
       id="text4580-9-9-6-8"
       transform="matrix(0.20825312,-0.07637993,0.00862319,0.29148718,451.08349,1937.4791)"><tspan
         sodipodi:role="line"
         id="tspan4582-26-1-5-8"
         x="787.65729"
         y="1584.5073"
         style="font-style:normal;font-variant:normal;font-weight:normal;font-stretch:normal;font-size:70px;line-height:1.25;font-family:ComicSpice;-inkscape-font-specification:ComicSpice;fill:#ffffff;stroke-width:0;stroke-linecap:square;stroke-miterlimit:4;stroke-dasharray:none"> !</tspan></text>
    <text
       xml:space="preserve"
       style="font-style:normal;font-variant:normal;font-weight:normal;font-stretch:normal;line-height:0%;font-family:Lavi;-inkscape-font-specification:Lavi;letter-spacing:0px;word-spacing:0px;fill:#000000;fill-opacity:1;stroke:#000000;stroke-width:0.992362;stroke-miterlimit:4;stroke-dasharray:none;stroke-opacity:1;filter:url(#filter4375-4-1-1-1-9-5-2-03-9)"
       x="787.65729"
       y="1584.5073"
       id="text4580-6-6-99-8"
       transform="matrix(0.1469486,-0.06860126,-0.02257308,0.17388403,519.16609,2055.0888)"><tspan
         sodipodi:role="line"
         id="tspan4582-1-9-1-0"
         x="787.65729"
         y="1584.5073"
         style="font-size:70px;fill:#000000">Klick!</tspan></text>
    <text
       xml:space="preserve"
       style="font-style:normal;font-variant:normal;font-weight:normal;font-stretch:normal;line-height:0%;font-family:Lavi;-inkscape-font-specification:Lavi;letter-spacing:0px;word-spacing:0px;fill:#000000;fill-opacity:1;stroke:#000000;stroke-width:0.992362;stroke-miterlimit:4;stroke-dasharray:none;stroke-opacity:1;filter:url(#filter4375-4-1-1-1-9-5-2-03-7)"
       x="787.65729"
       y="1584.5073"
       id="text4580-6-6-99-4"
       transform="matrix(0.50595761,-0.19963088,-0.07772121,0.50600563,74.660307,1898.2483)"><tspan
         sodipodi:role="line"
         id="tspan4582-1-9-1-6"
         x="787.65729"
         y="1584.5073"
         style="font-size:70px;fill:#000000">?!<tspan
   style="font-size:114.732px"
   id="tspan4313-4-5-4" /></tspan></text>
    <text
       xml:space="preserve"
       style="font-style:normal;font-variant:normal;font-weight:normal;font-stretch:normal;line-height:0%;font-family:Lavi;-inkscape-font-specification:Lavi;letter-spacing:0px;word-spacing:0px;fill:#000000;fill-opacity:1;stroke:#000000;stroke-width:0.992362;stroke-miterlimit:4;stroke-dasharray:none;stroke-opacity:1;filter:url(#filter4375-4-1-1-1-9-5-2-03-9-2)"
       x="787.65729"
       y="1584.5073"
       id="text4580-6-6-99-8-9"
       transform="matrix(0.1469486,-0.06860126,-0.02257308,0.17388403,663.83686,2530.7484)"><tspan
         sodipodi:role="line"
         id="tspan4582-1-9-1-0-0"
         x="787.65729"
         y="1584.5073"
         style="font-size:70px;fill:#000000">Gluck?</tspan><tspan
         sodipodi:role="line"
         x="787.65729"
         y="1584.5073"
         id="tspan1267" /></text>
  </g>
</svg>
