<?xml version="1.0" encoding="UTF-8" standalone="no"?>
<!-- Created with Inkscape (http://www.inkscape.org/) -->

<svg
   version="1.1"
   id="svg2"
   width="1099.2616"
   height="3142"
   viewBox="0 0 1099.2616 262"
   sodipodi:docname="PCMINI_E22.svg"
   inkscape:version="1.3 (0e150ed6c4, 2023-07-21)"
   xmlns:inkscape="http://www.inkscape.org/namespaces/inkscape"
   xmlns:sodipodi="http://sodipodi.sourceforge.net/DTD/sodipodi-0.dtd"
   xmlns:xlink="http://www.w3.org/1999/xlink"
   xmlns="http://www.w3.org/2000/svg"
   xmlns:svg="http://www.w3.org/2000/svg"
   xmlns:rdf="http://www.w3.org/1999/02/22-rdf-syntax-ns#"
   xmlns:cc="http://creativecommons.org/ns#"
   xmlns:dc="http://purl.org/dc/elements/1.1/">
  <metadata
     id="metadata8">
    <rdf:RDF>
      <cc:Work
         rdf:about="">
        <dc:format>image/svg+xml</dc:format>
        <dc:type
           rdf:resource="http://purl.org/dc/dcmitype/StillImage" />
        <dc:title />
      </cc:Work>
    </rdf:RDF>
  </metadata>
  <defs
     id="defs6">
    <filter
       style="color-interpolation-filters:sRGB"
       id="filter3018-3-2"
       inkscape:label="Lapping"
       inkscape:menu="Distort"
       inkscape:menu-tooltip="Something like a water noise"
       height="1.0478421"
       y="-0.023921065"
       width="1.0204258"
       x="-0.010212884">
      <feTurbulence
         id="feTurbulence3020-6-9"
         numOctaves="5"
         seed="0"
         type="fractalNoise"
         baseFrequency="0.1"
         result="result1" />
      <feGaussianBlur
         id="feGaussianBlur3022-7-1"
         stdDeviation="2"
         result="result2" />
      <feDisplacementMap
         id="feDisplacementMap3024-5-2"
         in2="result2"
         scale="50"
         yChannelSelector="B"
         xChannelSelector="R"
         in="SourceGraphic" />
    </filter>
    <filter
       style="color-interpolation-filters:sRGB"
       id="filter3018-7"
       inkscape:label="Lapping"
       inkscape:menu="Distort"
       inkscape:menu-tooltip="Something like a water noise"
       height="1.0743216"
       y="-0.03716081"
       width="1.0358685"
       x="-0.01793423">
      <feTurbulence
         id="feTurbulence3020-0"
         numOctaves="5"
         seed="0"
         type="fractalNoise"
         baseFrequency="0.1"
         result="result1" />
      <feGaussianBlur
         id="feGaussianBlur3022-9"
         stdDeviation="2"
         result="result2" />
      <feDisplacementMap
         id="feDisplacementMap3024-3"
         in2="result2"
         scale="50"
         yChannelSelector="B"
         xChannelSelector="R"
         in="SourceGraphic" />
    </filter>
    <filter
       style="color-interpolation-filters:sRGB"
       id="filter3018-3-2-2-2"
       inkscape:label="Lapping"
       inkscape:menu="Distort"
       inkscape:menu-tooltip="Something like a water noise"
       height="1.0296108"
       y="-0.014805412"
       width="1.0257526"
       x="-0.012876279">
      <feTurbulence
         id="feTurbulence3020-6-9-0-9"
         numOctaves="5"
         seed="0"
         type="fractalNoise"
         baseFrequency="0.1"
         result="result1" />
      <feGaussianBlur
         id="feGaussianBlur3022-7-1-2-3"
         stdDeviation="2"
         result="result2" />
      <feDisplacementMap
         id="feDisplacementMap3024-5-2-3-1"
         in2="result2"
         scale="50"
         yChannelSelector="B"
         xChannelSelector="R"
         in="SourceGraphic" />
    </filter>
    <filter
       style="color-interpolation-filters:sRGB"
       id="filter3018-7-5"
       inkscape:label="Lapping"
       inkscape:menu="Distort"
       inkscape:menu-tooltip="Something like a water noise"
       height="1.0758175"
       y="-0.037908774"
       width="1.0421344"
       x="-0.021067219">
      <feTurbulence
         id="feTurbulence3020-0-6"
         numOctaves="5"
         seed="0"
         type="fractalNoise"
         baseFrequency="0.1"
         result="result1" />
      <feGaussianBlur
         id="feGaussianBlur3022-9-9"
         stdDeviation="2"
         result="result2" />
      <feDisplacementMap
         id="feDisplacementMap3024-3-3"
         in2="result2"
         scale="50"
         yChannelSelector="B"
         xChannelSelector="R"
         in="SourceGraphic" />
    </filter>
    <filter
       style="color-interpolation-filters:sRGB"
       id="filter3018-3-2-2-7"
       inkscape:label="Lapping"
       inkscape:menu="Distort"
       inkscape:menu-tooltip="Something like a water noise"
       height="1.0471908"
       y="-0.023595381"
       width="1.0166338"
       x="-0.0083169186">
      <feTurbulence
         id="feTurbulence3020-6-9-0-4"
         numOctaves="5"
         seed="0"
         type="fractalNoise"
         baseFrequency="0.1"
         result="result1" />
      <feGaussianBlur
         id="feGaussianBlur3022-7-1-2-4"
         stdDeviation="2"
         result="result2" />
      <feDisplacementMap
         id="feDisplacementMap3024-5-2-3-3"
         in2="result2"
         scale="50"
         yChannelSelector="B"
         xChannelSelector="R"
         in="SourceGraphic" />
    </filter>
    <filter
       style="color-interpolation-filters:sRGB"
       id="filter4375-4-1-1-1-9-5-2-03-7"
       inkscape:label="deevad outline effect"
       x="-0.011564903"
       y="-0.02781646"
       width="1.0231298"
       height="1.0556329">
      <feFlood
         id="feFlood4377-7-9-0-8-1-7-0-8-9"
         flood-opacity="1"
         flood-color="rgb(0,0,0)"
         result="flood" />
      <feComposite
         id="feComposite4379-3-8-8-2-77-4-3-9-7"
         in2="SourceGraphic"
         in="flood"
         operator="in"
         result="composite1" />
      <feMorphology
         id="feMorphology4393-1-0-49-8-9-3-7-3-90"
         operator="dilate"
         radius="1.3999999999999999"
         result="result3" />
      <feComposite
         id="feComposite4385-9-5-7-0-8-8-2-20-4"
         in2="result3"
         in="SourceGraphic"
         operator="over"
         result="composite2" />
    </filter>
    <filter
       style="color-interpolation-filters:sRGB"
       id="filter4375-4-1-1-1-9-5-2-03-7-6"
       inkscape:label="deevad outline effect"
       x="-0.0078246598"
       y="-0.032729698"
       width="1.0156493"
       height="1.0654594">
      <feFlood
         id="feFlood4377-7-9-0-8-1-7-0-8-9-0"
         flood-opacity="1"
         flood-color="rgb(0,0,0)"
         result="flood" />
      <feComposite
         id="feComposite4379-3-8-8-2-77-4-3-9-7-2"
         in2="SourceGraphic"
         in="flood"
         operator="in"
         result="composite1" />
      <feMorphology
         id="feMorphology4393-1-0-49-8-9-3-7-3-90-2"
         operator="dilate"
         radius="1.3999999999999999"
         result="result3" />
      <feComposite
         id="feComposite4385-9-5-7-0-8-8-2-20-4-1"
         in2="result3"
         in="SourceGraphic"
         operator="over"
         result="composite2" />
    </filter>
    <filter
       style="color-interpolation-filters:sRGB"
       id="filter4375-4-1-1-1-9-5-8-8"
       inkscape:label="Drop Shadow"
       x="-0.014210919"
       y="-0.069499499"
       width="1.0411553"
       height="1.2012729">
      <feFlood
         id="feFlood4377-7-9-0-8-1-7-3-1"
         flood-opacity="1"
         flood-color="rgb(190,113,27)"
         result="flood" />
      <feComposite
         id="feComposite4379-3-8-8-2-77-4-1-0"
         in2="SourceGraphic"
         in="flood"
         operator="in"
         result="composite1"
         baseFrequency="0.053999999999999999 0.053999999999999999" />
      <feMorphology
         id="feMorphology4393-1-0-49-8-9-3-0-1"
         operator="dilate"
         radius="6.2000000000000002"
         result="result3" />
      <feComposite
         id="feComposite4385-9-5-7-0-8-8-7-5"
         in2="result3"
         in="SourceGraphic"
         operator="over"
         result="fbSourceGraphic" />
      <feColorMatrix
         result="fbSourceGraphicAlpha"
         in="fbSourceGraphic"
         values="0 0 0 -1 0 0 0 0 -1 0 0 0 0 -1 0 0 0 0 1 0"
         id="feColorMatrix4544-9" />
      <feTurbulence
         id="feTurbulence4546-3"
         type="fractalNoise"
         numOctaves="5"
         seed="174"
         baseFrequency="0.053999999999999999 0.054054054054054057"
         result="turbulence" />
      <feDisplacementMap
         id="feDisplacementMap4548-8"
         in2="turbulence"
         in="fbSourceGraphic"
         scale="6.6"
         yChannelSelector="G"
         xChannelSelector="R"
         result="fbSourceGraphic" />
      <feColorMatrix
         result="fbSourceGraphicAlpha"
         in="fbSourceGraphic"
         values="0 0 0 -1 0 0 0 0 -1 0 0 0 0 -1 0 0 0 0 1 0"
         id="feColorMatrix4670-7" />
      <feFlood
         id="feFlood4672-4"
         flood-opacity="1"
         flood-color="rgb(141,82,22)"
         result="flood"
         in="fbSourceGraphic" />
      <feComposite
         id="feComposite4674-8"
         in2="fbSourceGraphic"
         in="flood"
         operator="in"
         result="composite1" />
      <feGaussianBlur
         id="feGaussianBlur4676-3"
         in="composite1"
         stdDeviation="0"
         result="blur" />
      <feOffset
         id="feOffset4678-6"
         dx="6"
         dy="6"
         result="offset" />
      <feComposite
         id="feComposite4680-4"
         in2="offset"
         in="fbSourceGraphic"
         operator="over"
         result="composite2" />
    </filter>
  </defs>
  <sodipodi:namedview
     pagecolor="#ffffff"
     bordercolor="#666666"
     borderopacity="1"
     objecttolerance="10"
     gridtolerance="10"
     guidetolerance="10"
     inkscape:pageopacity="0"
     inkscape:pageshadow="2"
     inkscape:window-width="1888"
     inkscape:window-height="1144"
     id="namedview4"
     showgrid="false"
     inkscape:zoom="1.0424112"
     inkscape:cx="566.47509"
     inkscape:cy="1466.3119"
     inkscape:window-x="32"
     inkscape:window-y="0"
     inkscape:window-maximized="1"
     inkscape:current-layer="layer2"
     inkscape:pagecheckerboard="0"
     inkscape:showpageshadow="0"
     inkscape:deskcolor="#d1d1d1" />
  <g
     inkscape:label="text"
     id="layer2"
     inkscape:groupmode="layer">
    <image
       sodipodi:insensitive="true"
       xlink:href="../../img/22/gfx_Pepper-and-Carrot-MINI_by_Nicolas_Artance_E22.png"
       y="-1440"
       x="0"
       id="image1680"
       preserveAspectRatio="none"
       height="3142"
       width="1099.2616"
       style="fill:none" />
    <flowRoot
       xml:space="preserve"
       id="flowRoot3682"
       style="font-style:normal;font-variant:normal;font-weight:normal;font-stretch:normal;font-size:40px;line-height:1.25;font-family:Lavi;-inkscape-font-specification:Lavi;letter-spacing:0px;word-spacing:0px;fill:#000000;fill-opacity:1;stroke:none"
       transform="matrix(1.1663727,0,0,1.2391611,5.3343091,-1393.7881)"
       inkscape:export-xdpi="300"
       inkscape:export-ydpi="300"><flowRegion
         id="flowRegion3684"
         style="font-style:normal;font-variant:normal;font-weight:normal;font-stretch:normal;font-family:Lavi;-inkscape-font-specification:Lavi"><rect
           id="rect3686"
           width="642.90265"
           height="55.972912"
           x="17.29627"
           y="-14.053221"
           style="font-style:normal;font-variant:normal;font-weight:normal;font-stretch:normal;font-family:Lavi;-inkscape-font-specification:Lavi" /></flowRegion><flowPara
         id="flowPara3688"
         style="font-style:normal;font-variant:normal;font-weight:normal;font-stretch:normal;font-family:Lavi;-inkscape-font-specification:Lavi">MICENA Paprika in Korenček</flowPara></flowRoot>
    <flowRoot
       xml:space="preserve"
       id="flowRoot3690"
       style="font-style:normal;font-variant:normal;font-weight:normal;font-stretch:normal;font-size:18.6667px;line-height:1.25;font-family:Lavi;-inkscape-font-specification:Lavi;text-align:end;letter-spacing:0px;word-spacing:0px;text-anchor:end;fill:#000000;fill-opacity:1;stroke:none"
       transform="matrix(1.2002711,0,0,1.2122625,-44.890967,-1427.0669)"><flowRegion
         id="flowRegion3692"
         style="font-style:normal;font-variant:normal;font-weight:normal;font-stretch:normal;font-size:18.6667px;font-family:Lavi;-inkscape-font-specification:Lavi;text-align:end;text-anchor:end"><rect
           id="rect3694"
           width="378.35593"
           height="104.85864"
           x="562.12878"
           y="6.4861007"
           style="font-style:normal;font-variant:normal;font-weight:normal;font-stretch:normal;font-size:18.6667px;font-family:Lavi;-inkscape-font-specification:Lavi;text-align:end;text-anchor:end;stroke-width:1" /></flowRegion><flowPara
         style="font-style:normal;font-variant:normal;font-weight:normal;font-stretch:normal;font-size:18.6667px;font-family:Lavi;-inkscape-font-specification:Lavi"
         id="flowPara1003">Nicolas Artance</flowPara><flowPara
         style="font-style:normal;font-variant:normal;font-weight:normal;font-stretch:normal;font-size:18.6667px;font-family:Lavi;-inkscape-font-specification:Lavi"
         id="flowPara5062">Po stripu Paprika in Korenček</flowPara><flowPara
         style="font-style:normal;font-variant:normal;font-weight:normal;font-stretch:normal;font-size:18.6667px;font-family:Lavi;-inkscape-font-specification:Lavi"
         id="flowPara5064">Davida Revoyja</flowPara><flowPara
         style="font-style:normal;font-variant:normal;font-weight:normal;font-stretch:normal;font-size:18.6667px;font-family:Lavi;-inkscape-font-specification:Lavi"
         id="flowPara3814" /><flowPara
         style="font-style:normal;font-variant:normal;font-weight:normal;font-stretch:normal;font-size:18.6667px;font-family:Lavi;-inkscape-font-specification:Lavi"
         id="flowPara3816" /></flowRoot>
    <flowRoot
       xml:space="preserve"
       id="flowRoot3706"
       style="font-style:normal;font-variant:normal;font-weight:normal;font-stretch:normal;font-size:40px;line-height:1.25;font-family:Lavi;-inkscape-font-specification:Lavi;text-align:center;letter-spacing:0px;word-spacing:0px;text-anchor:middle;fill:#000000;fill-opacity:1;stroke:none"
       transform="matrix(1.7946554,0,0,2.0343253,29.158613,-1534.9661)"><flowRegion
         id="flowRegion3708"
         style="font-style:normal;font-variant:normal;font-weight:normal;font-stretch:normal;font-family:Lavi;-inkscape-font-specification:Lavi;text-align:center;text-anchor:middle"><rect
           id="rect3710"
           width="281.06439"
           height="82.157288"
           x="153.50441"
           y="79.995255"
           style="font-style:normal;font-variant:normal;font-weight:normal;font-stretch:normal;font-family:Lavi;-inkscape-font-specification:Lavi;text-align:center;text-anchor:middle" /></flowRegion><flowPara
         id="flowPara3712"
         style="font-style:normal;font-variant:normal;font-weight:normal;font-stretch:normal;font-size:14.6667px;font-family:Lavi;-inkscape-font-specification:Lavi;text-align:center;text-anchor:middle">#22 - Kaosah</flowPara></flowRoot>
    <text
       xml:space="preserve"
       style="font-style:normal;font-variant:normal;font-weight:normal;font-stretch:normal;font-size:18.6667px;line-height:1.25;font-family:Lavi;-inkscape-font-specification:Lavi;letter-spacing:0px;word-spacing:0px;fill:#000000;fill-opacity:1;stroke:none"
       x="44.086163"
       y="1622.9061"
       id="text3929"><tspan
         sodipodi:role="line"
         x="44.086163"
         y="1622.9061"
         style="font-size:16px;text-align:start;text-anchor:start"
         id="tspan1012">Ozadje na 1., 3., 4. in 5. sliki: „The &quot;Chaos &amp; Evolutions&quot; impossible triangle“ Davida Revoyja (licenca CC-BY 4.0). </tspan><tspan
         sodipodi:role="line"
         x="44.086163"
         y="1646.2395"
         style="font-size:16px;text-align:start;text-anchor:start"
         id="tspan89633">Vir: https://www.peppercarrot.com/sl/wiki/Magic-System.html</tspan></text>
    <path
       id="path58-7"
       d="m 1014.8356,-673.82765 c 7.999,-4.4885 20.5688,11.0718 22.4429,9.9745 1.9199,-1.0971 14.4896,-4.4885 17.1407,-9.9745 2.6968,-5.5857 10.2844,9.9745 12.5699,5.486 2.2855,-4.3887 -2.6512,18.8519 -10.6501,21.146 -7.9991,2.1945 -16.7751,5.4861 -19.4261,12.169 -2.6512,6.683 -1.9198,20.0488 -1.9198,20.0488 l 3.0624,4.3887 -4.9364,8.8774 c 0,0 0.7313,12.2687 3.0166,11.0717 2.2855,-1.0971 19.4262,8.8775 20.9803,11.1715 1.5083,2.1944 11.7929,23.2407 14.0782,22.1436 2.2855,-1.0973 8.7761,-4.389 8.7761,-4.389 0,0 -6.125,8.8774 -8.7761,11.0718 -2.651,2.1944 -21.7115,2.1944 -23.9969,2.1944 h -15.221 c -3.0625,0 -8.4103,-12.1689 -11.4271,-8.8772 -3.0625,3.3912 -12.2042,3.3912 -12.2042,3.3912 z"
       style="fill:#202020;fill-opacity:0.72033901;fill-rule:evenodd;stroke:none;stroke-width:0.84403044"
       inkscape:connector-curvature="0" />
    <path
       id="path60-0"
       d="m 1028.7311,-726.09415 -13.2556,21.2457 -1.9654,33.8137 1.0055,14.4631 1.3256,8.6779 -6.3077,5.9847 -0.8685,22.6422 c 0,0 0.2285,15.7597 -0.4571,21.5448 -0.6399,5.7854 1.0056,17.3558 0.6856,24.1385 -0.3656,6.7827 -1.0056,17.3557 0,21.2458 0.9599,3.89 10.1016,-56.2565 14.0783,-65.9317 2.3311,-10.573 5.7593,-107.8247 5.7593,-107.8247 z"
       style="fill:#202020;fill-opacity:1;fill-rule:evenodd;stroke:none;stroke-width:0.84403044"
       inkscape:connector-curvature="0" />
    <path
       id="path62-2"
       d="m 683.63954,-727.66365 c 28.9263,-40.5661 74.25934,-20.2829 89.69431,-15.7421 15.37773,4.541 79.06133,15.7421 88.66522,11.3021 9.66112,-4.5411 39.55923,-11.3021 50.19222,-11.3021 10.57588,0 52.02162,11.3021 58.76724,6.761 6.80275,-4.541 50.19217,2.2201 57.90957,8.9811 -1.9436,38.3461 -5.831,90.3151 -6.8028,108.2772 -14.4631,-4.4399 -39.50202,2.3211 -53.96515,9.082 -14.46312,6.761 -49.16323,-15.8429 -65.56998,-15.8429 -16.40674,0 -92.55261,15.8429 -112.84672,15.8429 -20.23696,0 -82.89148,-20.283 -99.29823,-20.283 -3.88732,-40.6671 -6.74568,-97.0762 -6.74568,-97.0762 z"
       style="fill:#202020;fill-opacity:0.72033901;fill-rule:evenodd;stroke:none;stroke-width:0.94940799"
       inkscape:connector-curvature="0" />
    <path
       id="path58-7-3"
       d="m 106.20338,-746.92925 c -9.030362,-3.5159 -23.220872,8.6724 -25.336672,7.8129 -2.16736,-0.8593 -16.35781,-3.5156 -19.35074,-7.8129 -3.04452,-4.3752 -11.61048,7.8129 -14.19062,4.2973 -2.58018,-3.4378 2.99297,14.7665 12.02328,16.5634 9.03044,1.7188 18.93808,4.2972 21.93089,9.5318 2.99299,5.2347 2.16734,15.7042 2.16734,15.7042 l -3.45734,3.4376 5.57296,6.9537 c 0,0 -0.82561,9.6098 -3.40563,8.6724 -2.58013,-0.8595 -21.9309,6.9535 -23.6854,8.7504 -1.70284,1.7189 -13.31348,18.2042 -15.89345,17.3447 -2.58016,-0.8592 -9.907626,-3.4376 -9.907626,-3.4376 0,0 6.914656,6.9535 9.907626,8.6725 2.99282,1.7188 24.51091,1.7188 27.09106,1.7188 h 17.18359 c 3.45733,0 9.49471,-9.5318 12.90046,-6.9537 3.457352,2.6566 13.777772,2.6566 13.777772,2.6566 z"
       style="fill:#202020;fill-opacity:0.72033901;fill-rule:evenodd;stroke:none;stroke-width:0.79369831"
       inkscape:connector-curvature="0" />
    <path
       id="path60-0-1"
       d="m 90.516278,-803.74665 14.964672,18.6546 2.21889,29.6898 -1.13522,12.6991 -1.49649,7.6195 7.12108,5.2548 0.98042,19.8809 c 0,0 -0.25798,13.8376 0.51607,18.9172 0.72241,5.0797 -1.13527,15.2391 -0.77405,21.1946 0.41282,5.9555 1.13525,15.2389 0,18.6547 -1.08364,3.4155 -11.40405,-49.3955 -15.893462,-57.8908 -2.63171,-9.2835 -6.50191,-94.6744 -6.50191,-94.6744 z"
       style="fill:#202020;fill-opacity:1;fill-rule:evenodd;stroke:none;stroke-width:0.84033144"
       inkscape:connector-curvature="0" />
    <path
       id="path62-2-6"
       d="m 404.99072,-801.46495 c -26.36239,-36.2395 -67.67732,-18.1197 -81.74421,-14.0631 -14.01474,4.0567 -72.0537,14.0631 -80.8064,10.0966 -8.80481,-4.0566 -36.05289,-10.0966 -45.7434,-10.0966 -9.63843,0 -47.41062,10.0966 -53.55834,6.04 -6.19984,-4.0567 -45.743432,1.9832 -52.776842,8.0231 1.771417,34.2562 5.31415,80.6826 6.199844,96.729 13.181168,-3.9666 36.000808,2.0733 49.181958,8.1132 13.18118,6.0399 44.80562,-14.1533 59.75821,-14.1533 14.95256,0 84.34916,14.1533 102.84451,14.1533 18.44324,0 75.54436,-18.1198 90.49689,-18.1198 3.54277,-36.3296 6.14778,-86.7224 6.14778,-86.7224 z"
       style="fill:#202020;fill-opacity:0.720339;fill-rule:evenodd;stroke:none;stroke-width:0.85666"
       inkscape:connector-curvature="0" />
    <text
       xml:space="preserve"
       style="font-style:italic;font-variant:normal;font-weight:normal;font-stretch:normal;font-size:21.3333px;line-height:1;font-family:'Drukaatie burti';-inkscape-font-specification:'Drukaatie burti Italic';text-align:center;letter-spacing:0px;word-spacing:0px;text-anchor:middle;fill:#ececec;fill-opacity:1;stroke:none"
       x="255.5878"
       y="-785.97321"
       id="text105-6"><tspan
         sodipodi:role="line"
         x="255.5878"
         y="-785.97321"
         style="font-style:italic;font-variant:normal;font-weight:normal;font-stretch:normal;font-size:17.3333px;line-height:1;font-family:'Drukaatie burti';-inkscape-font-specification:'Drukaatie burti Italic';text-align:center;text-anchor:middle;fill:#ececec;fill-opacity:1"
         id="tspan23984">Kaosah je šola časa, težnosti, jedrskih</tspan><tspan
         sodipodi:role="line"
         x="255.5878"
         y="-764.63989"
         style="font-style:italic;font-variant:normal;font-weight:normal;font-stretch:normal;font-size:17.3333px;line-height:1;font-family:'Drukaatie burti';-inkscape-font-specification:'Drukaatie burti Italic';text-align:center;text-anchor:middle;fill:#ececec;fill-opacity:1"
         id="tspan23986">učinkov in podzemnih božanskih sil.</tspan><tspan
         sodipodi:role="line"
         x="255.5878"
         y="-743.30658"
         style="font-style:italic;font-variant:normal;font-weight:normal;font-stretch:normal;font-size:17.3333px;line-height:1;font-family:'Drukaatie burti';-inkscape-font-specification:'Drukaatie burti Italic';text-align:center;text-anchor:middle;fill:#ececec;fill-opacity:1"
         id="tspan25506">Radičnica jo je pred davnimi časi</tspan><tspan
         sodipodi:role="line"
         x="255.5878"
         y="-721.97333"
         style="font-style:italic;font-variant:normal;font-weight:normal;font-stretch:normal;font-size:17.3333px;line-height:1;font-family:'Drukaatie burti';-inkscape-font-specification:'Drukaatie burti Italic';text-align:center;text-anchor:middle;fill:#ececec;fill-opacity:1"
         id="tspan25508">ustanovila s svojim urokom črne luknje.</tspan></text>
    <path
       id="path58"
       d="m 296.26469,-870.73265 c -5.5056,-1.4336 -14.1573,3.5363 -15.4472,3.1858 -1.3214,-0.3504 -9.973,-1.4336 -11.7977,-3.1858 -1.8562,-1.7841 -7.0787,3.1858 -8.6517,1.7522 -1.5731,-1.4018 1.8247,6.0212 7.3303,6.754 5.5057,0.7009 11.5461,1.7522 13.3708,3.8867 1.8247,2.1345 1.3213,6.4035 1.3213,6.4035 l -2.1078,1.4018 3.3977,2.8354 c 0,0 -0.5034,3.9186 -2.0763,3.5363 -1.5731,-0.3505 -13.3708,2.8354 -14.4405,3.5681 -1.0382,0.7009 -8.1169,7.423 -9.6899,7.0726 -1.5731,-0.3505 -6.0405,-1.4018 -6.0405,-1.4018 0,0 4.2158,2.8354 6.0405,3.5363 1.8247,0.7009 14.9438,0.7009 16.5168,0.7009 h 10.4765 c 2.1078,0 5.7887,-3.8867 7.8651,-2.8354 2.1079,1.0832 8.4,1.0832 8.4,1.0832 z"
       style="fill:#4d4d4d;fill-opacity:1;fill-rule:evenodd;stroke:none;stroke-width:0.39573929"
       inkscape:connector-curvature="0" />
    <path
       id="path60"
       d="m 287.39279,-887.70965 9.1236,6.7858 1.3528,10.8 -0.6921,4.6195 -0.9124,2.7717 4.3416,1.9115 0.5977,7.2318 c 0,0 -0.1573,5.0337 0.3146,6.8815 0.4405,1.8477 -0.6921,5.5433 -0.4719,7.7097 0.2517,2.1664 0.6922,5.5433 0,6.7858 -0.6607,1.2425 -6.9528,-17.9681 -9.6899,-21.0584 -1.6045,-3.377 -3.964,-34.4389 -3.964,-34.4389 z"
       style="fill:#000000;fill-opacity:1;fill-rule:evenodd;stroke:none;stroke-width:0.39573929"
       inkscape:connector-curvature="0" />
    <path
       id="path62"
       d="m 477.60409,-887.45475 c -15.9192,-12.8071 -40.8675,-6.4036 -49.3619,-4.9699 -8.4629,1.4336 -43.5101,4.9699 -48.7955,3.5681 -5.3168,-1.4336 -21.7708,-3.5681 -27.6224,-3.5681 -5.8203,0 -28.6293,3.5681 -32.3416,2.1345 -3.7438,-1.4337 -27.6225,0.7009 -31.8697,2.8354 1.0697,12.1062 3.209,28.5132 3.7438,34.184 7.9596,-1.4017 21.7394,0.7328 29.6989,2.8673 7.9596,2.1345 27.0562,-5.0018 36.0854,-5.0018 9.0292,0 50.9349,5.0018 62.1034,5.0018 11.1371,0 45.618,-6.4036 54.6472,-6.4036 2.1393,-12.8389 3.7124,-30.6477 3.7124,-30.6477 z"
       style="fill:#333333;fill-opacity:1;fill-rule:evenodd;stroke:none;stroke-width:0.39573929"
       inkscape:connector-curvature="0" />
    <g
       id="g101"
       style="fill:#ececec"
       transform="translate(67.381231,-1390.0668)">
      <text
         id="text76"
         y="526.26331"
         x="319.22635"
         style="font-style:normal;font-variant:normal;font-weight:normal;font-stretch:normal;font-size:21.3333px;line-height:1.25;font-family:Lavi;-inkscape-font-specification:Lavi;text-align:center;letter-spacing:0px;word-spacing:0px;text-anchor:middle;fill:#ececec;fill-opacity:1;stroke:none"
         xml:space="preserve"><tspan
           style="font-style:normal;font-variant:normal;font-weight:bold;font-stretch:normal;font-size:24px;font-family:'Drukaatie burti';-inkscape-font-specification:'Drukaatie burti Bold';font-variant-ligatures:normal;font-variant-caps:normal;font-variant-numeric:normal;font-feature-settings:normal;text-align:center;writing-mode:lr-tb;text-anchor:middle;fill:#ececec"
           y="526.26331"
           x="319.22635"
           id="tspan74"
           sodipodi:role="line">KAOSAH.</tspan></text>
    </g>
    <path
       style="color:#000000;display:inline;overflow:visible;visibility:visible;opacity:1;fill:#0f0f0f;fill-opacity:1;fill-rule:nonzero;stroke:none;stroke-width:1px;marker:none;filter:url(#filter3018-7);enable-background:accumulate"
       d="m 168.28312,283.8421 c 0,-33.58279 14.75908,-50.8989 58.54415,-54.04737 43.78511,-3.14835 169.7094,-7.85644 188.89616,3.16291 19.18671,11.01941 19.20607,27.27159 20.19004,49.31029 0.98391,22.03871 -49.15482,72.90604 -92.9228,70.88969 -34.17117,-1.57423 -91.76602,6.39736 -115.38046,-1.47364 -23.61444,-7.871 -57.3592,-41.08057 -59.32709,-67.84188 z"
       id="path3986"
       inkscape:connector-curvature="0"
       sodipodi:nodetypes="csssssc"
       transform="matrix(0.44416018,0,0,0.46077722,200.08457,-1354.2298)" />
    <path
       style="color:#000000;display:inline;overflow:visible;visibility:visible;opacity:1;fill:#0f0f0f;fill-opacity:1;fill-rule:nonzero;stroke:none;stroke-width:0.44247839px;marker:none;enable-background:accumulate"
       d="m 424.71413,-1134.6697 c 2.4638,7.3436 15.78171,10.0036 14.82705,11.8197 -0.95465,1.8161 -18.41,10.8118 -19.1856,13.1853 -0.63205,1.9654 5.70149,0.9415 7.30981,1.3023 1.60831,0.3608 5.74472,0.4223 7.75573,5.1673 2.01111,4.7451 -1.7675,11.1416 -5.03392,14.4461 -3.26637,3.3044 -9.09756,4.4829 -7.94104,8.2195 1.15648,3.7366 4.43711,1.608 6.5479,1.288 2.11088,-0.3199 11.50521,-2.467 14.87264,-1.8749 3.36744,0.5921 13.09699,6.5922 12.29365,12.0128 -3.28333,-5.5001 -7.49168,-6.5402 -10.60769,-6.3525 -3.11608,0.1877 -8.44137,0.5622 -11.75818,2.6651 -3.31683,2.103 -9.47492,3.6372 -12.39004,2.6565 -2.91521,-0.9807 -7.08406,-3.357 -7.63751,-7.6119 -0.55346,-4.2547 -1.23396,-8.1457 4.04257,-12.6794 3.26638,-3.3044 4.62309,-5.217 4.17061,-6.322 -0.45248,-1.105 -4.42315,-1.9258 -8.39339,-0.5061 -3.97024,1.4196 -9.32854,0.4654 -9.93207,-2.0036 -0.60341,-2.4691 1.03748,-7.7148 3.23675,-11.5924 2.19923,-6.3356 14.92058,-16.8137 14.92058,-16.8137 z"
       id="path5058"
       inkscape:connector-curvature="0"
       sodipodi:nodetypes="cscsssssscssssccscccc" />
    <path
       style="color:#000000;display:inline;overflow:visible;visibility:visible;opacity:1;fill:#0f0f0f;fill-opacity:1;fill-rule:nonzero;stroke:none;stroke-width:0.97100657px;marker:none;filter:url(#filter3018-3-2);enable-background:accumulate"
       d="m 150.91079,338.94529 c 0,-54.78843 31.10074,-104.01401 104.69356,-109.15056 73.59288,-5.13636 285.24319,-12.81734 317.4918,5.16011 32.24854,17.97755 46.12799,62.99969 47.78183,98.95459 1.65373,35.95491 -71.93916,91.59953 -145.53198,89.03135 -73.59291,-2.56827 -206.32976,7.58039 -246.0203,-5.2607 -39.69054,-12.8411 -75.10733,-35.07523 -78.41491,-78.73479 z"
       id="path3986-3"
       inkscape:connector-curvature="0"
       sodipodi:nodetypes="csssssc"
       transform="matrix(0.45236913,0,0,0.47983655,207.12201,-1318.828)" />
    <text
       xml:space="preserve"
       style="font-style:normal;font-variant:normal;font-weight:normal;font-stretch:normal;font-size:18.6667px;line-height:1.25;font-family:'Drukaatie burti';-inkscape-font-specification:'Drukaatie burti';font-variant-ligatures:normal;font-variant-caps:normal;font-variant-numeric:normal;font-feature-settings:normal;text-align:center;letter-spacing:0px;word-spacing:0px;writing-mode:lr-tb;text-anchor:middle;fill:#000000;fill-opacity:1;stroke:none"
       x="333.02881"
       y="-1221.7831"
       id="text1925"><tspan
         sodipodi:role="line"
         id="tspan1923"
         x="333.02881"
         y="-1221.7831"
         style="fill:#ffffff">No, dobro ...</tspan></text>
    <text
       xml:space="preserve"
       style="font-style:normal;font-variant:normal;font-weight:normal;font-stretch:normal;font-size:18.6667px;line-height:1.25;font-family:'Drukaatie burti';-inkscape-font-specification:'Drukaatie burti';font-variant-ligatures:normal;font-variant-caps:normal;font-variant-numeric:normal;font-feature-settings:normal;text-align:center;letter-spacing:0px;word-spacing:0px;writing-mode:lr-tb;text-anchor:middle;fill:#000000;fill-opacity:1;stroke:none"
       x="382.45908"
       y="-1183.9786"
       id="text1929"><tspan
         sodipodi:role="line"
         x="382.45908"
         y="-1183.9786"
         style="fill:#ffffff"
         id="tspan1023">Vam ni všeč,</tspan><tspan
         sodipodi:role="line"
         x="382.45908"
         y="-1160.6453"
         style="fill:#ffffff"
         id="tspan13893">ko govorim</tspan><tspan
         sodipodi:role="line"
         x="382.45908"
         y="-1137.3119"
         style="fill:#ffffff"
         id="tspan11515">o vaših šolah, kaj?</tspan></text>
    <path
       style="color:#000000;display:inline;overflow:visible;visibility:visible;opacity:1;fill:#0f0f0f;fill-opacity:1;fill-rule:nonzero;stroke:none;stroke-width:1.03416967px;marker:none;filter:url(#filter3018-3-2-2-2);enable-background:accumulate"
       d="m 589.37375,248.80282 c 12.84005,5.76932 25.96374,38.87106 33.69895,46.5738 7.73521,7.70274 19.58673,10.94857 23.54588,19.83235 3.95916,8.88379 -14.23122,39.11209 -12.71932,48.42454 1.51189,9.31244 3.71649,43.08356 4.10992,52.07228 0.39343,8.98873 -26.92431,12.82784 -28.77927,32.16579 -1.85495,19.33795 13.83221,40.21333 8.35583,62.3325 -5.47638,22.11917 -43.20524,3.59793 -53.67609,20.93032 -10.47085,17.3324 -11.10915,28.63423 -27.9475,33.61185 -25.42763,7.51671 -20.02733,-16.58698 -48.5075,-16.56924 -33.38477,0.0208 -6.88185,24.15693 -41.10088,23.44892 -34.21904,-0.70801 -14.95034,-15.79216 -43.33737,-20.92375 -28.38702,-5.13159 -26.80733,24.12181 -42.54388,14.35915 -10.80008,-6.70016 -27.29346,-12.86731 -34.12668,-26.88464 -6.83321,-14.01734 -37.27304,35.6673 -41.11509,18.50846 -20.95094,-390.01935 -47.92119,-294.57164 304.143,-307.88233 z"
       id="path3986-3-7-9"
       inkscape:connector-curvature="0"
       sodipodi:nodetypes="cssssssssssssscc"
       transform="matrix(0.56338285,0,0,0.3437804,525.18301,-1252.2499)" />
    <text
       xml:space="preserve"
       style="font-style:normal;font-variant:normal;font-weight:normal;font-stretch:normal;font-size:18.6667px;line-height:1.25;font-family:'Drukaatie burti';-inkscape-font-specification:'Drukaatie burti';font-variant-ligatures:normal;font-variant-caps:normal;font-variant-numeric:normal;font-feature-settings:normal;text-align:center;letter-spacing:0px;word-spacing:0px;writing-mode:lr-tb;text-anchor:middle;fill:#000000;fill-opacity:1;stroke:none"
       x="780.65759"
       y="-1132.5813"
       id="text1963"><tspan
         sodipodi:role="line"
         x="780.65759"
         y="-1132.5813"
         style="fill:#ffffff"
         id="tspan1036">Povejmo še nekaj</tspan><tspan
         sodipodi:role="line"
         x="780.65759"
         y="-1109.2479"
         style="fill:#ffffff"
         id="tspan15102">o moji - in zadnji -</tspan><tspan
         sodipodi:role="line"
         x="780.65759"
         y="-1085.9146"
         style="fill:#ffffff"
         id="tspan19852">šoli čarovnije.</tspan></text>
    <path
       style="color:#000000;display:inline;overflow:visible;visibility:visible;opacity:1;fill:#0f0f0f;fill-opacity:1;fill-rule:nonzero;stroke:none;stroke-width:0.23020801px;marker:none;enable-background:accumulate"
       d="m 684.95971,-1037.6779 c 6.69891,-2.6779 11.25627,-5.5321 15.91252,-12.9567 -0.49148,-5.7154 -8.75303,-4.2965 -5.49023,-9.9864 5.38007,-3.8272 10.59552,-11.3404 9.55706,-20.1012 -3.15857,-8.6754 -14.42506,-0.8901 -13.45166,6.9062 -2.89092,8.1511 -1.44326,9.7264 -5.61028,12.9435 -0.97931,7.298 6.94704,5.6193 9.92867,9.4256 -0.47543,4.5008 -6.73942,9.8141 -10.05701,13.2264 z"
       id="path5162"
       inkscape:connector-curvature="0"
       sodipodi:nodetypes="ccccccccc" />
    <path
       id="path58-7-3-8"
       d="m 112.60775,-501.34195 c -8.99269,-3.7312 -23.123987,9.2035 -25.230959,8.2914 -2.158317,-0.912 -16.289561,-3.7309 -19.270003,-8.2914 -3.031818,-4.6431 -11.562038,8.2914 -14.131413,4.5605 -2.569415,-3.6483 2.980483,15.6707 11.973115,17.5777 8.992763,1.824 18.859065,4.5603 21.839388,10.1154 2.980504,5.5553 2.158298,16.6659 2.158298,16.6659 l -3.442915,3.6481 5.549709,7.3795 c 0,0 -0.822166,10.1983 -3.391422,9.2035 -2.569365,-0.9122 -21.839398,7.3793 -23.586578,9.2862 -1.695735,1.8242 -13.257932,19.3189 -15.827138,18.4068 -2.569394,-0.9118 -9.866288,-3.6481 -9.866288,-3.6481 0,0 6.885806,7.3793 9.866288,9.2036 2.980334,1.824 24.408644,1.824 26.978029,1.824 h 17.111896 c 3.442905,0 9.455093,-10.1155 12.846633,-7.3795 3.44293,2.8193 13.72029,2.8193 13.72029,2.8193 z"
       style="fill:#202020;fill-opacity:0.72033901;fill-rule:evenodd;stroke:none;stroke-width:0.81593102"
       inkscape:connector-curvature="0" />
    <path
       id="path60-0-1-2"
       d="m 97.216711,-553.88185 14.964669,18.6546 2.21889,29.6898 -1.13522,12.6991 -1.49649,7.6195 7.12108,5.2548 0.98042,19.8809 c 0,0 -0.25798,13.8376 0.51607,18.9172 0.72241,5.0797 -1.13527,15.2391 -0.77405,21.1946 0.41282,5.9555 1.13525,15.2389 0,18.6547 -1.08364,3.4155 -11.40405,-49.3955 -15.89346,-57.8908 -2.63171,-9.2835 -6.501909,-94.6744 -6.501909,-94.6744 z"
       style="fill:#202020;fill-opacity:0.98728811;fill-rule:evenodd;stroke:none;stroke-width:0.84033144"
       inkscape:connector-curvature="0" />
    <path
       id="path62-2-6-1"
       d="m 416.5687,-555.93645 c -26.77017,-36.2395 -68.72418,-18.1197 -83.00866,-14.0631 -14.23152,4.0567 -73.16825,14.0631 -82.05633,10.0966 -8.94102,-4.0566 -36.61058,-10.0966 -46.45099,-10.0966 -9.78751,0 -48.14399,10.0966 -54.38681,6.04 -6.29574,-4.0567 -46.451,1.9832 -53.593209,8.0231 1.798822,34.2562 5.396349,80.6826 6.295749,96.729 13.38506,-3.9666 36.55767,2.0733 49.94272,8.1132 13.38506,6.0399 45.4987,-14.1533 60.68258,-14.1533 15.18385,0 85.6539,14.1533 104.43534,14.1533 18.72854,0 76.71291,-18.1198 91.89674,-18.1198 3.59757,-36.3296 6.24287,-86.7224 6.24287,-86.7224 z"
       style="fill:#202020;fill-opacity:0.720339;fill-rule:evenodd;stroke:none;stroke-width:0.86326"
       inkscape:connector-curvature="0" />
    <text
       xml:space="preserve"
       style="font-style:italic;font-variant:normal;font-weight:normal;font-stretch:normal;font-size:21.3333px;line-height:1;font-family:'Drukaatie burti';-inkscape-font-specification:'Drukaatie burti Italic';text-align:center;letter-spacing:0px;word-spacing:0px;text-anchor:middle;fill:#ececec;fill-opacity:1;stroke:none"
       x="849.461"
       y="-706.29608"
       id="text105-6-0"><tspan
         sodipodi:role="line"
         x="849.461"
         y="-706.29608"
         style="font-style:italic;font-variant:normal;font-weight:normal;font-stretch:normal;font-size:17.3333px;line-height:1;font-family:'Drukaatie burti';-inkscape-font-specification:'Drukaatie burti Italic';text-align:center;text-anchor:middle;fill:#ececec;fill-opacity:1"
         id="tspan2009-3">Da, v naši šoli smo zelo resni! Krmilimo</tspan><tspan
         sodipodi:role="line"
         x="849.461"
         y="-684.96277"
         style="font-style:italic;font-variant:normal;font-weight:normal;font-stretch:normal;font-size:17.3333px;line-height:1;font-family:'Drukaatie burti';-inkscape-font-specification:'Drukaatie burti Italic';text-align:center;text-anchor:middle;fill:#ececec;fill-opacity:1"
         id="tspan27426">lahko samo esenco resničnosti in jo</tspan><tspan
         sodipodi:role="line"
         x="849.461"
         y="-663.62946"
         style="font-style:italic;font-variant:normal;font-weight:normal;font-stretch:normal;font-size:17.3333px;line-height:1;font-family:'Drukaatie burti';-inkscape-font-specification:'Drukaatie burti Italic';text-align:center;text-anchor:middle;fill:#ececec;fill-opacity:1"
         id="tspan27430">spreminjamo ter ustvarjamo usodne verižne</tspan><tspan
         sodipodi:role="line"
         x="849.461"
         y="-642.2962"
         style="font-style:italic;font-variant:normal;font-weight:normal;font-stretch:normal;font-size:17.3333px;line-height:1;font-family:'Drukaatie burti';-inkscape-font-specification:'Drukaatie burti Italic';text-align:center;text-anchor:middle;fill:#ececec;fill-opacity:1"
         id="tspan2077">reakcije! To ni čarovnija za vsakega zmeneta!</tspan></text>
    <text
       xml:space="preserve"
       style="font-style:italic;font-variant:normal;font-weight:normal;font-stretch:normal;font-size:21.3333px;line-height:1;font-family:'Drukaatie burti';-inkscape-font-specification:'Drukaatie burti Italic';text-align:center;letter-spacing:0px;word-spacing:0px;text-anchor:middle;fill:#ececec;fill-opacity:1;stroke:none"
       x="258.86377"
       y="-539.91858"
       id="text105"><tspan
         sodipodi:role="line"
         x="258.86377"
         y="-539.91858"
         style="font-style:italic;font-variant:normal;font-weight:normal;font-stretch:normal;font-size:17.3333px;line-height:1;font-family:'Drukaatie burti';-inkscape-font-specification:'Drukaatie burti Italic';text-align:center;text-anchor:middle;fill:#ececec;fill-opacity:1"
         id="tspan4830">Osupljivo, kajne? Na tisoče čarovnic se je</tspan><tspan
         sodipodi:role="line"
         x="258.86377"
         y="-518.58527"
         style="font-style:italic;font-variant:normal;font-weight:normal;font-stretch:normal;font-size:17.3333px;line-height:1;font-family:'Drukaatie burti';-inkscape-font-specification:'Drukaatie burti Italic';text-align:center;text-anchor:middle;fill:#ececec;fill-opacity:1"
         id="tspan39860">potegovalo za pouk pri Radičnici. Toliko</tspan><tspan
         sodipodi:role="line"
         x="258.86377"
         y="-497.25198"
         style="font-style:italic;font-variant:normal;font-weight:normal;font-stretch:normal;font-size:17.3333px;line-height:1;font-family:'Drukaatie burti';-inkscape-font-specification:'Drukaatie burti Italic';text-align:center;text-anchor:middle;fill:#ececec;fill-opacity:1"
         id="tspan39862">dela je imela z učenjem, da si je morala</tspan><tspan
         sodipodi:role="line"
         x="258.86377"
         y="-475.91867"
         style="font-style:italic;font-variant:normal;font-weight:normal;font-stretch:normal;font-size:17.3333px;line-height:1;font-family:'Drukaatie burti';-inkscape-font-specification:'Drukaatie burti Italic';text-align:center;text-anchor:middle;fill:#ececec;fill-opacity:1"
         id="tspan2024">poiskati vajenko, ki bi ji pomagala.</tspan></text>
    <path
       id="path58-7-2"
       d="m 1023.6976,-328.57805 c 7.999,-7.4796 20.5688,18.4506 22.4429,16.6221 1.9199,-1.8282 14.4896,-7.4799 17.1407,-16.6221 2.6968,-9.3082 10.2844,16.6221 12.5699,9.1422 2.2855,-7.3135 -2.6512,31.4157 -10.6501,35.2387 -7.9991,3.6569 -16.7751,9.1422 -19.4261,20.2787 -2.6512,11.1369 -1.9198,33.4106 -1.9198,33.4106 l 3.0624,7.3135 -4.9364,14.7937 c 0,0 0.7313,20.44496 3.0166,18.45029 2.2855,-1.82833 19.4262,14.7938 20.9803,18.6168 1.5083,3.6568 11.7929,38.72909 14.0782,36.9009 2.2855,-1.82847 8.7761,-7.31386 8.7761,-7.31386 0,0 -6.125,14.79363 -8.7761,18.45056 -2.651,3.65677 -21.7115,3.65677 -23.9969,3.65677 h -15.221 c -3.0625,0 -8.4103,-20.27886 -11.4271,-14.79347 -3.0625,5.65131 -12.2042,5.65131 -12.2042,5.65131 z"
       style="fill:#202020;fill-opacity:0.72033901;fill-rule:evenodd;stroke:none;stroke-width:1.08956623"
       inkscape:connector-curvature="0" />
    <path
       id="path60-0-8"
       d="m 1037.5931,-405.70525 -13.2556,34.2414 -1.9654,54.497 1.0055,23.3099 1.3256,13.9861 -6.3077,9.6455 -0.8685,36.4921 c 0,0 0.2285,25.3997 -0.4571,34.7236 -0.6399,9.32416 1.0056,27.97195 0.6856,38.90375 -0.3656,10.93152 -1.0056,27.97167 0,34.24144 0.9599,6.26947 10.1016,-90.66779 14.0783,-106.26129 2.3311,-17.0405 5.7593,-173.7795 5.7593,-173.7795 z"
       style="fill:#202020;fill-opacity:1;fill-rule:evenodd;stroke:none;stroke-width:1.0715152"
       inkscape:connector-curvature="0" />
    <path
       id="path62-2-4"
       d="m 692.50151,-403.78225 c 28.9263,-65.138 74.25934,-32.5689 89.69431,-25.2776 15.37773,7.2917 79.06133,25.2776 88.66522,18.1482 9.66112,-7.2918 39.55922,-18.1482 50.19222,-18.1482 10.5759,0 52.0216,18.1482 58.7672,10.8564 6.80284,-7.2916 50.19224,3.5648 57.90964,14.4212 -1.9436,61.573 -5.831,145.0208 -6.8028,173.8629 -14.4631,-7.1293 -39.502,3.7272 -53.96514,14.5831 -14.4632,10.8564 -49.1633,-25.4392 -65.57,-25.4392 -16.40676,0 -92.55263,25.4392 -112.84674,25.4392 -20.23696,0 -82.89148,-32.5687 -99.29823,-32.5687 -3.88732,-65.3 -6.74568,-155.8773 -6.74568,-155.8773 z"
       style="fill:#202020;fill-opacity:0.72033901;fill-rule:evenodd;stroke:none;stroke-width:1.20306206"
       inkscape:connector-curvature="0" />
    <text
       xml:space="preserve"
       style="font-style:italic;font-variant:normal;font-weight:normal;font-stretch:normal;font-size:21.3333px;line-height:1;font-family:'Drukaatie burti';-inkscape-font-specification:'Drukaatie burti Italic';text-align:center;letter-spacing:0px;word-spacing:0px;text-anchor:middle;fill:#ececec;fill-opacity:1;stroke:none"
       x="858.323"
       y="-384.4397"
       id="text105-6-0-9"><tspan
         sodipodi:role="line"
         x="858.323"
         y="-384.4397"
         style="font-style:italic;font-variant:normal;font-weight:normal;font-stretch:normal;font-size:17.3333px;line-height:1;font-family:'Drukaatie burti';-inkscape-font-specification:'Drukaatie burti Italic';text-align:center;text-anchor:middle;fill:#ececec;fill-opacity:1"
         id="tspan1869">Ta vajenka naj bi nekega dne splezala na</tspan><tspan
         sodipodi:role="line"
         x="858.323"
         y="-363.10638"
         style="font-style:italic;font-variant:normal;font-weight:normal;font-stretch:normal;font-size:17.3333px;line-height:1;font-family:'Drukaatie burti';-inkscape-font-specification:'Drukaatie burti Italic';text-align:center;text-anchor:middle;fill:#ececec;fill-opacity:1"
         id="tspan57132">omaro z napoji, jo prevrnila in nenadoma</tspan><tspan
         sodipodi:role="line"
         x="858.323"
         y="-341.7731"
         style="font-style:italic;font-variant:normal;font-weight:normal;font-stretch:normal;font-size:17.3333px;line-height:1;font-family:'Drukaatie burti';-inkscape-font-specification:'Drukaatie burti Italic';text-align:center;text-anchor:middle;fill:#ececec;fill-opacity:1"
         id="tspan57134">izginila. Tako je nastal prvi kaosaški rek:</tspan><tspan
         sodipodi:role="line"
         x="858.323"
         y="-320.43979"
         style="font-style:italic;font-variant:normal;font-weight:normal;font-stretch:normal;font-size:17.3333px;line-height:1;font-family:'Drukaatie burti';-inkscape-font-specification:'Drukaatie burti Italic';text-align:center;text-anchor:middle;fill:#ececec;fill-opacity:1"
         id="tspan57136">„Prava kaosaška čarovnica ne pleza po omarah</tspan><tspan
         sodipodi:role="line"
         x="858.323"
         y="-299.10651"
         style="font-style:italic;font-variant:normal;font-weight:normal;font-stretch:normal;font-size:17.3333px;line-height:1;font-family:'Drukaatie burti';-inkscape-font-specification:'Drukaatie burti Italic';text-align:center;text-anchor:middle;fill:#ececec;fill-opacity:1"
         id="tspan57138">z napoji!“ Radičnica je potem našla drugo</tspan><tspan
         sodipodi:role="line"
         x="858.323"
         y="-277.77319"
         style="font-style:italic;font-variant:normal;font-weight:normal;font-stretch:normal;font-size:17.3333px;line-height:1;font-family:'Drukaatie burti';-inkscape-font-specification:'Drukaatie burti Italic';text-align:center;text-anchor:middle;fill:#ececec;fill-opacity:1"
         id="tspan57140">vajenko, ki je postala ravnateljica Kaosaha:</tspan><tspan
         sodipodi:role="line"
         x="858.323"
         y="-256.43991"
         id="tspan6343"
         style="font-style:italic;font-variant:normal;font-weight:normal;font-stretch:normal;font-size:17.3333px;line-height:1;font-family:'Drukaatie burti';-inkscape-font-specification:'Drukaatie burti Italic';text-align:center;text-anchor:middle;fill:#ececec;fill-opacity:1">Timijano.</tspan></text>
    <path
       id="path58-7-3-8-5"
       d="m 100.94732,-188.16395 c -8.992697,-5.00985 -23.123994,12.35737 -25.230966,11.13271 -2.158317,-1.22454 -16.289561,-5.00948 -19.270003,-11.13271 -3.031818,-6.23426 -11.562038,11.13271 -14.131413,6.12323 -2.569415,-4.89846 2.980483,21.04085 11.973115,23.60136 8.992763,2.44906 18.859065,6.12305 21.839388,13.5818 2.980504,7.45904 2.158298,22.37709 2.158298,22.37709 l -3.442915,4.89825 5.549709,9.90836 c 0,0 -0.822166,13.693121 -3.391422,12.357421 -2.569365,-1.2248 -21.839398,9.90809 -23.586578,12.46846 -1.695735,2.44932 -13.257932,25.93923 -15.827138,24.71456 -2.569394,-1.22425 -9.866288,-4.89824 -9.866288,-4.89824 0,0 6.885806,9.90808 9.866288,12.35754 2.980334,2.44906 24.408644,2.44906 26.978029,2.44906 H 81.67732 c 3.442905,0 9.455093,-13.58195 12.846633,-9.90836 3.44293,3.78545 13.720297,3.78545 13.720297,3.78545 z"
       style="fill:#202020;fill-opacity:0.72033901;fill-rule:evenodd;stroke:none;stroke-width:0.9454549"
       inkscape:connector-curvature="0" />
    <path
       id="path60-0-1-2-7"
       d="m 85.556274,-268.25095 14.964676,26.2128 2.21889,41.7192 -1.13522,17.84433 -1.49649,10.70664 7.12108,7.38387 0.98042,27.93601 c 0,0 -0.25798,19.44415 0.51607,26.58185 0.72241,7.13782 -1.13527,21.413491 -0.77405,29.781961 0.41282,8.36848 1.13525,21.41322 0,26.21299 -1.08364,4.79936 -11.404057,-69.408971 -15.893467,-81.346301 -2.63171,-13.04487 -6.501909,-133.03335 -6.501909,-133.03335 z"
       style="fill:#202020;fill-opacity:0.98728811;fill-rule:evenodd;stroke:none;stroke-width:0.99612707"
       inkscape:connector-curvature="0" />
    <path
       id="path62-2-6-1-2"
       d="m 387.562,-268.56895 c -25.31676,-51.0871 -64.99297,-25.5435 -78.50191,-19.8249 -13.45886,5.7188 -69.19575,19.8249 -77.60128,14.2333 -8.45558,-5.7187 -34.6229,-14.2333 -43.92904,-14.2333 -9.25612,0 -45.53013,14.2333 -51.434,8.5146 -5.95393,-5.7188 -43.92907,2.7958 -50.683506,11.3103 1.701159,48.291 5.103367,113.73842 5.953932,136.35907 12.658364,-5.59174 34.572864,2.92274 47.231204,11.4372 12.65836,8.51447 43.02846,-19.95195 57.38796,-19.95195 14.35949,0 81.00354,19.95195 98.76529,19.95195 17.71171,0 72.54796,-25.54353 86.90741,-25.54353 3.40225,-51.21388 5.90394,-122.25274 5.90394,-122.25274 z"
       style="fill:#202020;fill-opacity:0.720339;fill-rule:evenodd;stroke:none;stroke-width:0.996744"
       inkscape:connector-curvature="0" />
    <text
       xml:space="preserve"
       style="font-style:italic;font-variant:normal;font-weight:normal;font-stretch:normal;font-size:21.3333px;line-height:1;font-family:'Drukaatie burti';-inkscape-font-specification:'Drukaatie burti Italic';text-align:center;letter-spacing:0px;word-spacing:0px;text-anchor:middle;fill:#ececec;fill-opacity:1;stroke:none"
       x="242.34515"
       y="-244.46201"
       id="text105-2"><tspan
         sodipodi:role="line"
         x="242.34515"
         y="-244.46201"
         style="font-style:italic;font-variant:normal;font-weight:normal;font-stretch:normal;font-size:17.3333px;line-height:1;font-family:'Drukaatie burti';-inkscape-font-specification:'Drukaatie burti Italic';text-align:center;text-anchor:middle;fill:#ececec;fill-opacity:1"
         id="tspan2024-9">Po Veliki herevski vojni so od mnogih</tspan><tspan
         sodipodi:role="line"
         x="242.34515"
         y="-223.12871"
         style="font-style:italic;font-variant:normal;font-weight:normal;font-stretch:normal;font-size:17.3333px;line-height:1;font-family:'Drukaatie burti';-inkscape-font-specification:'Drukaatie burti Italic';text-align:center;text-anchor:middle;fill:#ececec;fill-opacity:1"
         id="tspan61308">kaosaških čarovnic ostale le še tri,</tspan><tspan
         sodipodi:role="line"
         x="242.34515"
         y="-201.79541"
         style="font-style:italic;font-variant:normal;font-weight:normal;font-stretch:normal;font-size:17.3333px;line-height:1;font-family:'Drukaatie burti';-inkscape-font-specification:'Drukaatie burti Italic';text-align:center;text-anchor:middle;fill:#ececec;fill-opacity:1"
         id="tspan1921">vključno z ravnateljico Timijano.</tspan><tspan
         sodipodi:role="line"
         x="242.34515"
         y="-180.46211"
         style="font-style:italic;font-variant:normal;font-weight:normal;font-stretch:normal;font-size:17.3333px;line-height:1;font-family:'Drukaatie burti';-inkscape-font-specification:'Drukaatie burti Italic';text-align:center;text-anchor:middle;fill:#ececec;fill-opacity:1"
         id="tspan61319">Iskale so naslednico, ki bi jo naučile</tspan><tspan
         sodipodi:role="line"
         x="242.34515"
         y="-159.1288"
         style="font-style:italic;font-variant:normal;font-weight:normal;font-stretch:normal;font-size:17.3333px;line-height:1;font-family:'Drukaatie burti';-inkscape-font-specification:'Drukaatie burti Italic';text-align:center;text-anchor:middle;fill:#ececec;fill-opacity:1"
         id="tspan6365">svojega dragocenega znanja.</tspan></text>
    <path
       id="path58-7-2-0"
       d="m 1013.7917,21.657171 c 7.999,-4.02071 20.5688,9.91815 22.4429,8.93518 1.9199,-0.98275 14.4896,-4.02078 17.1407,-8.93518 2.6968,-5.00368 10.2844,8.93518 12.5699,4.9144 2.2855,-3.93143 -2.6512,16.88755 -10.6501,18.94261 -7.9991,1.96579 -16.7751,4.9144 -19.4261,10.9009 -2.6512,5.98664 -1.9198,17.95986 -1.9198,17.95986 l 3.0624,3.93143 -4.9364,7.95237 c 0,0 0.7313,10.99025 3.0166,9.918 2.2855,-0.98282 19.4262,7.952439 20.9803,10.007509 1.5083,1.96571 11.7929,20.8189 14.0782,19.83616 2.2855,-0.9829 8.7761,-3.93159 8.7761,-3.93159 0,0 -6.125,7.95235 -8.7761,9.91814 -2.651,1.9657 -21.7115,1.9657 -23.9969,1.9657 h -15.221 c -3.0625,0 -8.4103,-10.90094 -11.4271,-7.95225 -3.0625,3.03787 -12.2042,3.03787 -12.2042,3.03787 z"
       style="fill:#202020;fill-opacity:0.72033901;fill-rule:evenodd;stroke:none;stroke-width:0.79884768"
       inkscape:connector-curvature="0" />
    <path
       id="path60-0-8-4"
       d="m 1027.6872,-25.163239 -13.2556,19.0319602 -1.9654,30.2903198 1.0055,12.95604 1.3256,7.77367 -6.3077,5.36114 -0.8685,20.28289 c 0,0 0.2285,14.11756 -0.4571,19.29993 -0.6399,5.18252 1.0056,15.547259 0.6856,21.623329 -0.3656,6.07592 -1.0056,15.54711 0,19.03195 0.9599,3.48467 10.1016,-50.394669 14.0783,-59.061739 2.3311,-9.47134 5.7593,-96.58949 5.7593,-96.58949 z"
       style="fill:#202020;fill-opacity:1;fill-rule:evenodd;stroke:none;stroke-width:0.79884768"
       inkscape:connector-curvature="0" />
    <path
       id="path62-2-4-4"
       d="m 677.80054,-26.569109 c 29.32808,-36.33926 75.29077,-18.1696 90.94013,-14.10189 15.59132,4.06785 80.15946,14.10189 89.89674,10.1245 9.79531,-4.06792 40.10868,-10.1245 50.88937,-10.1245 10.72279,0 52.74414,10.1245 59.58345,6.05658 6.89729,-4.06786 50.88937,1.98872 58.71397,8.04531 -1.9706,34.3503802 -5.912,80.90432 -6.8973,96.99478 -14.664,-3.97731 -40.05068,2.07927 -54.71469,8.13563 -14.66407,6.05658 -49.84614,-14.19206 -66.48072,-14.19206 -16.63468,0 -93.83815,14.19206 -114.41413,14.19206 -20.51805,0 -84.04281,-18.16944 -100.67744,-18.16944 -3.94132,-36.42965 -6.83938,-86.96097 -6.83938,-86.96097 z"
       style="fill:#202020;fill-opacity:0.720339;fill-rule:evenodd;stroke:none;stroke-width:0.904803"
       inkscape:connector-curvature="0" />
    <text
       xml:space="preserve"
       style="font-style:italic;font-variant:normal;font-weight:normal;font-stretch:normal;font-size:21.3333px;line-height:1;font-family:'Drukaatie burti';-inkscape-font-specification:'Drukaatie burti Italic';text-align:center;letter-spacing:0px;word-spacing:0px;text-anchor:middle;fill:#ececec;fill-opacity:1;stroke:none"
       x="849.24554"
       y="-10.741572"
       id="text105-6-0-9-3"><tspan
         sodipodi:role="line"
         x="849.24554"
         y="-10.741572"
         style="font-style:italic;font-variant:normal;font-weight:normal;font-stretch:normal;font-size:17.3333px;line-height:1;font-family:'Drukaatie burti';-inkscape-font-specification:'Drukaatie burti Italic';text-align:center;text-anchor:middle;fill:#ececec;fill-opacity:1"
         id="tspan2289">Učenka, ki so jo našle na hipijaški šoli,</tspan><tspan
         sodipodi:role="line"
         x="849.24554"
         y="10.591727"
         style="font-style:italic;font-variant:normal;font-weight:normal;font-stretch:normal;font-size:17.3333px;line-height:1;font-family:'Drukaatie burti';-inkscape-font-specification:'Drukaatie burti Italic';text-align:center;text-anchor:middle;fill:#ececec;fill-opacity:1"
         id="tspan3">je bila prava katastrofa. Ampak ko so jo začele</tspan><tspan
         sodipodi:role="line"
         x="849.24554"
         y="31.925026"
         style="font-style:italic;font-variant:normal;font-weight:normal;font-stretch:normal;font-size:17.3333px;line-height:1;font-family:'Drukaatie burti';-inkscape-font-specification:'Drukaatie burti Italic';text-align:center;text-anchor:middle;fill:#ececec;fill-opacity:1"
         id="tspan4">poučevati, se je izkazalo, da tako nadarjene</tspan><tspan
         sodipodi:role="line"
         x="849.24554"
         y="53.258327"
         style="font-style:italic;font-variant:normal;font-weight:normal;font-stretch:normal;font-size:17.3333px;line-height:1;font-family:'Drukaatie burti';-inkscape-font-specification:'Drukaatie burti Italic';text-align:center;text-anchor:middle;fill:#ececec;fill-opacity:1"
         id="tspan6">vajenke za kaosaško čarovnijo še nikoli ni bilo.</tspan></text>
    <path
       style="color:#000000;display:inline;overflow:visible;visibility:visible;fill:#0f0f0f;fill-opacity:1;fill-rule:nonzero;stroke:none;stroke-width:0.39509109px;marker:none;enable-background:accumulate"
       d="m 372.50345,165.061 c 5.71188,4.79049 11.46948,11.45821 11.97916,13.24296 0.5097,1.78473 -3.64396,13.12125 -1.96766,14.94313 1.67626,1.82181 7.71512,0.88841 8.45034,2.35881 0.73519,1.47037 -1.15058,10.19944 0.28064,11.53117 1.43124,1.33171 11.28014,3.68142 11.77681,4.92984 0.49664,1.24843 3.225,7.9806 8.00229,12.68775 -4.7541,-13.33478 -3.43384,-16.56187 -5.11019,-18.38367 -1.67622,-1.82189 -8.21825,-2.40504 -9.20504,-4.63375 -0.98699,-2.22846 0.67348,-10.64332 -1.23484,-12.41893 -1.90831,-1.7756 -6.33611,-1.7021 -6.33611,-1.7021 1.57189,-2.46881 8.22548,-16.45902 0.26233,-27.53781 -7.96314,-11.07883 -16.89773,4.9826 -16.89773,4.9826 z"
       id="path5050"
       inkscape:connector-curvature="0" />
    <path
       style="color:#000000;display:inline;overflow:visible;visibility:visible;opacity:1;fill:#0f0f0f;fill-opacity:1;fill-rule:nonzero;stroke:none;stroke-width:1px;marker:none;filter:url(#filter3018-7-5);enable-background:accumulate"
       d="m 199.70833,294.63209 c 0,-33.58279 12.66407,-63.84689 56.44914,-66.99536 43.78511,-3.14835 131.99914,9.40754 151.1859,20.42689 19.18671,11.01941 19.20607,27.27159 20.19004,49.31029 0.98391,22.03871 -40.77476,57.80006 -84.54274,55.78371 -34.17117,-1.57423 -62.43582,4.23936 -86.05026,-3.63164 -23.61444,-7.871 -55.26419,-28.13258 -57.23208,-54.89389 z"
       id="path3986-7"
       inkscape:connector-curvature="0"
       sodipodi:nodetypes="csssssc"
       transform="matrix(-0.67849156,0.06906614,-0.05280754,-0.83634523,556.30241,350.52511)" />
    <text
       xml:space="preserve"
       style="font-style:normal;font-variant:normal;font-weight:normal;font-stretch:normal;font-size:18.6667px;line-height:1.25;font-family:'Drukaatie burti';-inkscape-font-specification:'Drukaatie burti';font-variant-ligatures:normal;font-variant-caps:normal;font-variant-numeric:normal;font-feature-settings:normal;text-align:center;letter-spacing:0px;word-spacing:0px;writing-mode:lr-tb;text-anchor:middle;fill:#000000;fill-opacity:1;stroke:none"
       x="332.56274"
       y="114.34705"
       id="text2309"><tspan
         sodipodi:role="line"
         x="332.56274"
         y="114.34705"
         style="fill:#ffffff"
         id="tspan2004">In ta vajenka</tspan><tspan
         sodipodi:role="line"
         x="332.56274"
         y="137.68044"
         style="fill:#ffffff"
         id="tspan68447">se še zmeraj</tspan><tspan
         sodipodi:role="line"
         x="332.56274"
         y="161.01381"
         style="fill:#ffffff"
         id="tspan68449">uči ...</tspan></text>
    <path
       style="color:#000000;display:inline;overflow:visible;visibility:visible;opacity:1;fill:#0f0f0f;fill-opacity:1;fill-rule:nonzero;stroke:none;stroke-width:1.03417px;marker:none;filter:url(#filter3018-3-2-2-7);enable-background:accumulate"
       d="m 166.61891,299.47069 c 0,-32.50561 17.17852,-60.22362 85.25246,-71.29403 70.02787,-11.38817 344.93022,-7.30002 424.0377,13.11525 51.36021,13.25453 66.07129,25.64782 67.64501,46.96624 1.57362,21.31842 -4.5951,113.31467 -71.94853,125.70058 -101.71052,18.70399 -383.37775,13.52 -446.32395,-9.11284 -43.20033,-15.53304 -55.51534,-79.49906 -58.66269,-105.3752 z"
       id="path3986-3-7-0"
       inkscape:connector-curvature="0"
       sodipodi:nodetypes="csssssc"
       transform="matrix(0.43088814,0,0,0.50850393,161.0001,271.29789)" />
    <path
       style="color:#000000;display:inline;overflow:visible;visibility:visible;opacity:1;fill:#0f0f0f;fill-opacity:1;fill-rule:nonzero;stroke:none;stroke-width:0.45591936px;marker:none;enable-background:accumulate"
       d="m 432.9665,417.82351 c 2.68751,-8.41948 -1.40225,-12.00798 6.63166,-20.10321 1.62407,-1.43296 17.44106,-5.19804 18.654,-7.87784 1.21291,-2.67975 -2.06337,-8.56917 -0.84669,-10.08167 1.2167,-1.51236 10.84538,-3.91034 11.65269,-6.08594 0.80736,-2.17564 -0.58693,-13.72528 0.49515,-14.87511 1.08218,-1.14978 6.89823,-7.40309 9.86041,-14.79672 -11.77046,11.70172 -15.56995,11.9321 -16.78286,14.61192 -1.21294,2.6798 0.71024,9.86057 -1.18295,12.01865 -1.89321,2.15816 -11.11451,4.6356 -12.19099,7.53644 -1.07647,2.90089 0.70281,7.52593 0.70281,7.52593 -3.12305,-0.41524 -19.95277,-0.39531 -28.18715,13.55225 -8.23439,13.94754 11.19392,18.5753 11.19392,18.5753 z"
       id="path5050-7"
       inkscape:connector-curvature="0"
       sodipodi:nodetypes="cccccccccccsc"
       inkscape:transform-center-x="60.052541"
       inkscape:transform-center-y="-10.121215" />
    <text
       xml:space="preserve"
       style="font-style:normal;font-variant:normal;font-weight:normal;font-stretch:normal;font-size:18.6667px;line-height:1.25;font-family:'Drukaatie burti';-inkscape-font-specification:'Drukaatie burti';font-variant-ligatures:normal;font-variant-caps:normal;font-variant-numeric:normal;font-feature-settings:normal;text-align:center;letter-spacing:0px;word-spacing:0px;writing-mode:lr-tb;text-anchor:middle;fill:#000000;fill-opacity:1;stroke:none"
       x="358.33948"
       y="414.62991"
       id="text2333"><tspan
         sodipodi:role="line"
         x="358.33948"
         y="414.62991"
         style="fill:#ffffff"
         id="tspan2341">... da bo postala</tspan><tspan
         sodipodi:role="line"
         x="358.33948"
         y="437.96329"
         style="fill:#ffffff"
         id="tspan70832">strahospoštovana, neustrašna</tspan><tspan
         sodipodi:role="line"
         x="358.33948"
         y="461.29666"
         style="fill:#ffffff"
         id="tspan70834">kaosaška čarovnica.</tspan></text>
    <path
       style="fill:#ffffff;fill-rule:evenodd;stroke:none;stroke-width:0.489164px;stroke-linecap:butt;stroke-linejoin:miter;stroke-opacity:1"
       d="m 686.56476,554.39465 c 15.32833,5.88174 29.18408,9.5385 24.4734,-14.85662 27.13214,33.12003 23.24005,10.43724 27.53258,2.47607 16.13103,23.39588 30.01049,20.06173 42.06365,-4.95225 6.81381,36.08155 21.07243,18.59988 33.65092,13.20606 -0.0308,10.14663 -3.46509,21.78162 33.65093,15.68213 -10.61245,9.16401 -14.57092,17.48344 9.1775,22.28505 -16.49671,7.36823 -25.5565,15.20869 -7.64791,24.76119 -9.51376,13.91563 -3.15061,22.18582 9.94227,28.06268 -30.6559,0.8139 -23.27321,8.46973 -18.35499,15.68213 -26.1003,-14.8288 -29.75206,-8.89196 -27.53256,2.47609 -12.1482,-6.52131 -21.12727,-21.93491 -42.82846,-1.65074 -6.45418,-6.73195 -12.40353,-15.23455 -26.76779,5.77764 -1.01332,-18.32844 -11.51535,-17.63887 -26.76779,-7.42848 -4.02292,-17.18849 -19.12909,-8.46133 -35.18052,2.47624 13.10163,-16.77642 14.05103,-30.79171 -11.4719,-38.79258 24.73385,-9.59722 20.23003,-17.33865 10.70713,-24.76112 9.40832,-6.97992 15.54267,-14.58321 -9.17753,-28.06276 14.45329,2.0956 29.84269,4.79735 14.53107,-12.38073 z"
       id="path4582"
       inkscape:connector-curvature="0"
       sodipodi:nodetypes="ccccccccccccccccccc" />
    <path
       style="color:#000000;display:inline;overflow:visible;visibility:visible;fill:#ffffff;fill-opacity:1;fill-rule:nonzero;stroke:none;stroke-width:0.34063265px;marker:none;enable-background:accumulate"
       d="m 766.06032,647.20208 c -1.07895,8.77518 -1.21065,19.32967 -0.98789,21.8555 3.00643,-1.20379 5.94843,-1.73854 8.23021,-2.19548 -0.0318,4.68234 -1.55793,26.31749 -4.28777,30.93875 7.27131,-11.10941 9.72012,-27.32362 9.11292,-35.05004 -3.17876,0.0898 -5.04077,0.54484 -6.7199,0.55309 -0.51346,-3.86229 0.83062,-16.35493 0.83062,-16.35493 z"
       id="path5066"
       inkscape:connector-curvature="0" />
    <text
       xml:space="preserve"
       style="font-style:normal;font-variant:normal;font-weight:normal;font-stretch:normal;font-size:18.6667px;line-height:1.25;font-family:Lavi;-inkscape-font-specification:Lavi;font-variant-ligatures:normal;font-variant-caps:normal;font-variant-numeric:normal;font-feature-settings:normal;text-align:center;letter-spacing:0px;word-spacing:0px;writing-mode:lr-tb;text-anchor:middle;fill:#000000;fill-opacity:1;stroke:none"
       x="767.34009"
       y="586.8728"
       id="text3207"><tspan
         sodipodi:role="line"
         x="767.34009"
         y="586.8728"
         id="tspan3213">Hej! Svojo šolo</tspan><tspan
         sodipodi:role="line"
         x="767.34009"
         y="610.20618"
         id="tspan72589">je bolje opisala</tspan><tspan
         sodipodi:role="line"
         x="767.34009"
         y="633.53955"
         id="tspan72591">kot vse naše!</tspan></text>
    <path
       style="display:inline;fill:#ffffff;fill-rule:evenodd;stroke:none;stroke-width:0.282166px;stroke-linecap:butt;stroke-linejoin:miter;stroke-opacity:1"
       d="m 717.3306,678.45411 c 11.37611,7.3468 17.85608,4.35914 17.66081,-12.71839 5.42746,18.45438 9.19388,22.58179 11.4276,13.48925 7.18559,7.81542 11.67361,5.62313 15.23678,0 1.32809,7.23179 4.17619,4.31343 6.64106,3.95423 0.81183,1.6361 -1.97646,5.70104 9.28829,0.28521 0.72968,2.16555 1.71264,4.03053 8.31096,-0.77087 1.70943,8.78989 7.19405,-0.48712 12.81277,-10.40593 -3.50061,12.19431 -2.04904,13.91676 2.42405,9.24974 -2.04508,5.02168 -3.26824,8.90914 4.50175,0.3854 -2.66004,9.2691 4.31859,2.90684 15.58309,-10.40601 -5.63467,9.84075 -20.57655,26.42654 -10.735,25.05137 -1.37247,2.90108 -6.26798,5.42875 8.31096,10.02062 -2.72169,1.96855 -11.03093,-0.9081 -4.09952,7.42702 0.92867,0.97425 -2.1803,1.56925 3.75324,4.13517 -3.50264,-0.17464 -5.6507,0.44902 -2.42405,4.23936 -6.39357,-0.20483 -4.00138,3.7809 0.6926,8.86435 -9.25882,-6.5207 -9.76835,-4.15077 -10.04246,-1.54159 -11.60399,-8.89008 -12.28515,-6.09112 -13.85159,-4.23943 -5.65607,0.0692 -11.31217,-1.05024 -16.96825,8.86434 -1.48126,-6.16665 -4.45099,-10.91326 -16.96822,-6.55196 5.49602,-7.84485 -2.3228,-2.84684 -8.31097,0.38547 3.27925,-9.80025 -5.04305,-3.36838 -15.58309,6.16649 5.90238,-10.82221 -0.80133,-6.91308 -10.73501,0.7708 3.75324,-10.63175 -2.35927,-15.77352 -16.96824,-16.18711 6.9923,-3.83499 11.06981,-8.6612 3.80923,-17.34314 8.18475,2.55632 10.62614,0.18179 4.84805,-9.24982 8.92739,7.74142 4.86844,-3.48708 1.38516,-13.87457 z"
       id="path4508"
       inkscape:connector-curvature="0"
       sodipodi:nodetypes="cccccccccccccccccccccccccccc" />
    <path
       style="color:#000000;display:inline;overflow:visible;visibility:visible;fill:#ffffff;fill-opacity:1;fill-rule:nonzero;stroke:none;stroke-width:0.29259446px;marker:none;enable-background:accumulate"
       d="m 758.67145,717.68322 c -2.9135,6.74065 -5.44353,15.18538 -5.83656,17.27987 2.7879,-0.0978 5.36857,0.32346 7.37975,0.61626 -1.10014,3.75409 -7.33587,20.70116 -10.67626,23.62567 8.62243,-6.82541 14.38613,-19.14866 15.65036,-25.53417 -2.67647,-0.84734 -4.33652,-1.02029 -5.74132,-1.49939 0.45658,-3.25272 4.44396,-12.90446 4.44396,-12.90446 z"
       id="path5066-0"
       inkscape:connector-curvature="0" />
    <text
       xml:space="preserve"
       style="font-style:normal;font-variant:normal;font-weight:normal;font-stretch:normal;font-size:18.6667px;line-height:1.25;font-family:Lavi;-inkscape-font-specification:Lavi;font-variant-ligatures:normal;font-variant-caps:normal;font-variant-numeric:normal;font-feature-settings:normal;text-align:center;letter-spacing:0px;word-spacing:0px;writing-mode:lr-tb;text-anchor:middle;fill:#000000;fill-opacity:1;stroke:none"
       x="764.75989"
       y="710.77795"
       id="text3235"><tspan
         sodipodi:role="line"
         id="tspan3233"
         x="764.75989"
         y="710.77795">Po njej!</tspan></text>
    <text
       xml:space="preserve"
       style="font-style:normal;font-variant:normal;font-weight:normal;font-stretch:normal;line-height:0%;font-family:Lavi;-inkscape-font-specification:Lavi;letter-spacing:0px;word-spacing:0px;fill:#000000;fill-opacity:1;stroke:#000000;stroke-width:0.992362;stroke-miterlimit:4;stroke-dasharray:none;stroke-opacity:1;filter:url(#filter4375-4-1-1-1-9-5-2-03-7)"
       x="787.65729"
       y="1584.5073"
       id="text4580-6-6-99-4"
       transform="matrix(0.24706478,-0.13388904,-0.03795214,0.33936938,860.15726,509.78571)"><tspan
         sodipodi:role="line"
         id="tspan4582-1-9-1-6"
         x="787.65729"
         y="1584.5073"
         style="font-size:70px;fill:#000000">Tuup!</tspan></text>
    <path
       style="display:inline;fill:#ececec;fill-rule:evenodd;stroke:none;stroke-width:0.502086px;stroke-linecap:butt;stroke-linejoin:miter;stroke-opacity:1"
       d="m 30.064338,932.2336 c 17.751741,14.90713 27.863376,8.84497 27.558676,-25.80647 8.469233,37.44517 14.346507,45.81995 17.832093,27.37058 11.212706,15.85802 18.215997,11.40971 23.776132,0 2.072401,14.6738 6.516701,8.75224 10.362981,8.0234 1.26683,3.31975 -3.08414,11.56779 14.49385,0.57872 1.13863,4.39403 2.67246,8.17821 12.96878,-1.56415 2.66747,17.83527 11.2259,-0.98841 19.9936,-21.11433 -5.46255,24.74307 -3.19745,28.23803 3.78257,18.76834 -3.19123,10.18932 -5.0999,18.07724 7.0247,0.78199 -4.15082,18.80762 6.73893,5.89819 24.31652,-21.11447 -8.79258,19.96754 -32.10851,53.62119 -16.75136,50.83089 -2.14164,5.88648 -9.78081,11.01528 12.96881,20.3325 -4.24705,3.99432 -17.21315,-1.8426 -6.39707,15.0699 1.44913,1.9767 -3.40224,3.1841 5.85671,8.3906 -5.46565,-0.3544 -8.81759,0.9111 -3.78258,8.6019 -9.97681,-0.4156 -6.24393,7.6717 1.08074,17.9863 -14.44784,-13.2309 -15.24294,-8.4222 -15.67067,-3.128 -18.10737,-18.0386 -19.17027,-12.3592 -21.61459,-8.602 -8.82598,0.1403 -17.65199,-2.131 -26.478,17.9863 -2.31142,-12.5125 -6.94552,-22.1437 -26.477919,-13.2943 8.576219,-15.9178 -3.624594,-5.7765 -12.968779,0.7821 5.117065,-19.8854 -7.869392,-6.8346 -24.316518,12.5122 9.210326,-21.9589 -1.250437,-14.0271 -16.75137,1.5639 5.856713,-21.5725 -3.681519,-32.0054 -26.477953,-32.8446 10.911071,-7.7815 17.273801,-17.57415 5.944076,-35.1904 12.771837,5.18696 16.581488,0.36888 7.5651,-18.76849 13.930677,15.70786 7.596921,-7.0755 2.161471,-28.15241 z"
       id="path4508-6"
       inkscape:connector-curvature="0"
       sodipodi:nodetypes="cccccccccccccccccccccccccccc" />
    <path
       style="color:#000000;display:inline;overflow:visible;visibility:visible;fill:#ececec;fill-opacity:1;fill-rule:nonzero;stroke:none;stroke-width:0.29259446px;marker:none;enable-background:accumulate"
       d="m 176.28647,1166.643 c -2.9135,6.7406 -5.44353,15.1853 -5.83656,17.2798 2.7879,-0.098 5.36857,0.3235 7.37975,0.6163 -1.10014,3.7541 -7.33587,20.7011 -10.67626,23.6257 8.62243,-6.8255 14.38613,-19.1487 15.65036,-25.5342 -2.67647,-0.8474 -4.33652,-1.0203 -5.74132,-1.4994 0.45658,-3.2527 4.44396,-12.9045 4.44396,-12.9045 z"
       id="path5066-0-6"
       inkscape:connector-curvature="0" />
    <text
       xml:space="preserve"
       style="font-style:normal;font-variant:normal;font-weight:normal;font-stretch:normal;font-size:18.6667px;line-height:1.25;font-family:Lavi;-inkscape-font-specification:Lavi;font-variant-ligatures:normal;font-variant-caps:normal;font-variant-numeric:normal;font-feature-settings:normal;text-align:center;letter-spacing:0px;word-spacing:0px;writing-mode:lr-tb;text-anchor:middle;fill:#000000;fill-opacity:1;stroke:none"
       x="101.07314"
       y="967.49225"
       id="text3235-5"><tspan
         sodipodi:role="line"
         x="101.07314"
         y="967.49225"
         id="tspan2062">Ne, nehajte!</tspan><tspan
         sodipodi:role="line"
         x="101.07314"
         y="990.82562"
         id="tspan76552">Žal mi je!</tspan><tspan
         sodipodi:role="line"
         x="101.07314"
         y="1014.159"
         id="tspan76554">Dajte, no!</tspan></text>
    <path
       style="fill:#ececec;fill-rule:evenodd;stroke:none;stroke-width:0.253902px;stroke-linecap:butt;stroke-linejoin:miter;stroke-opacity:1"
       d="m 99.049187,1134.8065 c 10.574353,2.297 20.132813,3.7251 16.883133,-5.8021 18.71726,12.9346 16.03229,4.0761 18.99351,0.967 11.12809,9.137 20.70292,7.8348 29.01787,-1.9341 4.70055,14.0913 14.53694,7.264 23.21428,5.1575 -0.0213,3.9626 -2.39041,8.5066 23.2143,6.1245 -7.32106,3.5789 -10.05183,6.8279 6.33114,8.7031 -11.38035,2.8776 -17.6303,5.9396 -5.27594,9.6702 -6.56312,5.4346 -2.17347,8.6644 6.85873,10.9596 -21.14815,0.3178 -16.05516,3.3077 -12.6623,6.1244 -18.00544,-5.7912 -20.52463,-3.4726 -18.99351,0.967 -8.3805,-2.5468 -14.57476,-8.5664 -29.54547,-0.6446 -4.45245,-2.6291 -8.55664,-5.9497 -18.46591,2.2564 -0.69903,-7.158 -7.94394,-6.8887 -18.46592,-2.9011 -2.77525,-6.7128 -13.19632,-3.3045 -24.269502,0.967 9.038252,-6.5518 9.693192,-12.0253 -7.913954,-15.15 17.062786,-3.748 13.955806,-6.7714 7.386365,-9.6701 6.490391,-2.726 10.722221,-5.6953 -6.331162,-10.9596 9.970689,0.8184 20.587163,1.8735 10.02434,-4.8351 z"
       id="path4582-6"
       inkscape:connector-curvature="0"
       sodipodi:nodetypes="ccccccccccccccccccc" />
    <path
       style="color:#000000;display:inline;overflow:visible;visibility:visible;fill:#ececec;fill-opacity:1;fill-rule:nonzero;stroke:none;stroke-width:0.25672454px;marker:none;enable-background:accumulate"
       d="m 137.01122,1022.6385 c -0.87722,6.1307 -0.9843,13.5045 -0.80318,15.2691 2.44433,-0.841 4.83626,-1.2146 6.69142,-1.5338 -0.0259,3.2713 -1.26665,18.3865 -3.4861,21.6151 5.91182,-7.7615 7.90278,-19.0895 7.40911,-24.4874 -2.58444,0.063 -4.09832,0.3806 -5.46351,0.3864 -0.41745,-2.6984 0.67532,-11.4263 0.67532,-11.4263 z"
       id="path5066-8"
       inkscape:connector-curvature="0" />
    <text
       xml:space="preserve"
       style="font-style:normal;font-variant:normal;font-weight:normal;font-stretch:normal;font-size:18.6667px;line-height:1.25;font-family:Lavi;-inkscape-font-specification:Lavi;font-variant-ligatures:normal;font-variant-caps:normal;font-variant-numeric:normal;font-feature-settings:normal;text-align:center;letter-spacing:0px;word-spacing:0px;writing-mode:lr-tb;text-anchor:middle;fill:#000000;fill-opacity:1;stroke:none"
       x="152.27147"
       y="1160.8523"
       id="text3318"><tspan
         sodipodi:role="line"
         id="tspan3316"
         x="152.27147"
         y="1160.8523">Prisežem!</tspan></text>
    <path
       style="color:#000000;display:inline;overflow:visible;visibility:visible;fill:#ececec;fill-opacity:1;fill-rule:nonzero;stroke:none;stroke-width:0.275418;stroke-miterlimit:4;stroke-dasharray:none;marker:none;enable-background:accumulate"
       d="m 236.31508,1077.7345 c -2.65885,-14.7828 -12.56928,-23.6006 -18.12875,-26.713 -5.55949,-3.1121 -69.85606,-6.7428 -83.87562,-7.2613 -14.01957,-0.519 -54.62792,-0.7783 -72.273232,8.299 -17.645322,9.0771 -24.171632,21.2666 -24.413362,28.269 -0.241728,7.0024 6.284613,25.6756 39.64152,31.3813 33.356834,5.7058 66.836654,7.9984 79.647624,6.9611 12.811,-1.0374 56.55352,-3.044 68.63932,-15.2333 12.08584,-12.1892 10.52078,-16.8847 10.7625,-25.7028 z"
       id="path5909-8"
       inkscape:connector-curvature="0"
       sodipodi:nodetypes="csssssssc" />
    <text
       xml:space="preserve"
       style="font-style:normal;font-variant:normal;font-weight:normal;font-stretch:normal;font-size:18.6667px;line-height:1.25;font-family:Lavi;-inkscape-font-specification:Lavi;font-variant-ligatures:normal;font-variant-caps:normal;font-variant-numeric:normal;font-feature-settings:normal;text-align:center;letter-spacing:0px;word-spacing:0px;writing-mode:lr-tb;text-anchor:middle;fill:#000000;fill-opacity:1;stroke:none"
       x="139.47661"
       y="1069.9628"
       id="text3337"><tspan
         sodipodi:role="line"
         x="139.47661"
         y="1069.9628"
         id="tspan2074">To je bila moja</tspan><tspan
         sodipodi:role="line"
         x="139.47661"
         y="1093.2961"
         id="tspan83140">zadnja predstavitev!</tspan></text>
    <path
       style="color:#000000;display:inline;overflow:visible;visibility:visible;fill:#ececec;fill-opacity:1;fill-rule:nonzero;stroke:none;stroke-width:0.25672454px;marker:none;enable-background:accumulate"
       d="m 168.90718,1114.9261 c -0.87722,6.1307 -0.9843,13.5046 -0.80318,15.2692 2.44433,-0.841 4.83626,-1.2146 6.69142,-1.5339 -0.0259,3.2713 -1.26665,18.3866 -3.4861,21.6152 5.91182,-7.7615 7.90278,-19.0895 7.40911,-24.4875 -2.58444,0.063 -4.09832,0.3807 -5.46351,0.3865 -0.41745,-2.6984 0.67532,-11.4263 0.67532,-11.4263 z"
       id="path5066-8-3"
       inkscape:connector-curvature="0" />
    <text
       xml:space="preserve"
       style="font-style:normal;font-variant:normal;font-weight:normal;font-stretch:normal;line-height:0%;font-family:Lavi;-inkscape-font-specification:Lavi;letter-spacing:0px;word-spacing:0px;fill:#000000;fill-opacity:1;stroke:#000000;stroke-width:0.992362;stroke-miterlimit:4;stroke-dasharray:none;stroke-opacity:1;filter:url(#filter4375-4-1-1-1-9-5-2-03-7-6)"
       x="787.65729"
       y="1584.5073"
       id="text4580-6-6-99-4-8"
       transform="matrix(0.14315678,-0.08052718,-0.02199061,0.20411274,732.31599,1131.4906)"><tspan
         sodipodi:role="line"
         id="tspan4582-1-9-1-6-2"
         x="787.65729"
         y="1584.5073"
         style="font-size:70px;fill:#000000">Tok tok!</tspan></text>
    <text
       xml:space="preserve"
       style="font-style:normal;font-variant:normal;font-weight:normal;font-stretch:normal;line-height:0%;font-family:Lavi;-inkscape-font-specification:Lavi;letter-spacing:0px;word-spacing:0px;fill:#fff4bf;fill-opacity:1;stroke:#98b9ca;stroke-width:0.992362;stroke-miterlimit:4;stroke-dasharray:none;stroke-opacity:1;filter:url(#filter4375-4-1-1-1-9-5-8-8)"
       x="787.65729"
       y="1584.5073"
       id="text4580-6-0-0"
       transform="matrix(0.15614876,0.0335199,-0.11700339,0.12913801,468.57449,1046.1894)"><tspan
         sodipodi:role="line"
         id="tspan4582-1-1-0"
         x="787.65729"
         y="1584.5073"
         style="font-size:113.398px;fill:#fff4bf;fill-opacity:1;stroke:#98b9ca;stroke-opacity:1">Vuuušššš!</tspan></text>
  </g>
</svg>
