{
  "author": {
    "avatar": "https://lh3.googleusercontent.com/-wx7emq5Pq4g/AAAAAAAAAAI/AAAAAAAAAng/UEChbesuT6E/photo.jpg?sz=50",
    "displayName": "Adrien FABRE",
    "firstName": "Adrien",
    "fullName": "Adrien FABRE",
    "id": "59dcfa559b28097eb6b41945",
    "lastName": "FABRE"
  },
  "createdAt": "2017-10-10T22:54:58.031Z",
  "editedAt": "2017-10-11T22:41:27.687Z",
  "flags": [],
  "id": "59dd4fc29b28097eb6b41b26",
  "reference": "59d731a712406bdd5d6277d1",
  "replies": [],
  "repliesCount": 0,
  "score": -1,
  "text": "**Ouvrir la possibilité de révoquer un.e élu.e local.e** et autoriser le mandat impératif, pour peu qu'il soit lié à une réelle démocratie directe (il est interdit à l'article 27 de la Constitution). Toute personne élue non membre d'un Parlement serait révocable dès lors qu'au moins 10% des inscrits aurait signé une pétition proposant de la remplacer par une personne donnée (5% en cas de condamnation judiciaire), et qu'elle aurait perdu au vote déclenché par cette pétition. On pourrait aussi imaginer qu'elle soit révoquée si elle obtient moins de 95% des voix qu'elle avait obtenu lors de son élection, et dans ce cas il y aurait une nouvelle élection. Dans le cas d'un jugement majoritaire, le seuil de 95% des voix serait remplacé par : obtenir une note significativement inférieure (0,3 d'écart par exemple).\n\n[82% des Français](http://tnova.fr/sondages/l-observatoire-de-la-democratie-en-france-sondage-viavoice-terra-nova-la-revue-civique-le-monde-france-inter-lcp) sont favorables pour permettre à une assemblée de citoyens de démettre des élus qui ne respectent pas leurs engagements."
}