{
  "author": {
    "avatar": "https://graph.facebook.com/1847446748616145/picture",
    "displayName": "Arlette Le Bohec",
    "firstName": "Arlette",
    "fullName": "Arlette Le Bohec",
    "id": "59fdf50482abf78a2231559b",
    "lastName": "Le Bohec"
  },
  "createdAt": "2017-11-04T17:38:00.290Z",
  "flags": [],
  "id": "59fdfaf882abf78a22315bdb",
  "reference": "59d734d112406bdd5d6277ff",
  "replies": [],
  "repliesCount": 0,
  "score": 0,
  "text": "Belle initiative mais on aurait aimé en être informé plus tôt, je ne l'ai su qu'aujourd'hui, 2 jours avant la clôture !"
}