{
  "author": {
    "avatar": "https://secure.gravatar.com/avatar/ba9bc6d45340fcde53ab24581f7918ee?d=mm",
    "displayName": "Rémi LUCET",
    "extra": {
      "age": "4",
      "job": "8",
      "postal": "78850"
    },
    "firstName": "Rémi",
    "fullName": "Rémi LUCET",
    "id": "59e1cb8c66914e1e82238526",
    "lastName": "LUCET"
  },
  "createdAt": "2017-10-15T13:32:48.558Z",
  "flags": [],
  "id": "59e3638066914e1e82238726",
  "reference": "59d734d112406bdd5d6277ff",
  "replies": [
    {
      "_id": "59eaff9966914e1e82239416",
      "author": {
        "avatar": "https://secure.gravatar.com/avatar/6193e09f11f3e64470ed020e6bec9d55?d=mm",
        "displayName": "Philippe Panouillot",
        "extra": {
          "age": "",
          "job": "",
          "postal": ""
        },
        "firstName": "Philippe",
        "fullName": "Philippe Panouillot",
        "id": "59dcf7ff9b28097eb6b41935",
        "lastName": "Panouillot"
      },
      "createdAt": "2017-10-21T08:04:41.676Z",
      "text": "Plusieurs PB à régler auparavant :\n\nPeut on encore parler de système démocratique quand le taux de participation est inférieur à 50% et que certains représentants du peuple sont élus par 10% du corps électoral? Cette initiative de plateforme web de l'AN montre qu'il y a bien un PB croissant de légitimité morale du système actuel.\n\nLa suisse dispose d'un système d'initiative populaire régulièrement utilisé. Le pays n'est ni bloqué ni a feux et à sang\n\nFaisons un peu plus confiance aux citoyens"
    },
    {
      "_id": "59eb247e66914e1e82239497",
      "author": {
        "avatar": "https://secure.gravatar.com/avatar/ba9bc6d45340fcde53ab24581f7918ee?d=mm",
        "displayName": "Rémi LUCET",
        "extra": {
          "age": "4",
          "job": "8",
          "postal": "78850"
        },
        "firstName": "Rémi",
        "fullName": "Rémi LUCET",
        "id": "59e1cb8c66914e1e82238526",
        "lastName": "LUCET"
      },
      "createdAt": "2017-10-21T10:42:06.367Z",
      "text": "Merci de votre réponse.... Vous soulevez exactement un des problèmes que je développe (en y apportant une solution pour ma part, si vous voulez bien me relire) la participation. \nQue vaudront des référendums à 50% de votants ? Ce n’est parce qu’ils porteront ce nom que tout le monde ira voter.\nEt un référendum « gagné »  à 50%, avec cette participation, ne fera jamais que 25% de votants, qui feront la Loi... Dans quelle mesure alors aurons-nous alors  réglé un problème démocratique ?\nEt puis il est impossible de comparer la France, pays centralisé, et la Suisse, aux Cantons très indépendants... Beaucoup de choses ne pas transposables.\nEt enfin, je ne parle pas de pays « à feu et à sang »... Je parle de « blocages administratifs ». On sait très bien que plus rien ne bouge (projets bloqués, etc...) dès trois mois avant des élections et que tout est remis en question, avec l’impression que plus rien d’autre ne se passe dans notre pays et dans le monde. Nous « mourrons » de cela, de ces élections intermédiaires...\n\n\n"
    },
    {
      "_id": "59eb36e366914e1e822394b8",
      "author": {
        "avatar": "https://secure.gravatar.com/avatar/6193e09f11f3e64470ed020e6bec9d55?d=mm",
        "displayName": "Philippe Panouillot",
        "extra": {
          "age": "",
          "job": "",
          "postal": ""
        },
        "firstName": "Philippe",
        "fullName": "Philippe Panouillot",
        "id": "59dcf7ff9b28097eb6b41935",
        "lastName": "Panouillot"
      },
      "createdAt": "2017-10-21T12:00:35.031Z",
      "text": "Le référendum n'est pas valide si la participation est inférieure à 50%. De mon point de vue cela lui donne une qualité incomensurable par rapport aux scrutins électifs actuels ou hélas cette règle n'est pas appliquée. On verrait alors combien le roi est nu... \nPar ailleurs c'est le peuple souverain qui s'exprime directement dans un referendum et non pas ses représentants qui faut il le rappeler tiennent leur légitimité du souverain et ne peuvent donc se placer au dessus de lui comme c'est pourtant le cas en pratique pendant toute la durée de leur mandat. \n\nEnfin la Suisse n'est pas bloquée administrativement par ces référendums. Il y a en revanche bien des exemples de blocage administratifs par des élus. Le système Suisse me semble parfaitement transposable à la France. L'indépendance relative des cantons ne fait rien à l'affaire. Ce sont bien les citoyens qui votent et pas les cantons.\n\n Mon point de vue est que depuis 2005 et plus encore depuis le Brexit nos \"élites\" ont compris combien était dangereux pour leur pouvoir l'irruption du peuple souverain directement dans le débat démocratique. On sent bien que pour eux la démocratie est en quelque sorte un mal nécessaire auquel tient le bon peuple mais finalement quelle perte de temps..."
    },
    {
      "_id": "59eb898a66914e1e822395c4",
      "author": {
        "avatar": "https://secure.gravatar.com/avatar/efc14ce0b73f73736e0744cb49e9ce31?d=mm",
        "displayName": "Thomas Bayes",
        "extra": {
          "age": "2",
          "job": "1",
          "postal": "92000"
        },
        "firstName": "Thomas",
        "fullName": "Thomas Bayes",
        "id": "59eb773766914e1e822395ab",
        "lastName": "Bayes"
      },
      "createdAt": "2017-10-21T17:53:14.394Z",
      "text": "Qu'est ce qui oblige les politiques à suivre leurs programmes ? On l'a bien vu avec Hollande qui pond sa loi travail alors qu'il s'est fait élire en tant qu'ennemi de la finance. Qu'on soit pour ou contre il faut reconnaître qu'il a trahit la plus large partie de son électorat sans aucun remords.\n\nLes candidats défendent des programmes archétypaux ou personne ne se retrouvent à 100% à part les groupies. Si je suis libéral-conservateur et très conscient des questions écologiques je vote pour qui ? Si je suis communiste et contre l'immigration je vote pour qui ? Si je suis libertarien je vote pour qui ?\nDéjà à 22 ans j'en ai marre de voter pour le moins pire, j'ai envie de voter par conviction, j'ai envie d'assumer pleinement mon vote et pas de voter pour le moins pire.\n\nPour éviter un quelconque blocage il suffit de donner un temps ou une loi ne pourra plus être modifié par référendum. Par exemple 20 ans, le temps qu'arrive une nouvelle génération.\n\nIl n'y a pas besoin d'une grande participation pour chaque référendum pour qu'il soit légitime à part sur des questions constitutionnelles. Si les gens qui n'ont pas d'avis et ne veulent pas forcément en avoir un, laisse ceux qui ont le temps de s'intéresser à la question répondre à leurs place, c'est très bien, ça n'entachera pas la légitimité de la décision.\n\nLes Suisses votent beaucoup et pourtant leurs pays n'est pas bloqué . Au contraire leur démocratie est très dynamique . Des grandes questions comme le revenus universel ou la transition nucléaire sont posé sur la table.  Pendant ce temps en France on a un débat Macron-Lepen lamentable.  \nL'élection laisse la part belle au clientélisme le plus carnassier. Les politiques infantilisent les électeurs, polarisent les débats pour exacerber l'hooliganisme politique de leurs supporters, détruisent constamment la confiance du peuple en l'Etat en mentant et en magouillant à longueur de journée. Oui l'élection est inévitable mais elle doit être contrôlé et balancé par une démocratie plus participative. On doit responsabilisé les électeurs, les faire grandir, les transformer en adulte politique conscient des risques qu'ils prennent en faisant confiance aux politiques. Dans le même temps on doit contrôler très sévèrement les politiques, ils doivent avoir peur du peuple presque physiquement. En responsabilisant le peuple et en calmant les ardeurs des politiques on aura une politique bien plus stable qu'en alternant entre droite et gauche tous les 5 ans.\n\nOui la démocratie est un peu anarchique et est certainement plus chère mais c'est le prix à payer pour le pouvoir. Un peuple qui n'est pas armé aussi bien physiquement que par la lois n'est pas véritablement souverain."
    }
  ],
  "repliesCount": 4,
  "score": -1,
  "text": "Au risque de ne pas être en accord avec tous, je suis pour ma part assez circonspect sur le principe de la \"démocratie participative\" généralisée. Elle conduirait à un \"brouhaha politique\", multiplierait les initiatives d'opposants (de tous bords) aux gouvernements en place pour de simples raisons politiques ; bref elle bloquerait encore plus un \"système\" déjà très lourd et une administration à grande inertie que nous connaissons (et dont on lui fait reproche régulièrement)... Les gens sont élus sur un programme, la démocratie s'est déjà exprimée. Il est alors facile à des opposants politiques d'obtenir un certain nombre de \"clics\" (ou signatures) pour tenter de revenir sur un point de ce programme. Et nous entrerions alors dans une ère de \"double démocratie\" où nous ne ferions plus que voter ; c'est la promesse d'un blocage absolu. Et je ne parle même pas des coûts d'organisations d'élections.\nSi \"referendum\" (y compris d'initiative populaire) il doit y avoir à mon sens, c'est sur des sujets d'importance nationale seulement (à définir), et qui n'ont pas été abordés par les candidats lors des campagnes électorales.\nPour que notre pays avance un peu, il faut je crois au contraire réduire les élections intermédiaires (aux présidentielles) qui \"paralysent\" à chaque fois pendant des mois. Alors pourquoi pas (un peu à l'américaine) un \"regroupement global électoral\" (hormis les européennes) ? Le même jour on vote pour le Président, les sénateurs, les députés, les Maires, les conseillers départementaux et régionaux... Pour cinq, six ans (peu importe mais six me paraît mieux), et sur des programmes précis et détaillés (bien plus qu'aujourd'hui). On peut même imaginer dans le même temps (au niveau régional) un vote sur des grands projets prévus (la construction ou pas de tels ou tels travaux, investissement, etc...). \nTriple avantage démocratique : on donne un vrai sens à la politique nationale et régionale dont veut le pays, la démocratie s'exprime et on laisse le temps aux élus qui l'ont été sur un schéma précis - On ne paralyse plus le pays par les élections intermédiaires  - Et on règle enfin un problème récurrent, la participation électorale : car là, les gens se déplaceront (ils en auront même hâte !)... \nEt si on n'est pas content ensuite ? Et bien la démocratie s'exprimera de nouveau dans six ans."
}