{
  "author": {
    "avatar": "https://graph.facebook.com/10214185831910086/picture",
    "displayName": "David Garland",
    "firstName": "David",
    "fullName": "David Garland",
    "id": "59dc63f79e1c7be85124e186",
    "lastName": "Garland"
  },
  "createdAt": "2017-10-10T06:13:43.483Z",
  "flags": [],
  "id": "59dc65179e1c7be85124e187",
  "reference": "59d7335412406bdd5d6277e4",
  "replies": [
    {
      "_id": "5a00395a82abf78a2231c58a",
      "author": {
        "avatar": "https://secure.gravatar.com/avatar/b9c8ad93d649594bcc043acea517bac2?d=mm",
        "displayName": "Pierre-Alain TORET",
        "extra": {
          "age": "3",
          "job": "3",
          "postal": "21000"
        },
        "firstName": "Pierre-Alain",
        "fullName": "Pierre-Alain TORET",
        "id": "5a00371082abf78a2231c53d",
        "lastName": "TORET"
      },
      "createdAt": "2017-11-06T10:28:42.544Z",
      "text": "Peut-être parce que le fait de créer/modifier les lois est devenu un métier pour certains, et qui dit métier dit jargon difficilement compréhensible par les non-initiés."
    }
  ],
  "repliesCount": 1,
  "score": 65,
  "text": "Personne n est sensee ignorer la loi mais il faut un bac +7 pour la decrypter. Il serait interessant de  faire valide la comprehension d un texte  de loi si il est incomprehensible ou soumis a interpretation on le modifie"
}