{
  "author": {
    "avatar": "https://secure.gravatar.com/avatar/88c7e45fe0ba1b6352e683abb439dc76?d=mm",
    "displayName": "dominique valck",
    "extra": {
      "age": "4",
      "job": "8",
      "postal": "54000"
    },
    "firstName": "dominique",
    "fullName": "dominique valck",
    "id": "59df37dc66914e1e8223835b",
    "lastName": "valck"
  },
  "createdAt": "2017-10-30T15:45:43.828Z",
  "flags": [],
  "id": "59f74927e8a9656c1a8e752e",
  "reference": "59d7325812406bdd5d6277d4",
  "replies": [],
  "repliesCount": 0,
  "score": -1,
  "text": "Dans sa contribution \"l'Humanisme numérique, vers un nouvel éveil de l'Humain au monde\", le Conseil de développement durable de la métropole du Grand Nancy propose un  panorama des questions que posent les enjeux démocratiques et la place du citoyen dans un monde confronté à la complexité comme à la multiplication des échanges permis par le numérique. Le numérique est un progrès, il peut être un levier qualitatif pour le projet de Société mais à la condition qu'il remplisse des objectifs liés à la notion de Commun (intérêt collectif, gouvernance partagée...)\nhttp://conseildedeveloppementdurable.grand-nancy.org/fileadmin/documents/agora/Fonctionnement/contributions/2016/2016-12-01_Lecture_rapide_Contribution_Humanisme_Numerique.pdf\nRapport complet :\nhttp://conseildedeveloppementdurable.grand-nancy.org/fileadmin/documents/agora/Fonctionnement/contributions/2016/2016-11-23__contribution_finale_Humanisme_numerique.pdf"
}