{
  "author": {
    "avatar": "https://secure.gravatar.com/avatar/97dd68c91c0cf845fadd1189fd0835b1?d=mm",
    "displayName": "Daniel TANNER",
    "extra": {
      "age": "5",
      "job": "6",
      "postal": "13008"
    },
    "firstName": "Daniel",
    "fullName": "Daniel TANNER",
    "id": "59feb2a982abf78a223186a6",
    "lastName": "TANNER"
  },
  "createdAt": "2017-11-05T06:51:20.420Z",
  "flags": [],
  "id": "59feb4e882abf78a223186f9",
  "reference": "59d737c712406bdd5d627805",
  "replies": [],
  "repliesCount": 0,
  "score": 0,
  "text": "Bonjour. Je viens seulement de m'inscrire sur cette plateforme citoyenne. Non pas que j'ai longuement hésité mais tout simplement, je n'étais pas du tout informé, alors que je \"furète\" beaucoup sur les sites d'information. Pourquoi n'avoir pas lancé une campagne d'information sur tous les médias ? Une campagne d'affichage ? Nous sommes bien dans une initiative citoyenne qui vise à donner plus de démocratie à notre République ? Je ne veux pas croire que cette initiative ne soit pas acceptée par nos élus(es)..."
}