{
  "author": {
    "avatar": "https://secure.gravatar.com/avatar/a3272bd9648a52d2507b29fcf641ba6f?d=mm",
    "displayName": "Nicolas Larose",
    "extra": {
      "age": "3",
      "job": "5",
      "postal": "25300"
    },
    "firstName": "Nicolas",
    "fullName": "Nicolas Larose",
    "id": "59fce416ccdac63cb472bfe3",
    "lastName": "Larose"
  },
  "createdAt": "2017-11-03T22:40:35.266Z",
  "editedAt": "2017-11-04T00:38:12.344Z",
  "flags": [],
  "id": "59fcf063ccdac63cb472c0f6",
  "reference": "59d731a712406bdd5d6277d1",
  "replies": [],
  "repliesCount": 0,
  "score": 0,
  "text": "**Création d'un comité citoyen sur le secret **:   \nL'acuité politique des citoyens comme des élus s'appuie sur les informations dont ils disposent.    \nBien que légitimes, les différents niveaux de classifications sont autant de barrières mises en place par les gouvernements successifs à une partie de ces informations, permettant à un gouvernement éventuellement malintentionné de fausser le débat démocratique, et même de cacher les preuves de sa manipulation.    \n    \nDe plus, la catégorie \"archives incommunicables\" crée par le gouvernement Fillon, concernant les documents sans date de déclassification prévue, est un écueil aux travaux légitimes des historiens.     \n    \nDans le but de rétablir la confiance entre les citoyens, les élus et le gouvernement, nous proposons, sous la tutelle de la Commission consultative du secret de la défense nationale, la création d'un comité citoyen sur le secret, composé de 10 membres (tirés au sort ou proposés par les groupes politiques au pro-rata de leur représentation à l'assemblée), habilités \"Très Secret Défense\" pour la durée de leur travaux, qui seraient chargés de confirmer, de reclassifier ou de déclassifier les classifications passées et présentes."
}