{
  "author": {
    "avatar": "https://secure.gravatar.com/avatar/77815e73ebc90f478d2c3931215962ea?d=mm",
    "displayName": "sylvie delanoy",
    "extra": {
      "age": "4",
      "job": "4",
      "postal": "56270"
    },
    "firstName": "sylvie",
    "fullName": "sylvie delanoy",
    "id": "5a01cf5e82abf78a2231dc59",
    "lastName": "delanoy"
  },
  "createdAt": "2017-11-07T16:06:30.717Z",
  "flags": [],
  "id": "5a01da0682abf78a2231dcb5",
  "reference": "59d734d112406bdd5d6277ff",
  "replies": [],
  "repliesCount": 0,
  "score": 0,
  "text": "Les pétitions  sont des outils formidable. Et les référendums d'initiatives populaires devraient pouvoir exister de même. A défaut d'avoir une portée normative ou abrogative, il pourrait au moins peser par leur portée consultative. Les récents événements de Catalogne mettent la question directement sur la table. Le problème reste de trouver un processus qui rende significatif le résultat par l'assentiment général sur la méthode de référence et la valeur légale des participations. Cette consultation pour être valable doit être proposée à tous les français avec la mise en place d'un travail de co construction et de pédagogie sur le contenu de façon que chacun s'exprime en connaissance de cause. C'est un travail de plus longue haleine mais qui e vaut sûrement la peine."
}