{
  "author": {
    "avatar": "https://www.agoravox.fr/local/cache-vignettes/L248xH250/auton3525-88888.jpg",
    "displayName": "s dm",
    "extra": {
      "age": "4",
      "job": "2",
      "postal": "94170"
    },
    "firstName": "s",
    "fullName": "s dm",
    "id": "59db73bf9e1c7be85124dd50",
    "lastName": "dm"
  },
  "createdAt": "2017-10-09T18:25:29.687Z",
  "editedAt": "2017-10-09T18:25:47.172Z",
  "flags": [],
  "id": "59dbbf199e1c7be85124e006",
  "reference": "59d7325812406bdd5d6277d4",
  "replies": [],
  "repliesCount": 0,
  "score": 5,
  "text": "Sur les outils de participation quelques sources intéressantes :\n\n- un document incontournable de la FNH sur les outils de participation citoyenne : http://www.fondation-nature-homme.org/magazine/democratie-participative-guide-des-outils-pour-agir/\n- un état des lieux d’expériences étrangères de processus constituant participatifs dans les annexes ici : http://www.fondation-nature-homme.org/magazine/osons-le-big-bang-democratique/\n-  un guide méthodologique sur le dialogue avec les parties prenantes du comité 21 : http://www.comite21.org/le-projet-dialogue-parties-prenantes.html\n\nEt pour une vision globale des collectifs citoyens travaillant sur la démocratie , un état des lieux publié dans un blog du Monde il y a un an : http://internetactu.blog.lemonde.fr/2016/07/02/quels-enjeux-pour-les-innovations-democratiques/"
}