{
  "author": {
    "avatar": "https://secure.gravatar.com/avatar/1520775954fa14c028b7ad427aeaddfe?d=mm",
    "displayName": "FLORENCE MORLIGHEM",
    "extra": {
      "age": "3",
      "job": "8",
      "postal": "59000"
    },
    "firstName": "FLORENCE",
    "fullName": "FLORENCE MORLIGHEM",
    "id": "59f347e9e8a9656c1a8e6f95",
    "lastName": "MORLIGHEM"
  },
  "createdAt": "2017-11-03T15:00:16.749Z",
  "flags": [],
  "id": "59fc8480ccdac63cb472ba5c",
  "reference": "59d7335412406bdd5d6277e4",
  "replies": [],
  "repliesCount": 0,
  "score": 0,
  "text": "SYNTHESE CONSULTATION CITOYENNE 5911\n\nIntervenir sans freiner le processus législatif.\nAdmettre un minimum de temps pour les citoyens : jours légaux de congés pour répondre à une convocation du député sur une thématique particulière.\nPossibilité d’intervention dès le début du travail en commission.\nPoint de passage obligé e la commission auprès des citoyens (exemple par dizaine d’articles). A ce point de passage, le député va chercher les citoyens qui ont été retenus.\nL’avis contraire des citoyens doit être inscrit.\nMise à disposition des textes, auditions publiques, amendements citoyens non évoqués par manque de temps.\nDroit de veto rejeté."
}