{
  "author": {
    "avatar": "https://secure.gravatar.com/avatar/93d1a13604f63415f1175f110a544084?d=mm",
    "displayName": "Martin Kahn",
    "extra": {
      "age": "1",
      "job": "1",
      "postal": "74800"
    },
    "firstName": "Martin",
    "fullName": "Martin Kahn",
    "id": "59fe2b2582abf78a22317834",
    "lastName": "Kahn"
  },
  "createdAt": "2017-11-04T21:20:41.066Z",
  "flags": [],
  "id": "59fe2f2982abf78a22317999",
  "reference": "59d734d112406bdd5d6277ff",
  "replies": [],
  "repliesCount": 0,
  "score": 2,
  "text": "Une assemblée composée de citoyens tirés au sort permettrait une démocratie plus directe et plus représentative.\nEn effet, l'élection de représentants est nécessaire, mais elle doit être completée par une assemblée réellement populaire.\nLe taux d'absention est de plus en plus haut, il a atteint des sommets aux législatives. Une assemblée de citoyens permettrait de représenter ces abstentionnistes."
}