{
  "author": {
    "avatar": "https://secure.gravatar.com/avatar/8ba9f722c33b5fe8c232c735d8233d58?d=mm",
    "displayName": "Mathieu ZEGGIATO",
    "extra": {
      "age": "2",
      "job": "3",
      "postal": "67100"
    },
    "firstName": "Mathieu",
    "fullName": "Mathieu ZEGGIATO",
    "id": "59f89fd8e8a9656c1a8e7e2a",
    "lastName": "ZEGGIATO"
  },
  "createdAt": "2017-11-03T20:40:38.561Z",
  "flags": [],
  "id": "59fcd446ccdac63cb472be35",
  "reference": "59d7335412406bdd5d6277e4",
  "replies": [],
  "repliesCount": 0,
  "score": 0,
  "text": "Contribution collective des comités strasbourgeois En Marche ! :\n\nConstat : il est parfois difficile d'identifier qui est précisément concerné par la loi d’autant plus que les lois sont de plus en plus nombreuses et volumineuses.\nPropositions : L'évaluation des lois et de leur application serait à l’initiative :\n1. De l’Etat et autres organismes publics (collectivités territoriales…).\n2. Des citoyens : le retour sur cette évaluation se ferait soit directement via le député soit par voie numérique via la mise en place d’une plateforme nationale par thématique.\n3. Une évaluation tous les 2 ans organisée par le député sur les lois les plus importantes ou celles qui ont le plus d’impact sur la circonscription."
}