{
  "author": {
    "avatar": "https://secure.gravatar.com/avatar/d615207ecf9005b721e4522ee27b562a?d=mm",
    "displayName": "Pacte CIVIQUE",
    "extra": {
      "age": "5",
      "job": "6",
      "postal": "75015"
    },
    "firstName": "Pacte",
    "fullName": "Pacte CIVIQUE",
    "id": "59ef48cf896da059218638f3",
    "lastName": "CIVIQUE"
  },
  "createdAt": "2017-10-24T15:30:44.494Z",
  "flags": [],
  "id": "59ef5ca4896da0592186390f",
  "reference": "59d733cb12406bdd5d6277ea",
  "replies": [],
  "repliesCount": 0,
  "score": -1,
  "text": "Autres idées ?\nIl serait bon de recourir à des méthodes favorisant la délibération démocratique sur des sujets à débattre bien identifiés ; nous  vous proposons la méthode de construction des (dés)accords féconds (voir sur le site du Pacte civique).\nhttp://www.pacte-civique.org/OCQD (se reporter à l'annexe 8 du rapport 2013 OCQD consultable sur le site Pacte civique)"
}