{
  "author": {
    "avatar": "https://secure.gravatar.com/avatar/2bb93d67729cfa4b142c45f271bfb7b1?d=mm",
    "displayName": "flore escande",
    "extra": {
      "age": "3",
      "job": "7",
      "postal": "38600"
    },
    "firstName": "flore",
    "fullName": "flore escande",
    "id": "59ff785d82abf78a2231b67c",
    "lastName": "escande"
  },
  "createdAt": "2017-11-06T08:12:19.657Z",
  "flags": [],
  "id": "5a00196382abf78a2231c0a9",
  "reference": "59d734d112406bdd5d6277ff",
  "replies": [],
  "repliesCount": 0,
  "score": 1,
  "text": "pour être un peu plus dans une vraie démocratie :\nObligation pour l’Assemblée nationale d’étudier une pétition dès qu’elle atteint 100 000 signataires comme en Grande-Bretagne. Organisateurs et organisatrices de la pétition doivent être invités à l’Assemblée nationale pour être écouté en audition et travailler dans les commissions en rapport avec la pétition."
}