{
  "author": {
    "avatar": "https://lh3.googleusercontent.com/-XdUIqdMkCWA/AAAAAAAAAAI/AAAAAAAAAAA/4252rscbv5M/photo.jpg?sz=50",
    "displayName": "mathieu finel",
    "extra": {
      "age": "2",
      "job": "1",
      "postal": "94400"
    },
    "firstName": "mathieu",
    "fullName": "mathieu finel",
    "id": "59fcbea7ccdac63cb472bbc2",
    "lastName": "finel"
  },
  "createdAt": "2017-11-03T19:14:21.528Z",
  "flags": [],
  "id": "59fcc00dccdac63cb472bbf3",
  "reference": "59d731a712406bdd5d6277d1",
  "replies": [],
  "repliesCount": 0,
  "score": 1,
  "text": "Un député par département et un sénateur par région.\nOn saurait enfin pour qui on vote et non plus juste pour un parti."
}