{
  "author": {
    "avatar": "https://lh3.googleusercontent.com/-XdUIqdMkCWA/AAAAAAAAAAI/AAAAAAAAAAA/4252rscbv5M/photo.jpg?sz=50",
    "displayName": "Laurent Morel",
    "firstName": "Laurent",
    "fullName": "Laurent Morel",
    "id": "59e4635766914e1e8223880c",
    "lastName": "Morel"
  },
  "createdAt": "2017-10-16T07:51:19.019Z",
  "flags": [],
  "id": "59e464f766914e1e8223880d",
  "reference": "59d737c712406bdd5d627805",
  "replies": [
    {
      "_id": "59e4b0b666914e1e82238872",
      "author": {
        "avatar": "https://pbs.twimg.com/profile_images/779238336686948352/0Kc7fs1n_400x400.jpg",
        "displayName": "Mathilde Jeuland",
        "extra": {
          "age": "2",
          "job": "1",
          "postal": "75020"
        },
        "firstName": "Mathilde",
        "fullName": "Mathilde Jeuland",
        "id": "59db6f7e9e1c7be85124dd43",
        "lastName": "Jeuland"
      },
      "createdAt": "2017-10-16T13:14:30.645Z",
      "editedAt": "2017-10-16T14:21:10.674Z",
      "text": "Bonjour Laurent, nous vous remercions pour votre message. En ce qui concerne le fonctionnement et les échanges sur notre plateforme, nous vous laissons la possibilité de faire comme suit : d’abord participer au débat en choisissant une thématique de votre choix parmi les 5 proposées ou bien en proposant une idée propre dans la thématique « Autres idées ». Ensuite, pour chaque thématique, vous avez pu remarquer qu’une introduction a vocation à vous indiquer les enjeux du débat tels qu'ils sont perçus par l'Assemblée. Enfin, c’est par la suite à vous de prendre position sur les problématiques déjà posées ou sur vos nouvelles propositions. En parallèle, vous pouvez également réagir aux contributions déjà déposées sur la plateforme : soit en votant « pour » ou « contre » à l’aide des pouces en bas à gauche des contributions, soit en y répondant à l’aide de la flèche en bas à droite d’un commentaire. En espérant vous avoir apporté un éclaircissement satisfaisant, nous vous souhaitons une agréable journée. "
    }
  ],
  "repliesCount": 1,
  "score": 23,
  "text": "Excellente initiative. Je suis un peu \"perdu\" sur le mode de fonctionnement et d'échange sur la plateforme (et la question ou les questions qui sont posé(e)s).  mais j'adhère a tout ce qui peut rapprocher le politique du citoyen et au possibilité sur des sujets précis d'avoir des échanges via ce type de plateforme numérique."
}