{
  "author": {
    "avatar": "https://secure.gravatar.com/avatar/eac943ada550b02a55dc08638e56f0a6?d=mm",
    "displayName": "Thierry Ether",
    "extra": {
      "age": "4",
      "job": "8",
      "postal": "06400"
    },
    "firstName": "Thierry",
    "fullName": "Thierry Ether",
    "id": "59fe063182abf78a22316605",
    "lastName": "Ether"
  },
  "createdAt": "2017-11-04T18:38:59.499Z",
  "flags": [],
  "id": "59fe094382abf78a22316858",
  "reference": "59d734d112406bdd5d6277ff",
  "replies": [],
  "repliesCount": 0,
  "score": 0,
  "text": "Le référendum ayant été bâillonné depuis des lustres, les sondages faisant dire tout et son contraire au peuple, il est grand temps de lui rendre la parole libre afin que les décisions de nos institutions soit le véritable reflet de la volonté majoritaire du peuple français et non celles de groupe de pression et/ou d'argent minoritaire.\n\nDonc je soutiens sans réserve cette initiative constructive que j'aurais pu proposer moi-même. Il est bien que les bonnes idées soient partagées par tous.\n\nje pense même que selon un rythme qui reste à définir, la pétition la plus populaire soit systématiquement examiné et transformé en projet de loi soumis au vote lorsqu'elle est recevable et conforme à notre constitution."
}