{
  "author": {
    "avatar": "https://secure.gravatar.com/avatar/dea4122fcc590f3ca400521f7364fd37?d=mm",
    "displayName": "Contribution collective Atelier citoyen 12ème circo des Yvelines",
    "extra": {
      "age": "3",
      "job": "8",
      "postal": "78300"
    },
    "firstName": "Contribution collective",
    "fullName": "Contribution collective Atelier citoyen 12ème circo des Yvelines",
    "id": "5a00252082abf78a2231c22a",
    "lastName": "Atelier citoyen 12ème circo des Yvelines"
  },
  "createdAt": "2017-11-06T09:09:39.754Z",
  "editedAt": "2017-11-06T09:11:00.988Z",
  "flags": [],
  "id": "5a0026d382abf78a2231c258",
  "reference": "59d734d112406bdd5d6277ff",
  "replies": [],
  "repliesCount": 0,
  "score": 1,
  "text": "Groupe n°1 sur les initiatives citoyennes :\n\n- Droit de proposition à travers une pétition des citoyens. (31 voix)\n\n- Boîtes à idées numériques et physiques. (17 voix)\n\n- Consultations citoyennes régulières. (14 voix)\n\n- Parlement local avec représentation du député. (10 voix)\n\n- Intervention citoyenne possible dans l’hémicycle. (9 voix)\n\n- Consultation régulière du parlement des jeunes. (7 voix)\n\n- Bornes de consultation en mairie par exemple au sujet de certains dispositifs législatifs. (7 voix)\n\n- Sollicitation régulière des citoyens sur des sujets précis. (7 voix)\n\n- Collecte régulière et organisée, à l'initiative des élus, des enjeux citoyens. (5 voix)\n\n- Processus clair des initiatives législatives, mettre en place un calendrier avec des phases de concertation clairement identifiées. (2 voix)"
}