{
  "author": {
    "avatar": "https://secure.gravatar.com/avatar/9ff62155ba985fc1bfd7a8d2b458f1c4?d=mm",
    "displayName": "Arnaud Boue",
    "extra": {
      "age": "3",
      "job": "2",
      "postal": "74160"
    },
    "firstName": "Arnaud",
    "fullName": "Arnaud Boue",
    "id": "59fd7667ccdac63cb472c51a",
    "lastName": "Boue"
  },
  "createdAt": "2017-11-04T15:04:21.689Z",
  "flags": [],
  "id": "59fdd6f5e7c9379d2c56278e",
  "reference": "59d7335412406bdd5d6277e4",
  "replies": [],
  "repliesCount": 0,
  "score": 1,
  "text": "Bonjour\nEtablir un plan stratégique est somme toute très simple. Quelques chiffres, quelques beaux graphiques ou belles images pour illustrer; le tout envelopper dans de belles paroles et le tour est jouer. \nPour ce qui est du suivi, nous parlons de gestion , d'évaluation. \nCela requiert en plus des points évoqués ci dessus, une série d'indicateurs (qualitatifs et quantitatifs) reconnus par les acteurs et observateurs du plan, un calendrier, un cadre et des responsabilités clairement attribuées et acceptées .\nL'accès à un tableau de bord doit être intégré dans la définition même de ce projet comme l'évoque Garlan Nizon dans les commentaires.\nLE HATVP doit garantir une vraie transparence sur les composantes du projet  / loi et sur son suivi .\nDans le cadre du suivi et de l'évaluation des lois, exclure les députés n'ayant pas remplis \n* les obligations de déclarations (13 à ce jour dont les noms ne sont publiés)  \n* n'ayant pas siégé un nombre de fois minimum dans l'hémicycle  \n\nEnfin , en lisant les commentaires déjà postés et faisant référence aux autres pays, pourquoi la France ne pourrait elle pas pour une fois, reprendre et adapter ce qui fonctionne dans d'autres communautés ? Je ne vois pas le bénéfice de réinventer la roue. Ce serait peut être la première évolution à apporter. Moins d'égo, plus de pragmatisme."
}