{
  "author": {
    "avatar": "https://secure.gravatar.com/avatar/a17b898fca01d0540258fe28b102d0fd?d=mm",
    "displayName": "David  Grondin ",
    "extra": {
      "age": "3",
      "job": "8",
      "postal": "26120"
    },
    "firstName": "David ",
    "fullName": "David  Grondin ",
    "id": "59fdf90082abf78a22315984",
    "lastName": "Grondin "
  },
  "createdAt": "2017-11-04T17:36:06.242Z",
  "flags": [],
  "id": "59fdfa8682abf78a22315b3d",
  "reference": "59d734d112406bdd5d6277ff",
  "replies": [],
  "repliesCount": 0,
  "score": 0,
  "text": "Un outil de plus pour faire valoir son opinion."
}