{
  "author": {
    "avatar": "https://pbs.twimg.com/profile_images/911320918949076992/i2yLw9vv.jpg",
    "displayName": "Paul Cébille",
    "extra": {
      "age": "2",
      "job": "2",
      "postal": "59420"
    },
    "firstName": "Paul",
    "fullName": "Paul Cébille",
    "id": "59dd22ca9b28097eb6b41a61",
    "lastName": "Cébille"
  },
  "createdAt": "2017-10-10T21:18:04.614Z",
  "flags": [],
  "id": "59dd390c9b28097eb6b41ab7",
  "reference": "59d7325812406bdd5d6277d4",
  "replies": [],
  "repliesCount": 0,
  "score": 3,
  "text": "Pour assurer une bonne représentativité des innovations exposées dans les différents domaines, l'Assemblée nationale ne pourrait faire l'économie de la création d'un \"lien\" humain. Cela pourrait passer par un déplacement en son sein des participants ou l'organisation dans les grandes villes de séance de visioconférence avec les élus et experts à l'Assemblée."
}