{
  "author": {
    "avatar": "https://secure.gravatar.com/avatar/91a84d3559867c9661ac304169d07429?d=mm",
    "displayName": "Jluc RICHARD",
    "extra": {
      "age": "4",
      "job": "7",
      "postal": "78400"
    },
    "firstName": "Jluc",
    "fullName": "Jluc RICHARD",
    "id": "59faf8dfccdac63cb472b503",
    "lastName": "RICHARD"
  },
  "createdAt": "2017-11-02T12:02:56.769Z",
  "flags": [],
  "id": "59fb0970ccdac63cb472b55e",
  "reference": "59d734d112406bdd5d6277ff",
  "replies": [],
  "repliesCount": 0,
  "score": -2,
  "text": "Remettre de la chaleur humaine et la participation: les hommes ou les femmes, allongé ou debout , la nuit ou le jour, les vieux ou les jeunes, les actifs ou les proactifs.......le numérique seul n'est pas démocratique, les statisticiens ne pourront pas transformer durablement les citoyens. Nous resterons hétérogène."
}