{
  "author": {
    "avatar": "https://secure.gravatar.com/avatar/8188be41128258353b17e8e3b7e50ebb?d=mm",
    "displayName": "Regards Citoyens",
    "extra": {
      "age": "",
      "job": "",
      "postal": ""
    },
    "firstName": "Regards",
    "fullName": "Regards Citoyens",
    "id": "59fc629dccdac63cb472b9d1",
    "lastName": "Citoyens"
  },
  "createdAt": "2017-11-07T12:23:07.854Z",
  "editedAt": "2017-11-07T20:28:14.920Z",
  "flags": [],
  "id": "5a01a5ab82abf78a2231d98e",
  "reference": "59d7335412406bdd5d6277e4",
  "replies": [],
  "repliesCount": 0,
  "score": 22,
  "text": "**Systématiser les scrutins publics sur les votes des lois et de leurs articles**\n\nLa Constitution française donne deux missions au Parlement : contrôler l'action du gouvernement et voter la loi. Si les missions de contrôle font l'objet d'une transparence satisfaisante, le Parlement reste encore à ce jour assez opaque en ce qui concerne le vote de la loi.\n\nEn effet, l'immense majorité des scrutins réalisés en commission comme en plénière ne font pas l'objet d'un relevé des votes mais simplement d'un décompte à main levée dont seul le résultat est notifié. Seuls quelques rares votes sont effectivement enregistrés par la pratique des scrutins dits publics et solennels, réalisés au Sénat dans des urnes à la tribune et électroniquement à l'Assemblée nationale.\n\nSi le nombre d'amendements mis au vote est tel que systématiser les scrutins publics pourrait paraître complexe, il semble pour autant anormal que les citoyens ne soient pas en mesure de connaître a minima la position de leurs représentants sur les grandes lignes des lois votées au Parlement. À défaut de réaliser des scrutins publics pour l'ensemble des amendements, un socle minimal de transparence de la procédure pourrait être assuré en systématisant les scrutins publics sur chacun des articles des lois amendées.\n\nUn raccourcissement du délai prévu au règlement entre l'annonce d'un scrutin public et sa tenue pourrait également être envisagé afin de fluidifier le déroulement des débats.\n\nIl est en revanche crucial de ne pas tendre à une bureaucratisation des votes : les parlementaires doivent voter dans la foulée du débat sur chacun des amendements et des articles et surtout pas en enchaînant d'un bloc un ensemble de votes à la chaîne lors d'une série de scrutins décorrélés du débat. La méthode du Parlement Européen consistant à organiser des séances de débats, puis séparément des séances de votes en série sont absolument incompréhensibles par les citoyens. Il en est de même pour le mécanisme des secondes délibérations que peuvent aujourd'hui demander le Gouvernement ou le président de la commission saisie au fond ; aujourd'hui permises par la Constitution, celles-ci sont à proscrire : le résultat d'un vote devrait être le résultat du consensus obtenu sur les bancs entre les députés ayant participé au débat et certainement pas un simple entérinement politique d'une décision prise en dehors de la procédure parlementaire."
}