{
  "author": {
    "avatar": "https://secure.gravatar.com/avatar/f71a93c2cdb49babde6fb8edd3475922?d=mm",
    "displayName": "Dominique MICHEL",
    "extra": {
      "age": "4",
      "job": "6",
      "postal": "54320"
    },
    "firstName": "Dominique",
    "fullName": "Dominique MICHEL",
    "id": "59fee6f682abf78a22319633",
    "lastName": "MICHEL"
  },
  "createdAt": "2017-11-05T10:52:14.687Z",
  "flags": [],
  "id": "59feed5e82abf78a22319866",
  "reference": "59d731a712406bdd5d6277d1",
  "replies": [],
  "repliesCount": 0,
  "score": 0,
  "text": "Une démocratie, c’est par le peuple… Alors il faut utiliser la proximité et l’outil informatique. Chaque citoyen devrait pouvoir poser LA question qui lui tient le plus à cœur sur un site de sa circonscription et visible par tous. Si cette question obtient un certain % ( par exemple 5% des inscrits), alors le député prends le relais en invitant un groupe constitué de 10 citoyens afin de lancer une consultation dans sa circonscription. Si cette dernière obtient un seuil à définir, alors elle est lancée dans la région puis si succès au niveau national. Nous avons les idées, les outils ALORS passons à l’action."
}