{
  "author": {
    "avatar": "https://secure.gravatar.com/avatar/915cda733238c99f885d8d9f1a90ebf0?d=mm",
    "displayName": "Catherine Montagne",
    "extra": {
      "age": "4",
      "job": "8",
      "postal": "75014"
    },
    "firstName": "Catherine",
    "fullName": "Catherine Montagne",
    "id": "59ff9af582abf78a2231bbd2",
    "lastName": "Montagne"
  },
  "createdAt": "2017-11-05T23:31:51.785Z",
  "flags": [],
  "id": "59ff9f6782abf78a2231bc7c",
  "reference": "59d7325812406bdd5d6277d4",
  "replies": [],
  "repliesCount": 0,
  "score": 1,
  "text": "Créer une plateforme numérique accessible aux citoyens inscrits, et complémentaire de l'activité des députés ou sénateurs au parlement."
}