{
  "author": {
    "avatar": "https://lh5.googleusercontent.com/-4o4CiyJeKBY/AAAAAAAAAAI/AAAAAAAAClg/Y4a4IjXvfz0/photo.jpg?sz=50",
    "displayName": "Romain FARSAT",
    "firstName": "Romain",
    "fullName": "Romain FARSAT",
    "id": "59fb9081ccdac63cb472b80b",
    "lastName": "FARSAT"
  },
  "createdAt": "2017-11-03T16:45:43.326Z",
  "editedAt": "2017-11-03T17:20:55.776Z",
  "flags": [],
  "id": "59fc9d37ccdac63cb472bb23",
  "reference": "59d733cb12406bdd5d6277ea",
  "replies": [
    {
      "_id": "59fc9fb9ccdac63cb472bb33",
      "author": {
        "avatar": "https://secure.gravatar.com/avatar/49d8327157c43e976dc7102a5e26f591?d=mm",
        "displayName": "Catalina Plaino",
        "extra": {
          "age": "2",
          "job": "1",
          "postal": "75014"
        },
        "firstName": "Catalina",
        "fullName": "Catalina Plaino",
        "id": "59fc9effccdac63cb472bb2f",
        "lastName": "Plaino"
      },
      "createdAt": "2017-11-03T16:56:25.645Z",
      "text": "Totalement d’accord !!! "
    },
    {
      "_id": "59ff601982abf78a2231b27e",
      "author": {
        "avatar": "https://graph.facebook.com/10155194011993473/picture",
        "displayName": "Gaël Gendre",
        "firstName": "Gaël",
        "fullName": "Gaël Gendre",
        "id": "59ff5ff882abf78a2231b276",
        "lastName": "Gendre"
      },
      "createdAt": "2017-11-05T19:01:45.932Z",
      "text": "Très bonne idée"
    },
    {
      "_id": "59ff743182abf78a2231b5a9",
      "author": {
        "avatar": "https://secure.gravatar.com/avatar/bc3923be5523a889cd84e5a114be91bf?d=mm",
        "displayName": "Marvin M",
        "extra": {
          "age": "2",
          "job": "",
          "postal": ""
        },
        "firstName": "Marvin",
        "fullName": "Marvin M",
        "id": "59ff73d582abf78a2231b596",
        "lastName": "M"
      },
      "createdAt": "2017-11-05T20:27:29.699Z",
      "text": "Intéressant "
    },
    {
      "_id": "59ff81b582abf78a2231b857",
      "author": {
        "avatar": "https://secure.gravatar.com/avatar/41b42d4d72082fc2baaafedc98e56a75?d=mm",
        "displayName": "Vianney Descout",
        "extra": {
          "age": "2",
          "job": "2",
          "postal": "75014"
        },
        "firstName": "Vianney",
        "fullName": "Vianney Descout",
        "id": "59ff817782abf78a2231b845",
        "lastName": "Descout"
      },
      "createdAt": "2017-11-05T21:25:09.576Z",
      "text": "Génial ! bravo"
    },
    {
      "_id": "5a0046ee82abf78a2231c795",
      "author": {
        "avatar": "https://secure.gravatar.com/avatar/5f3c5cc0d99d1331a5bde51852a7bb1e?d=mm",
        "displayName": "Steeve Haggege",
        "extra": {
          "age": "3",
          "job": "5",
          "postal": "75003"
        },
        "firstName": "Steeve",
        "fullName": "Steeve Haggege",
        "id": "5a00467c82abf78a2231c78b",
        "lastName": "Haggege"
      },
      "createdAt": "2017-11-06T11:26:38.672Z",
      "text": "Proposition très interessante\n"
    },
    {
      "_id": "5a00888382abf78a2231cd58",
      "author": {
        "avatar": "https://secure.gravatar.com/avatar/ed60b6303393a0c9dd707a3bf90e3e99?d=mm",
        "displayName": "Karim Benzakour",
        "extra": {
          "age": "2",
          "job": "2",
          "postal": "75017"
        },
        "firstName": "Karim",
        "fullName": "Karim Benzakour",
        "id": "5a00880f82abf78a2231cd53",
        "lastName": "Benzakour"
      },
      "createdAt": "2017-11-06T16:06:27.823Z",
      "text": "Excellente idée !"
    },
    {
      "_id": "5a019e1d82abf78a2231d900",
      "author": {
        "avatar": "https://secure.gravatar.com/avatar/093df862ddf259ac6210a38a9aa49552?d=mm",
        "displayName": "Anais Germain",
        "extra": {
          "age": "2",
          "job": "2",
          "postal": "75018"
        },
        "firstName": "Anais",
        "fullName": "Anais Germain",
        "id": "5a019d6d82abf78a2231d8f8",
        "lastName": "Germain"
      },
      "createdAt": "2017-11-07T11:50:53.294Z",
      "text": "Super! "
    },
    {
      "_id": "5a0320e182abf78a2231e65b",
      "author": {
        "avatar": "https://lh3.googleusercontent.com/-XdUIqdMkCWA/AAAAAAAAAAI/AAAAAAAAAAA/4252rscbv5M/photo.jpg?sz=50",
        "displayName": "Seb ez",
        "firstName": "Seb",
        "fullName": "Seb ez",
        "id": "5a031d3082abf78a2231e64a",
        "lastName": "ez"
      },
      "createdAt": "2017-11-08T15:21:05.820Z",
      "text": "Merci pour cette proposition, quelles idées pour la mise en place?\nNe serait-il pas utile d'allier cet instrument à une pétition? Sinon, l'amendement, déjà pomme de discorde pour son utilisation comme pavé de barricade législative sera d'autant plus dénigré. L'obstacle le plus important pour moi est ensuite la substitution du lobbyiste au citoyen."
    },
    {
      "_id": "5a0339be1c7d53dc73dba496",
      "author": {
        "avatar": "https://lh5.googleusercontent.com/-4o4CiyJeKBY/AAAAAAAAAAI/AAAAAAAAClg/Y4a4IjXvfz0/photo.jpg?sz=50",
        "displayName": "Romain FARSAT",
        "firstName": "Romain",
        "fullName": "Romain FARSAT",
        "id": "59fb9081ccdac63cb472b80b",
        "lastName": "FARSAT"
      },
      "createdAt": "2017-11-08T17:07:10.450Z",
      "text": "La proposition propose l'outil, sa mise en place effective arrivera dans un second temps. La pétition n'est pas adaptée dans le cas présent, celle-ci sert à mobiliser pour défendre une cause et requiert un certain temps pour atteindre cet objectif. Un amendement est une amélioration ou un affinement d'un article de loi avec un temps législatif assez court, la pétition n'est donc pas utilisable. On pourrait penser à un système de votes mais cela pourrait vite conduire à un lobbying qui serait malsain ; c'est pour cela que ce ne soit pas être au citoyen de choisir, de mon point de vue, ce qui est pertinent à défendre ou non."
    }
  ],
  "repliesCount": 9,
  "score": 124,
  "text": "Le citoyen doit pouvoir être force de proposition dans la loi, pour cela il devrait pouvoir soumettre des **Amendements Citoyens**.\nEn effet lors des discussions en commission, on peut être exaspéré par certains amendements, tout autant que l'on peut ressentir l'envie de faire entendre sa voix.\n\nPour ce faire, il faudrait : \n\n1) Créer une plateforme sur laquelle serait référencé l'ensemble des articles de lois qui vont être discutés en audition publique dans la semaine ou sur une période à définir.\n\n2) Chaque citoyen (selon des conditions à déterminer, p.e. avoir ses droits civiques, être français, etc.) pourra proposer son amendement dans ses propres mots pour chacun des articles discutés.\n\n3) Dans chaque commission des députés (des **\"Rapporteurs citoyens\"**) seraient chargés de filtrer et sélectionner les amendements les plus pertinents pour les soumettre à réécriture auprès des services juridiques de l'assemblée.\n\n4) Durant les discussions sur les articles en question, ces mêmes députés porteraient ces amendements en mentionnant leur qualité d’amendement citoyen.\n\nBeaucoup de critères sont à déterminer notamment vis à vis des conditions de soumission d'un amendement et du porte-parole mais il est à mon avis le meilleur moyen pour faire participer le citoyen directement au sein des commissions."
}