{
  "author": {
    "avatar": "https://secure.gravatar.com/avatar/5ea7680b0726da67f8234c956dcfad6f?d=mm",
    "displayName": "Estelle Lê",
    "extra": {
      "age": "3",
      "job": "2",
      "postal": "75017"
    },
    "firstName": "Estelle",
    "fullName": "Estelle Lê",
    "id": "59ff03e182abf78a22319e34",
    "lastName": "Lê"
  },
  "createdAt": "2017-11-05T21:40:33.419Z",
  "flags": [],
  "id": "59ff855182abf78a2231b91e",
  "reference": "59d733cb12406bdd5d6277ea",
  "replies": [],
  "repliesCount": 0,
  "score": 0,
  "text": "Il me semble que l'un des premiers objectifs à atteindre est celui de l'accessibilité et de la lisibilité des projets ou propositions de lois, mais également des amendements dès avant leur passage en commission. Afin que les citoyens soient impliqués régulièrement dans les travaux législatifs, j'aimerais proposer qu'au niveau de chaque groupe parlementaire soit imposé de recueillir un certain nombre de \"parrainages citoyens\" pour certains amendements déposés par le groupe (votes via la plateforme de l'assemblée, sous réserve de certains contrôles pour éviter les fraudes). Le nombre de parrainages est à débattre mais on pourrait fixer 3 à 5000 votes pour  5 à 10 % des amendements déposés dans l'année. En complément de ce système, des amendements d'initiative citoyenne pourraient également être proposés, toutefois, compte tenu du temps législatif, il faudrait être en mesure de proposer des \"alertes\" thématiques via la plateforme ainsi qu'une aide rédactionnelle pour que les idées proposées soient traduites en termes juridiques."
}