{
  "author": {
    "avatar": "https://secure.gravatar.com/avatar/9721de9621be8c6d341ebe59bacc6f7e?d=mm",
    "displayName": "terny myriam",
    "extra": {
      "age": "3",
      "job": "3",
      "postal": "86000"
    },
    "firstName": "terny",
    "fullName": "terny myriam",
    "id": "59f76875e8a9656c1a8e7679",
    "lastName": "myriam"
  },
  "createdAt": "2017-11-02T20:54:28.348Z",
  "flags": [],
  "id": "59fb8604ccdac63cb472b7de",
  "reference": "59d731a712406bdd5d6277d1",
  "replies": [],
  "repliesCount": 0,
  "score": -1,
  "text": "La mise en place d'un plan national de formation aux usages numériques pour tous les citoyens.\nLes chiffres sont mauvais avec un Français sur cinq demeure \"en dehors\" du numérique, ne maîtrisant ni les outils ni les usages.\nIl est donc légitime d'envisager d'en faire une priorité."
}