{
  "author": {
    "avatar": "https://secure.gravatar.com/avatar/cf5404552b09eb8f601f221e17a4b77a?d=mm",
    "displayName": "Richard NOWAK",
    "extra": {
      "age": "5",
      "job": "6",
      "postal": "54700"
    },
    "firstName": "Richard",
    "fullName": "Richard NOWAK",
    "id": "59ff948482abf78a2231bb14",
    "lastName": "NOWAK"
  },
  "createdAt": "2017-11-05T23:14:43.364Z",
  "flags": [],
  "id": "59ff9b6382abf78a2231bbe0",
  "reference": "59d731a712406bdd5d6277d1",
  "replies": [],
  "repliesCount": 0,
  "score": 0,
  "text": "Actuellement, il n'est plus possible de rester dans le petit cadre de l'Assemblée dit Nationale pour répondre aux problèmes de niveau global, de niveau intermédiaire et de niveau local.\nLe niveau local correspond à l'intérêt de mettre en commun et de pouvoir sauvegarder et entretenir ce que nous avons de plus précieux, à l'heure de d'évolution climatique engagée, à savoir notre intelligence. Les structures telles que le département, la nation, ne suffisent plus à répondre à la problématique de mutation, de métamorphose, engagées. Le niveau local doit bénéficier d'un centre d'Information pour résoudre tous les problème dits quotidiens et notamment ceux de formation, éducation, et maintien de la santé et de la sécurité locale. Pour cela une mini structure de pouvoir d'information, de législation de préparation budgétaire et de projets, de décision donc, exécutive, et enfin de bilan, donc judiciaire est à mettre en place. En groupant les niveaux locaux, nous obtenons une structure intermédiaire, la région, pour assurer la liberté notamment de circulation (au moins 8 millions d'habitants). Les régions se regroupent, se fédéralisent au niveau européen. La république nationale actuelle est un blocage majeur pour permettre la libération de toutes les intelligences sur l'aire spatiales actuelle de la France. Le premier enjeu, après avoir assuré le pain quotidien, est de développer les capacités de réflexion de toute la population. Actuellement les connexions entre les intelligences sont au niveau zéro des capacités. Les moyens sont aux mains d'entités occupées à s'enrichir quantitativement en privilégiant l'immédiateté au détriment de la globalité, pas de promouvoir l'intelligence comme outil commun pour relever le défi de la métamorphose climatique, entre autres, qui s'accélère. Les forces de régression et de repli sur soi, les carcans des monopoles et les habitudes établies dont la configuration politique à l’œuvre assemblée, dite nationale, actuelle font aussi partie, sont à lœuvre. Nous avons un pouvoir exécutif pour gérer le quotidien mais nous n'avons pas de projet viable à long terme. Une réponse existe, Libre UE 5.2, et ses annexes, Contrat constitutionnel, le plan A, Grand Est, Le niveau local pour compléter le dispositif sont à dispositif de qui voudra bien s'en saisir."
}