{
  "author": {
    "avatar": "https://secure.gravatar.com/avatar/2b89d14c4d2aa5f175bf8b1120376863?d=mm",
    "displayName": "Conseil national du numérique (CNNum)",
    "extra": {
      "age": "3",
      "job": "3",
      "postal": "75013"
    },
    "firstName": "Conseil national du numérique",
    "fullName": "Conseil national du numérique (CNNum)",
    "id": "59fc4e03ccdac63cb472b970",
    "lastName": "(CNNum)"
  },
  "createdAt": "2017-11-03T11:09:57.777Z",
  "flags": [],
  "id": "59fc4e85ccdac63cb472b973",
  "reference": "59d7347212406bdd5d6277f7",
  "replies": [],
  "repliesCount": 0,
  "score": 1,
  "text": "Préalable : Reconnaître la diversité des modes de contribution citoyenne dans la fabrique de la loi. \n\nLa consultation des citoyens sur un texte de loi, en amont ou au cours de l’examen au Parlement, n’est pas l’alpha et l’oméga de la participation citoyenne. Il serait nécessaire de faire un inventaire des différents modes de participation citoyenne possibles à chaque étape de la loi, que ce soit le lancement d’un débat en ligne sur un thème donné, l’ouverture des études d'impact aux commentaires, l’enrichissement des documents de travail des commissions parlementaires, etc. Cet inventaire permettrait de mieux identifier les caractéristiques de chaque mode de contribution citoyenne : les besoins spécifiques auxquels il répond, les conditions de l’engagement citoyen, et la valeur ajoutée qu’il apporte"
}