{
  "author": {
    "avatar": "https://secure.gravatar.com/avatar/bb4a867635a4e94270d281a2ce296c24?d=mm",
    "displayName": "Kévin SAK",
    "extra": {
      "age": "3",
      "job": "3",
      "postal": "35136"
    },
    "firstName": "Kévin",
    "fullName": "Kévin SAK",
    "id": "59fdaf61e7c9379d2c5624bb",
    "lastName": "SAK"
  },
  "createdAt": "2017-11-05T18:43:13.141Z",
  "flags": [],
  "id": "59ff5bc182abf78a2231b1b7",
  "reference": "59d7325812406bdd5d6277d4",
  "replies": [],
  "repliesCount": 0,
  "score": 1,
  "text": "-\tLREM : permanence : assistance, café citoyen\n-\tNational : Service civique, mairies, services publiques (attention à la place de l’agent publique)\n\nContribution collective du comité LREM Rennes Centre Sud"
}