{
  "author": {
    "avatar": "https://secure.gravatar.com/avatar/f2d952fa6e273f6f015dd25e3e577966?d=mm",
    "displayName": "Charles MARION",
    "extra": {
      "age": "5",
      "job": "6",
      "postal": "31400"
    },
    "firstName": "Charles",
    "fullName": "Charles MARION",
    "id": "59fdf33682abf78a22315363",
    "lastName": "MARION"
  },
  "createdAt": "2017-11-04T18:34:58.107Z",
  "flags": [],
  "id": "59fe085282abf78a223167bf",
  "reference": "59d7335412406bdd5d6277e4",
  "replies": [],
  "repliesCount": 0,
  "score": 1,
  "text": "Les recours au Conseil Constitutionnel doivent être totalement transparents et les décisions du Conseil Constitutionnel argumentées, motivées et citant les personnes ou organismes ou société qui ont déposé un mémoire pour contester la constitutionnalité d'une loi. Les décisions de fin 2016 sur l'imposition des multinationales votée par le parlement mais annulés par le Conseil Constitutionnel est incompréhensible pour les citoyens contribuables qui ne savent qui a fait ce recours ni ses motivations détaillées. Dans les autres décisions de justice, cours de cassation, cours d'appel, les parties demandeur et demanderesse sont citées ainsi que les motivations des uns et des autres et celles retenues pour la décision."
}