{
  "author": {
    "avatar": "https://secure.gravatar.com/avatar/df217180349a05613cae94620ced4fa2?d=mm",
    "displayName": "Odile RIAND",
    "extra": {
      "age": "4",
      "job": "6",
      "postal": "85110"
    },
    "firstName": "Odile",
    "fullName": "Odile RIAND",
    "id": "59fdf99b82abf78a22315a14",
    "lastName": "RIAND"
  },
  "createdAt": "2017-11-04T17:34:45.481Z",
  "flags": [],
  "id": "59fdfa3582abf78a22315ad1",
  "reference": "59d734d112406bdd5d6277ff",
  "replies": [],
  "repliesCount": 0,
  "score": 0,
  "text": "Agissons au lieu de subir"
}