{
  "author": {
    "avatar": "https://graph.facebook.com/10210451747189320/picture",
    "displayName": "Corentin Costard",
    "firstName": "Corentin",
    "fullName": "Corentin Costard",
    "id": "59dfb6b066914e1e8223840b",
    "lastName": "Costard"
  },
  "createdAt": "2017-10-12T19:06:57.619Z",
  "flags": [],
  "id": "59dfbd5166914e1e8223842e",
  "reference": "59d7335412406bdd5d6277e4",
  "replies": [],
  "repliesCount": 0,
  "score": 0,
  "text": "Je ne suis pas certain que ce soit au citoyen d'évaluer les lois. Ce travail nécessite une expertise importante que nous n'avons pas tous. Mais l'évaluation des politiques publiques manque cruellement en France. Il faut une institution pour ça."
}