{
  "author": {
    "avatar": "https://graph.facebook.com/10213389159870943/picture",
    "displayName": "So Dge",
    "firstName": "So",
    "fullName": "So Dge",
    "id": "59ecc8e066914e1e82239714",
    "lastName": "Dge"
  },
  "createdAt": "2017-10-28T23:25:59.283Z",
  "flags": [],
  "id": "59f51207e8a9656c1a8e7210",
  "reference": "59d7335412406bdd5d6277e4",
  "replies": [],
  "repliesCount": 0,
  "score": 0,
  "text": "En ce qui concerne l’évaluation de la mise en oeuvre des lois ! Je propose un débat entre les différents acteurs (représentants du gouvernement ou du parlement et partenaires sociaux) avec un moment de réponse aux questions populaires qui ont eu le plus de succès (sur une plateforme en ligne de questions avec notation de ces questions par le peuple) et après le débat un vote sous forme de référendum en ligne avec la question simple : approuvez- vous la mise en oeuvre ou non ! Si le résultat est non le représentant légal du gouvernement ou parlement devra représenter dans un délai décidé lors du débat un nouveau plan prenant en compte les remarques du débat ! Les personnes qui participent a ce genre d’initiative populaire pourraient le faire avec un identifiant lié à leur papier d’identité !"
}