{
  "author": {
    "avatar": "https://secure.gravatar.com/avatar/57db66f4b67c2dcd62b86c3918bdda20?d=mm",
    "displayName": "Sébastien  Piarulli",
    "extra": {
      "age": "2",
      "job": "2",
      "postal": "94300"
    },
    "firstName": "Sébastien ",
    "fullName": "Sébastien  Piarulli",
    "id": "59db7b719e1c7be85124ddb5",
    "lastName": "Piarulli"
  },
  "createdAt": "2017-10-09T13:41:43.608Z",
  "flags": [],
  "id": "59db7c979e1c7be85124ddbd",
  "reference": "59d734d112406bdd5d6277ff",
  "replies": [
    {
      "_id": "59db7dcd9e1c7be85124ddd3",
      "author": {
        "avatar": "https://graph.facebook.com/10214470552577988/picture",
        "displayName": "Romain Riboldi",
        "extra": {
          "age": "3",
          "job": "7",
          "postal": "02100"
        },
        "firstName": "Romain",
        "fullName": "Romain Riboldi",
        "id": "59db7cf19e1c7be85124ddc5",
        "lastName": "Riboldi"
      },
      "createdAt": "2017-10-09T13:46:53.995Z",
      "text": "500.000 semble un bon compromis "
    },
    {
      "_id": "59db976e9e1c7be85124def6",
      "author": {
        "avatar": "https://pbs.twimg.com/profile_images/892517128343101440/VxhgBfWY_400x400.jpg",
        "displayName": "Bérenger Ambroise",
        "extra": {
          "age": "1",
          "job": "1",
          "postal": "54300"
        },
        "firstName": "Bérenger",
        "fullName": "Bérenger Ambroise",
        "id": "59db79549e1c7be85124dd99",
        "lastName": "Ambroise"
      },
      "createdAt": "2017-10-09T15:36:14.520Z",
      "text": "Et pourquoi forcément des électeurs ? La jeunesse est également force de proposition !  ;-) \nL'idée semble bonne mais à revoir sur certains points : 1 million est beaucoup et l'obligation de débat semble un peu forte. De plus, quand débattre des propositions citoyennes ? Rappelons que le calendrier parlementaire est déjà bien rempli, il faut trouver une solution à ce niveau à mon sens."
    },
    {
      "_id": "59dba1b89e1c7be85124df59",
      "author": {
        "avatar": "https://graph.facebook.com/10214206201773510/picture",
        "displayName": "Myriam Decaudain",
        "firstName": "Myriam",
        "fullName": "Myriam Decaudain",
        "id": "59db9e619e1c7be85124df3b",
        "lastName": "Decaudain"
      },
      "createdAt": "2017-10-09T16:20:08.244Z",
      "text": "Un million de signataires me semble énorme et peut-être difficile à atteindre. Je penche plutôt pour une proposition médiane avec celle de Romain Riboldi, ou disons plus proche de la sienne, 300 000. \n"
    },
    {
      "_id": "59dc6cee9e1c7be85124e1d0",
      "author": {
        "avatar": "https://secure.gravatar.com/avatar/1b14d6133f32b6906ebdc38faea7da44?d=mm",
        "displayName": "François MORELLE",
        "extra": {
          "age": "3",
          "job": "2",
          "postal": "35520"
        },
        "firstName": "François",
        "fullName": "François MORELLE",
        "id": "59dc6a959e1c7be85124e1bc",
        "lastName": "MORELLE"
      },
      "createdAt": "2017-10-10T06:47:10.003Z",
      "text": "Je suis d'accord. Le droit de vote est une chose. Le droit d'avoir des idées en est une autre. On a vu beaucoup d'exemples dans lesquels des enfants ont eu des idées (scientifiques ou autres). De toute façon en dernier lieu, c'est l'assemblée qui valide et qui vote. Je pense qu'il n'est pas nécessaire de réserver ce \"droit\" aux électeurs. Mais sinon l'idée est intéressante."
    },
    {
      "_id": "59dc7f4f9e1c7be85124e228",
      "author": {
        "avatar": "https://pbs.twimg.com/profile_images/892517128343101440/VxhgBfWY_400x400.jpg",
        "displayName": "Bérenger Ambroise",
        "extra": {
          "age": "1",
          "job": "1",
          "postal": "54300"
        },
        "firstName": "Bérenger",
        "fullName": "Bérenger Ambroise",
        "id": "59db79549e1c7be85124dd99",
        "lastName": "Ambroise"
      },
      "createdAt": "2017-10-10T08:05:35.640Z",
      "text": "Tout à fait @François, d'autant plus que si l'on arrive à donner le goût de la chose publique aux jeunes, le passage au numérique allant déjà en ce sens, ce sera également quelque chose de réussi. \nEt je pencherai pour ma part pour 750.000 votants : 1million étant beaucoup et 500.000 assez faible. Il faut que le palier soit accessible mais demeure quelque chose qui doive être mérité et ne pas devoir examiner des dizaines et des dizaines de propositions constamment."
    },
    {
      "_id": "59dc801c9e1c7be85124e239",
      "author": {
        "avatar": "https://secure.gravatar.com/avatar/1b14d6133f32b6906ebdc38faea7da44?d=mm",
        "displayName": "François MORELLE",
        "extra": {
          "age": "3",
          "job": "2",
          "postal": "35520"
        },
        "firstName": "François",
        "fullName": "François MORELLE",
        "id": "59dc6a959e1c7be85124e1bc",
        "lastName": "MORELLE"
      },
      "createdAt": "2017-10-10T08:09:00.268Z",
      "text": "Oui effectivement je pense qu'il faut fixer un plafond relativement important, tout en mettant tout en oeuvre pour inciter un maximum de citoyens à participer (en n'oubliant pas la fracture numérique par exemple - voir la typologie concernée). J'imagine en cela des agents \"itinérants\" chargés entre autres de collecter les propositions des citoyens n'ayant pas ou ayant peu accès aux outils numériques de participation. "
    },
    {
      "_id": "59e27ffb66914e1e822385bc",
      "author": {
        "avatar": "https://secure.gravatar.com/avatar/52f928319877619ce46eac27dd754b4d?d=mm",
        "displayName": "Martin Sanchez",
        "extra": {
          "age": "2",
          "job": "8",
          "postal": "69600"
        },
        "firstName": "Martin",
        "fullName": "Martin Sanchez",
        "id": "59e27eb166914e1e822385b7",
        "lastName": "Sanchez"
      },
      "createdAt": "2017-10-14T21:22:03.307Z",
      "text": "Il est vrai qu'il faut que l'assemblée ne peut pas étudier toutes les propositions citoyennes néanmoins 750 000 me semble un palier un peu haut en prenant en compte le fait que malgré tous les efforts pouvant être déployés, trop peu de citoyens iront réellement voter ces propositions"
    },
    {
      "_id": "59e2b30366914e1e8223861e",
      "author": {
        "avatar": "https://secure.gravatar.com/avatar/5352dfd7b9e800b5b5930844a2271649?d=mm",
        "displayName": "Bastien Girard",
        "extra": {
          "age": "2",
          "job": "1",
          "postal": "77123"
        },
        "firstName": "Bastien",
        "fullName": "Bastien Girard",
        "id": "59e2abc766914e1e82238613",
        "lastName": "Girard"
      },
      "createdAt": "2017-10-15T00:59:47.450Z",
      "editedAt": "2017-10-15T01:00:58.760Z",
      "text": "Je suis entièrement d'accord avec vous, mais je pense qu'il failler fixer le palier légitime pour le dépot de proposition de loi en comparaison avec la légitimité d'un parlementaire qui a ce pouvoir de dépot: regarder dans le détail combien il faut au minimum de voix pour élire un député dans la législature actuelle. Surtout, il faut mettre un place un système qui s'assure que les propositions ne soient pas juste déposées (ce qui est actuellement souvent le cas à l'AN) mais effectivement examinées et délibérées. "
    },
    {
      "_id": "59f76e67e8a9656c1a8e76b4",
      "author": {
        "avatar": "https://secure.gravatar.com/avatar/5e09aeb7a890002251b2606a4f9a5445?d=mm",
        "displayName": "François  Temoin",
        "extra": {
          "age": "5",
          "job": "6",
          "postal": "57100"
        },
        "firstName": "François ",
        "fullName": "François  Temoin",
        "id": "59f76b94e8a9656c1a8e769d",
        "lastName": "Temoin"
      },
      "createdAt": "2017-10-30T18:24:39.078Z",
      "text": "Pour éviter de s'immerger l'assemblée, un seuil haut (750 000 à 1 000 000 ) me semble preferable"
    },
    {
      "_id": "59fcd07fccdac63cb472bdb5",
      "author": {
        "avatar": "https://graph.facebook.com/1857494607612083/picture",
        "displayName": "Crystelle Vbr",
        "firstName": "Crystelle",
        "fullName": "Crystelle Vbr",
        "id": "59fccdf1ccdac63cb472bd59",
        "lastName": "Vbr"
      },
      "createdAt": "2017-11-03T20:24:31.601Z",
      "text": "Une plateforme numérique nationale et des plateformes locales, au niveau de la ville ou du département. Sans forcément formuler un projet de loi, les citoyens pourraient soumettre en ligne leurs idées et ensuite aux autorités publiques de s'en inspirer ! Il y a tellement de choses à tirer des cervelles françaises....\n Par exemple, la BD de Pénélope Bagieux dans laquelle elles demandent à des jeunes de 18 ans ce qu'ils feraient s'ils étaient au pouvoir...."
    },
    {
      "_id": "59fcd30eccdac63cb472be12",
      "author": {
        "avatar": "https://graph.facebook.com/1857494607612083/picture",
        "displayName": "Crystelle Vbr",
        "firstName": "Crystelle",
        "fullName": "Crystelle Vbr",
        "id": "59fccdf1ccdac63cb472bd59",
        "lastName": "Vbr"
      },
      "createdAt": "2017-11-03T20:35:26.257Z",
      "text": "http://abonnes.lemonde.fr/festival/visuel/2016/09/07/agir-mais-pour-faire-quoi_4994096_4415198.html#/chapters/01/pages/18"
    },
    {
      "_id": "59fdf76f82abf78a2231581c",
      "author": {
        "avatar": "https://secure.gravatar.com/avatar/cea519537f2256a1714bfd6459767629?d=mm",
        "displayName": "random citoyen",
        "extra": {
          "age": "2",
          "job": "2",
          "postal": "75000"
        },
        "firstName": "random",
        "fullName": "random citoyen",
        "id": "59fdf3a082abf78a223153c2",
        "lastName": "citoyen"
      },
      "createdAt": "2017-11-04T17:22:55.453Z",
      "text": "Bonne idée. Idéalement ce serait bien que cette plateforme soit fait avec des logiciels libres et que le code de cette plateforme soit également en libre accès.  Histoire que la transparence des engrenages de cette plateforme nous invite à avoir confiance en celle-ci."
    },
    {
      "_id": "59fe4f4982abf78a2231809e",
      "author": {
        "avatar": "https://secure.gravatar.com/avatar/018157ca9a723be6b9e91c0fe97cd3b0?d=mm",
        "displayName": "Charlie Tessier",
        "extra": {
          "age": "2",
          "job": "",
          "postal": ""
        },
        "firstName": "Charlie",
        "fullName": "Charlie Tessier",
        "id": "59fe4eac82abf78a2231808d",
        "lastName": "Tessier"
      },
      "createdAt": "2017-11-04T23:37:45.289Z",
      "editedAt": "2017-11-04T23:38:02.294Z",
      "text": "L'avantage de n'accepter que les proposition et votes avec identification du N° de carte électorale c'est qu'on peut quantifier et s'assurer du nombre de vote, sinon comment fait on, avec l'adresse mail?"
    },
    {
      "_id": "59fe7a9082abf78a2231830e",
      "author": {
        "avatar": "https://secure.gravatar.com/avatar/5352dfd7b9e800b5b5930844a2271649?d=mm",
        "displayName": "Bastien Girard",
        "extra": {
          "age": "2",
          "job": "1",
          "postal": "77123"
        },
        "firstName": "Bastien",
        "fullName": "Bastien Girard",
        "id": "59e2abc766914e1e82238613",
        "lastName": "Girard"
      },
      "createdAt": "2017-11-05T02:42:24.636Z",
      "text": "Cette question technique doit effectivement demeurer au coeur de la reflexion.  Quelques risques (à débattre): qu'une personne vote plusieurs fois, qu'elle ne soit pas de nationalité française, qu'elle ne puisse accéder à la plateforme (fracture numerique). Le num de carte électorale semble etre une bonne idée, bien que nous puissions considérer ouvrir ce droit de parole politique à des non citoyens (jeunes, immigrés). "
    },
    {
      "_id": "5a00916e82abf78a2231ce1a",
      "author": {
        "avatar": "https://secure.gravatar.com/avatar/04b10df6ce4e6786773823d9be50123e?d=mm",
        "displayName": "Grégory Bertrand",
        "extra": {
          "age": "3",
          "job": "3",
          "postal": "75015"
        },
        "firstName": "Grégory",
        "fullName": "Grégory Bertrand",
        "id": "5a008f8982abf78a2231cdc9",
        "lastName": "Bertrand"
      },
      "createdAt": "2017-11-06T16:44:30.912Z",
      "text": "La meilleure proposition : il faut une plateforme \"officielle\" pour éviter la confiscation des données (adresses mails etc.) par une firme, notamment américaine, même si elle donne le Change..."
    }
  ],
  "repliesCount": 15,
  "score": 189,
  "text": "Il pourrait être créée une plateforme officielle et protégée de l'Assemblée Nationale qui permettrait à chaque personne ayant le droit de vote (identification avec le n° de la carte électorale par exemple) , de proposer des idées, faire des propositions de loi. Sur les propositions ayant reçu par exemple  1 millions de votes, l'Assemblée Nationale serait obligée de débattre le texte."
}