{
  "author": {
    "avatar": "https://graph.facebook.com/10213214569866300/picture",
    "displayName": "Philippe Remy",
    "firstName": "Philippe",
    "fullName": "Philippe Remy",
    "id": "59e71b4166914e1e82238d2e",
    "lastName": "Remy"
  },
  "createdAt": "2017-10-19T09:05:58.717Z",
  "flags": [],
  "id": "59e86af666914e1e8223905b",
  "reference": "59d7335412406bdd5d6277e4",
  "replies": [],
  "repliesCount": 0,
  "score": 0,
  "text": "Le diable est souvent dans les détails: décrets d'application, instructions administratives-opposables?-, modalités d'application qui sembleraient pouvoir de fait être contraires à l'esprit de la loi voire au texte de la loi, sans prendre en considération de fait le mode de calcul le plus avantageux pour le citoyen/l'usager.\nExemple : refus CARSAT de prendre en compte dans les 25 meilleures années la dernière année travaillée \"si elle n'est pas complète\"(exemple: travail en 2017 jusqu'au 31 aôut et demande de retraite à effet du 1er septembre).... sauf \"si la retraite est demandée à  effet du 1er janvier de l'année suivante\"(ce que le salarié futur retraité devrait savoir comment?). Le texte cité par la CARSAT pour ce refus prévoit pourtant expressément  :\n<< I.-Pour l'application de l'article L. 351-1, et sous réserve des dispositions des articles R. 173-4-3 et R. 351-29-1 le salaire servant de base au calcul de la pension est le salaire annuel moyen correspondant aux cotisations permettant la validation d'au moins un trimestre d'assurance selon les règles définies par l'article R. 351-9 et versées au cours des vingt-cinq années civiles d'assurance accomplies postérieurement au 31 décembre 1947 dont la prise en considération est la plus avantageuse pour l'assuré>>. \nCurieusement, la CARSAT refuse mais demande les bulletins de salaire mais ne s'en sert que pour vérifier le nombre de trimestres cotisés.\nEn pratique, il  serait tout à fait possible à la CARSAT  de faire AGIRC ARCCO un calcul provisoire en 2017 et de régulariser en 2018 lorsqu'elle a connaissance des salaires cotisés 2017.... comme elle le ferait dans le cas où pour une fin de travail au 31 août 2017 la retraite serait demandée à  effet du 1er janvier 2018.\nIl serait équitable que les modalités d'application soient clarifiées/révisées dans l'intérêt de l'assuré avec effet rétroactif, s'agissant d'une mesure d'intérêt général (comme l'effet rétroactif du permis à point). Qu'en pensez-vous?"
}