{
  "author": {
    "avatar": "https://secure.gravatar.com/avatar/e527cf2657a9a14c70055fb5dd5518c4?d=mm",
    "displayName": "Renaissance Numérique",
    "extra": {
      "age": "3",
      "job": "2",
      "postal": "75011"
    },
    "firstName": "Renaissance",
    "fullName": "Renaissance Numérique",
    "id": "59ee174c896da059218637d7",
    "lastName": "Numérique"
  },
  "createdAt": "2017-11-06T08:20:48.139Z",
  "editedAt": "2017-11-06T08:31:19.353Z",
  "flags": [],
  "id": "5a001b6082abf78a2231c0db",
  "reference": "59d734d112406bdd5d6277ff",
  "replies": [],
  "repliesCount": 0,
  "score": 1,
  "text": "- Proposition de Renaissance Numérique et la Fondation Jean Jaurès\n\nLes citoyens peuvent soumettre à discussion de l’Assemblée nationale une proposition de leur choix :\n\n- Comme cela s’opère déjà dans d’autres démocraties européennes, les citoyens doivent pouvoir mettre à l’ordre du jour des propositions pour discussion à l’Assemblée nationale, sur la base de ses compétences. Comme les questions au gouvernement, un moment du temps de la vie de l’Assemblée est consacré à ces questions, afin de se prononcer sur la proposition et la commenter. Si la proposition suscite l’intérêt ou l’adhésion de l’Assemblée, elle est alors transformée en décision formelle (proposition de loi, délibération), et adoptée selon les formes réglementaires. \n\n- Pour pouvoir être présentée aux institutions concernées, le texte ou la question doit recueillir au moins 5 % de signatures de l’électorat français concerné, réparties dans quatre régions sur treize pour une loi. \n\n[Proposition issue du Livre blanc \"Démocratie : Le réenchantement numérique\" : http://bit.ly/2zAPucV]"
}