{
  "author": {
    "avatar": "https://secure.gravatar.com/avatar/57db66f4b67c2dcd62b86c3918bdda20?d=mm",
    "displayName": "Sébastien  Piarulli",
    "extra": {
      "age": "2",
      "job": "2",
      "postal": "94300"
    },
    "firstName": "Sébastien ",
    "fullName": "Sébastien  Piarulli",
    "id": "59db7b719e1c7be85124ddb5",
    "lastName": "Piarulli"
  },
  "createdAt": "2017-10-09T13:42:37.350Z",
  "flags": [],
  "id": "59db7ccd9e1c7be85124ddc1",
  "reference": "59d733cb12406bdd5d6277ea",
  "replies": [
    {
      "_id": "59dd17c79b28097eb6b41a1f",
      "author": {
        "avatar": "https://secure.gravatar.com/avatar/03b6014ac927da400a55374bbbe5152a?d=mm",
        "displayName": "David Marchal",
        "extra": {
          "age": "2",
          "job": "2",
          "postal": "88500"
        },
        "firstName": "David",
        "fullName": "David Marchal",
        "id": "59dc8ec99e1c7be85124e2c5",
        "lastName": "Marchal"
      },
      "createdAt": "2017-10-10T18:56:07.012Z",
      "text": "Les amendements citoyens pourraient devoir passer un seuil de votes favorables pour être examinés. Bien sûr, vu le nombre d’amendements qui pourraient être déposés, peu de personnes risquent de les examiner, comme c’est le cas maintenant, donc, si le nombre de personnes examinant les amendements reste approximativement le même qu’actuellement, il faudrait un seuil significativement bas, comme quelques centaines, voire dizaines, de votes favorables, sinon, mieux, un pourcentage du nombre de personnes ayant examiné les amendements.\n\nUne fois ce seuil atteint, l’amendement devrait être présenté quoi qu’il arrive, et tout avis défavorable devrait être motivé clairement, sinon on risque de collectionner les laconiques \"Défavorable.\" sans justification."
    },
    {
      "_id": "59dd36ad9b28097eb6b41a9b",
      "author": {
        "avatar": "https://lh3.googleusercontent.com/-wx7emq5Pq4g/AAAAAAAAAAI/AAAAAAAAAng/UEChbesuT6E/photo.jpg?sz=50",
        "displayName": "Adrien FABRE",
        "firstName": "Adrien",
        "fullName": "Adrien FABRE",
        "id": "59dcfa559b28097eb6b41945",
        "lastName": "FABRE"
      },
      "createdAt": "2017-10-10T21:07:57.832Z",
      "text": "Tout simplement, les députés favorables aux amendements proposés par les citoyens pourront les déposer officiellement."
    },
    {
      "_id": "59dd36c49b28097eb6b41aa0",
      "author": {
        "avatar": "https://lh3.googleusercontent.com/-wx7emq5Pq4g/AAAAAAAAAAI/AAAAAAAAAng/UEChbesuT6E/photo.jpg?sz=50",
        "displayName": "Adrien FABRE",
        "firstName": "Adrien",
        "fullName": "Adrien FABRE",
        "id": "59dcfa559b28097eb6b41945",
        "lastName": "FABRE"
      },
      "createdAt": "2017-10-10T21:08:20.025Z",
      "text": "Pourquoi seulement \"dans des domaines précis\" ? Dans tous les domaines !"
    },
    {
      "_id": "59df612e66914e1e82238392",
      "author": {
        "avatar": "https://lh3.googleusercontent.com/-wx7emq5Pq4g/AAAAAAAAAAI/AAAAAAAAAng/UEChbesuT6E/photo.jpg?sz=50",
        "displayName": "Adrien FABRE",
        "firstName": "Adrien",
        "fullName": "Adrien FABRE",
        "id": "59dcfa559b28097eb6b41945",
        "lastName": "FABRE"
      },
      "createdAt": "2017-10-12T12:33:50.901Z",
      "text": "Sí ce n'est une consultation (ce que nous souhaitons tous deux), les députés n'ont pas l'obligation d'en tenir compte pour déposer des amendements. C'est simplement un outil pour que des personnes qui ne se connaissent pas débattent. Dans cette optique, le débat doit être permanent et libre. Si ce n'est pas à une plateforme de stricte consultation que vous pensiez, j'aimerais bien que vous précisiez votre propos."
    },
    {
      "_id": "59df6a5366914e1e822383a5",
      "author": {
        "avatar": "https://secure.gravatar.com/avatar/09f98c381f2ed69119c7df9ca10b2724?d=mm",
        "displayName": "Gérard Bodin",
        "extra": {
          "age": "3",
          "job": "2",
          "postal": "99999"
        },
        "firstName": "Gérard",
        "fullName": "Gérard Bodin",
        "id": "59dc23f99e1c7be85124e13b",
        "lastName": "Bodin"
      },
      "createdAt": "2017-10-12T13:12:51.043Z",
      "text": "Merci pour votre remarque @Adrien FABRE ; je pense que Sébastien et David défendent l'idée d'une plateforme contraignante, et je suis d'accord sur le fait qu'on peut faire mieux que se contenter de s'appuyer sur les députés. Les modalités de cette proposition mériteraient d'être précisées ; j'ai supprimé mon précédent commentaire en réalisant que des amendements citoyens pourraient très bien être préparés en amont de la séance publique."
    },
    {
      "_id": "59e2d93266914e1e82238641",
      "author": {
        "avatar": "https://secure.gravatar.com/avatar/09f98c381f2ed69119c7df9ca10b2724?d=mm",
        "displayName": "Gérard Bodin",
        "extra": {
          "age": "3",
          "job": "2",
          "postal": "99999"
        },
        "firstName": "Gérard",
        "fullName": "Gérard Bodin",
        "id": "59dc23f99e1c7be85124e13b",
        "lastName": "Bodin"
      },
      "createdAt": "2017-10-15T03:42:42.659Z",
      "text": "Cf. la discussion de Boris Venon qui reprend et détaille cette idée."
    }
  ],
  "repliesCount": 6,
  "score": -2,
  "text": "Une plateforme citoyenne permettrait d'amender certains textes ou de voter certains textes de lois dans des domaines précis"
}