{
  "author": {
    "avatar": "https://secure.gravatar.com/avatar/58e2a74708d116c34093134eab460de0?d=mm",
    "displayName": "Francis LATOUR",
    "extra": {
      "age": "5",
      "job": "6",
      "postal": "24700"
    },
    "firstName": "Francis",
    "fullName": "Francis LATOUR",
    "id": "59df98e566914e1e822383f0",
    "lastName": "LATOUR"
  },
  "createdAt": "2017-11-01T10:04:55.817Z",
  "flags": [],
  "id": "59f99c47e8a9656c1a8e8220",
  "reference": "59d731a712406bdd5d6277d1",
  "replies": [
    {
      "_id": "59fd9036e7c9379d2c56216f",
      "author": {
        "avatar": "https://lh3.googleusercontent.com/-XdUIqdMkCWA/AAAAAAAAAAI/AAAAAAAAAAA/4252rscbv5M/photo.jpg?sz=50",
        "displayName": "Rodolphe Guyon",
        "firstName": "Rodolphe",
        "fullName": "Rodolphe Guyon",
        "id": "59fd8218ccdac63cb472c5e7",
        "lastName": "Guyon"
      },
      "createdAt": "2017-11-04T10:02:30.235Z",
      "text": "Je suis tout à fait d'accord, si le seuil ne peut être atteint et pour éviter une absence de gouvernance le vote obligatoire pour tout citoyen est à considérer. Il y a le pour et le contre (atteinte aux libertés). La mise en place pourrait être une exonération de taxe d'élection dans le cas ou on irait voter. Vivre dans une démocratie ne doit pas être gratuit sauf s'il on y participe.\nUne réforme moins brutale serait l'organisation des élections durant les jours travaillés de la semaine, ceci pourrait faire revenir les électeurs aux urnes. \n"
    },
    {
      "_id": "59ff48d682abf78a2231ac4f",
      "author": {
        "avatar": "https://graph.facebook.com/10159685457205438/picture",
        "displayName": "Sarah Dano",
        "firstName": "Sarah",
        "fullName": "Sarah Dano",
        "id": "59fd8a17ccdac63cb472c71a",
        "lastName": "Dano"
      },
      "createdAt": "2017-11-05T17:22:30.047Z",
      "text": "Je pense aussi qu'un effort minimum devrait être porté quant aux dates des élections. Cette année le premier tour de la présidentielle tombait à cheval entre les deux semaines de vacances scolaires de ma zone et le deuxième tour dans un long week-end. Franchement je suis sure qu'il y a un certain nombre d'électeurs qui étaient en vacances et qui n'ont tout simplement pas pris la peine de faire une procuration."
    },
    {
      "_id": "5a01c4aa82abf78a2231dba8",
      "author": {
        "avatar": "https://secure.gravatar.com/avatar/b0a4d59364cf914930a288dc442a7a6e?d=mm",
        "displayName": "anne Durgueil",
        "extra": {
          "age": "4",
          "job": "2",
          "postal": "46090"
        },
        "firstName": "anne",
        "fullName": "anne Durgueil",
        "id": "59e716a966914e1e82238d18",
        "lastName": "Durgueil"
      },
      "createdAt": "2017-11-07T14:35:22.292Z",
      "text": "Ici on va plus loin dans le cas ou il y a moins de votants et donc une plus grande abstention qu'aux elections précédentes on reprend les mêmes et on continue avec eux.  On peut considérer que les abstentionnistes sont contents de leur sorts et n'ont que faire de nouveaux programmes.  Pourquoi changer une équipe qui gagne. "
    },
    {
      "_id": "5a01c99582abf78a2231dbf7",
      "author": {
        "avatar": "https://secure.gravatar.com/avatar/b0a4d59364cf914930a288dc442a7a6e?d=mm",
        "displayName": "anne Durgueil",
        "extra": {
          "age": "4",
          "job": "2",
          "postal": "46090"
        },
        "firstName": "anne",
        "fullName": "anne Durgueil",
        "id": "59e716a966914e1e82238d18",
        "lastName": "Durgueil"
      },
      "createdAt": "2017-11-07T14:56:21.036Z",
      "text": "et surtout il faut prendre l'abstention en compte dans les calculs de résultats.  s'il y a une abstention de 50% ça veut dire que les élus sont loin d'avoir  le soutient de la moitié des gens qu'ils représentent.  Tu parles d'une démocratie représentative.  C'est une fraude et le pire c'est que c'est un modèle planétaire que nos institutions de nuls en calcul.\n\nDe fait nous pourrissons le monde entier avec nos systèmes frauduleux.  En Egypte les frères musulmans ont pris le pouvoir avec 13% de l'électorat et avec ça ils ont essayé de transformer la constitution du pays pour imposer l'islamisme, en donnant licence à leur petite minorité d'aller butter tout non-musulman."
    }
  ],
  "repliesCount": 4,
  "score": 64,
  "text": "Une réforme me paraît essentielle pour prendre en considération le silence de certains électeurs et électrices.\nA chaque élection, il est constaté un nombre important d'abstentions et de votes blanc. Cela ne gêne personne, l'essentiel étant d'être élu.e.\nJe pense, qu'aujourd'hui, le vote blanc doit être effectivement reconnu et apprécié comme un suffrage exprimé. Une personne qui se déplace pour exprimer son désaccord me paraît devoir être considérée.\nCette reconnaissance effective du vote blanc doit, de ce fait, conduire à reconsidérer une élection si son pourcentage atteint un seuil à définir, et d'autant plus s'il est majoritaire.\nJe ne crois pas que la démocratie souffrirait d'une telle mesure."
}