{
  "author": {
    "avatar": "https://lh4.googleusercontent.com/-0cPpIExXK6k/AAAAAAAAAAI/AAAAAAAAE8U/QaD-tvLP8Mo/photo.jpg?sz=50",
    "displayName": "Thomas Fournaise",
    "firstName": "Thomas",
    "fullName": "Thomas Fournaise",
    "id": "59e329b666914e1e822386b9",
    "lastName": "Fournaise"
  },
  "createdAt": "2017-10-15T12:13:41.997Z",
  "flags": [],
  "id": "59e350f566914e1e8223870a",
  "reference": "59d7347212406bdd5d6277f7",
  "replies": [],
  "repliesCount": 0,
  "score": 11,
  "text": "**consultation et contributions par défaut**\nPour chaque texte de loi il faudrait qu'une plateforme soit mise en place où la société civile puisse proposer ses contributions soit sous forme de commentaires remarques sous chaque partie soit sous forme de cahier d'acteurs."
}