{
  "author": {
    "avatar": "https://secure.gravatar.com/avatar/bf53fbd9873c3862f39b1790a9de9828?d=mm",
    "displayName": "philippe lemaire",
    "extra": {
      "age": "4",
      "job": "6",
      "postal": "59530"
    },
    "firstName": "philippe",
    "fullName": "philippe lemaire",
    "id": "59ea48b166914e1e822392bc",
    "lastName": "lemaire"
  },
  "createdAt": "2017-11-02T14:10:33.706Z",
  "flags": [],
  "id": "59fb2759ccdac63cb472b5e4",
  "reference": "59d734d112406bdd5d6277ff",
  "replies": [],
  "repliesCount": 0,
  "score": 0,
  "text": "QUESTIONS ECRITES  AU GOUVERNEMENT\n\nCertaines questions récurrentes qui dépendent de plusieurs acteurs(commissions,syndicats,associations ….) nécessitent une étude approfondie qui peut prendre du temps. Je propose qu’au delà de 3 mois ,les membres du gouvernement se doivent par le biais des députés et sénateurs d’informer le ou les émetteurs de l’état d’avancement de la question,des actions entreprises et s’engagent sur un délai objectif de fin de traitement. il est important avant tout d’avoir une réponse et que celle ci soit claire et argumentée. Cette exigence d’information permettra de rapprocher les citoyens de leurs représentants et améliorera le coté participatif de la démocratie"
}