{
  "author": {
    "avatar": "https://lh3.googleusercontent.com/-XdUIqdMkCWA/AAAAAAAAAAI/AAAAAAAAAAA/4252rscbv5M/photo.jpg?sz=50",
    "displayName": "Martial HURLISIS",
    "firstName": "Martial",
    "fullName": "Martial HURLISIS",
    "id": "59f8df70e8a9656c1a8e7fff",
    "lastName": "HURLISIS"
  },
  "createdAt": "2017-10-31T21:10:07.870Z",
  "flags": [],
  "id": "59f8e6afe8a9656c1a8e8052",
  "reference": "59d734d112406bdd5d6277ff",
  "replies": [],
  "repliesCount": 0,
  "score": -1,
  "text": "Ne faudrait-il pas en premier lieu se poser la question de l'abstention avant d'instaurer un référendum d'initiative citoyenne? Quels seraient ces citoyens participant à un scrutin ou une consultation d'une pétition pour faire des propositions de lois? Ma crainte est la récupération politique voire syndicale qui pourrait en être faite. Oui la parole doit être donnée aux citoyens pour favoriser les changements. Il faut trouver des formes innovantes mais cadrées pour éviter les dérapages ou les déballages comme sur les réseaux sociaux.\nJe suis de ceux qui prônent la liberté de proposer sur des thématiques précises sous forme de consultation d'un panel de Français (différent en fonction du sujet) préinscrits en fonction de leur appétence et compétences, ces Français qui ont cette envie de participer à la vie de nos institutions républicaines mais sans un engagement politique obligatoire. La création d'une plateforme numérique serait une solution à retenir pour organiser ces consultations citoyennes."
}