{
  "author": {
    "avatar": "https://secure.gravatar.com/avatar/5416214ff76410babbd6eadba1ad3014?d=mm",
    "displayName": "martine jeanne",
    "extra": {
      "age": "4",
      "job": "3",
      "postal": "07200"
    },
    "firstName": "martine",
    "fullName": "martine jeanne",
    "id": "59fedc7a82abf78a223192e7",
    "lastName": "jeanne"
  },
  "createdAt": "2017-11-05T09:59:00.562Z",
  "flags": [],
  "id": "59fee0e482abf78a2231943b",
  "reference": "59d734d112406bdd5d6277ff",
  "replies": [],
  "repliesCount": 0,
  "score": 0,
  "text": "je suis favorable à cette initiative qui redonnera peut-être du \"pouvoir\" aux citoyens."
}