{
  "author": {
    "avatar": "https://secure.gravatar.com/avatar/2b89d14c4d2aa5f175bf8b1120376863?d=mm",
    "displayName": "Conseil national du numérique (CNNum)",
    "extra": {
      "age": "3",
      "job": "3",
      "postal": "75013"
    },
    "firstName": "Conseil national du numérique",
    "fullName": "Conseil national du numérique (CNNum)",
    "id": "59fc4e03ccdac63cb472b970",
    "lastName": "(CNNum)"
  },
  "createdAt": "2017-11-03T11:15:36.480Z",
  "flags": [],
  "id": "59fc4fd8ccdac63cb472b987",
  "reference": "59d733cb12406bdd5d6277ea",
  "replies": [
    {
      "_id": "59ff860d82abf78a2231b937",
      "author": {
        "avatar": "https://secure.gravatar.com/avatar/bf0c2e4ad1d8a3ec459a0b915d80c7ab?d=mm",
        "displayName": "René  Lalement ",
        "extra": {
          "age": "4",
          "job": "3",
          "postal": "75011"
        },
        "firstName": "René ",
        "fullName": "René  Lalement ",
        "id": "59ff7c4a82abf78a2231b734",
        "lastName": "Lalement "
      },
      "createdAt": "2017-11-05T21:43:41.355Z",
      "text": "Excellente proposition. \nIl serait juste également, sur le plan juridique, de placer les documents produits et détenus par les assemblées parlementaires et les informations qu'ils contiennent dans le régime général des documents administratifs et des informations publiques, en matière de droit à communication, d'obligation de mise en ligne et de droit de réutilisation. "
    }
  ],
  "repliesCount": 1,
  "score": 8,
  "text": "Créer le LégaLab, un service parlementaire de la donnée, ouvert aux élu-e-s et citoyen-ne-s pour multiplier les usages autour des données publiques parlementaires et soutenir les parlementaires dans leur travail d’instruction \n\nLes données générées en permanence par le travail parlementaire, stockées par les services des deux assemblées, sont nombreuses et variées. Ces données, à la condition qu’elles circulent et qu’elles soient facilement exploitables, notamment par les collaborateurs parlementaires, peuvent participer de l’amélioration du travail des élus. \n\nLe CNNum propose la création d’un « LégaLab », un service parlementaire de la donnée ouvert aux élu-e-s et aux citoyen-ne-s afin de promouvoir la place stratégique des données dans la transformation numérique du Parlement. À l’image de la mission Etalab dans les fonctions ministérielles d’État, ce service serait chargé de :\n\nAccélérer l’ouverture des données publiques parlementaires sous un format ouvert, lisible par une machine et librement réutilisable (open data), notamment en répertoriant et nettoyant les jeux de données utiles, puis en assurant leur accessibilité à l’ensemble des citoyens en tant que « communs » ;\n\nSoutenir le travail d’instruction des parlementaires : ce service pourrait mettre régulièrement à disposition des métadonnées sur les consultations, auditions, documents de travail des commissions, amendements déposés, afin d’améliorer sur le long terme la recherche d’informations et la performance parlementaire. Le LégaLab pourrait être également sollicité en amont de chaque examen d’un texte de loi par le rapporteur compétent pour émettre un avis sur les données utiles au débat public ainsi que leur état de disponibilité et de fraîcheur ;\n\nAnimer une communauté d’usage autour des données parlementaires : mise en place de procédure simplifiée pour demander l’ouverture de jeux de données (à l’instar du projet DODOdata.io de Datactivist), organisation de hackathons et soutien à des projets s’appuyant sur l’utilisation des données parlementaires (« startups de parlement »).\n\nSource : https://cnnumerique.fr/wp-content/uploads/2017/07/Avis_CNNum_Confiance_Vie_Publique_vF.pdf"
}