{
  "author": {
    "avatar": "https://secure.gravatar.com/avatar/9f8ce436a21dda55479462170730ffd4?d=mm",
    "displayName": "REMI ARNOUX",
    "extra": {
      "age": "1",
      "job": "1",
      "postal": "78110"
    },
    "firstName": "REMI",
    "fullName": "REMI ARNOUX",
    "id": "59f097af896da05921863a78",
    "lastName": "ARNOUX"
  },
  "createdAt": "2017-11-02T10:20:59.830Z",
  "flags": [],
  "id": "59faf18bccdac63cb472b4ac",
  "reference": "59d733cb12406bdd5d6277ea",
  "replies": [],
  "repliesCount": 0,
  "score": 3,
  "text": "Afin de favoriser l'interaction des plus jeunes avec la procédure législative, et plus largement les missions du  député, un système de parrainage serait intéressant. La députée de ma circonscription pourrait être la \"marraine\" de jeunes intéressés par les questions politiques : lycéens, jeunes étudiants pourraient faire remonter à leur marraine leurs questions, leurs enjeux et leurs propositions de solutions politiques. Les \"filleuls ou filleules\" de la ou du député auraient une mission officielle de remontée de solutions proposées par les jeunes. Ils ne pourraient pas se transformer en militants et distributeurs de tracts le temps des élections venu."
}