{
  "author": {
    "avatar": "https://www.agoravox.fr/local/cache-vignettes/L248xH250/auton3525-88888.jpg",
    "displayName": "s dm",
    "extra": {
      "age": "4",
      "job": "2",
      "postal": "94170"
    },
    "firstName": "s",
    "fullName": "s dm",
    "id": "59db73bf9e1c7be85124dd50",
    "lastName": "dm"
  },
  "createdAt": "2017-10-09T14:05:23.360Z",
  "editedAt": "2017-10-12T18:38:27.448Z",
  "flags": [],
  "id": "59db82239e1c7be85124de36",
  "reference": "59d734d112406bdd5d6277ff",
  "replies": [],
  "repliesCount": 0,
  "score": 36,
  "text": "Sur les initiatives citoyennes, n'hésitez pas à vous inspirer du modèle Suisse. Pour ce faire vous pouvez consulter le **Guide de la démocratie directe**  : https://issuu.com/inxtensis/docs/iri_guide_demoractiedirecte_fr_2007 et notamment les recommandations exprimées dans les annexes p 184 à 189"
}