{
  "author": {
    "avatar": "https://lh3.googleusercontent.com/-XdUIqdMkCWA/AAAAAAAAAAI/AAAAAAAAAAA/4252rscbv5M/photo.jpg?sz=50",
    "displayName": "Jean-Michel Juillard",
    "firstName": "Jean-Michel",
    "fullName": "Jean-Michel Juillard",
    "id": "59e7a60166914e1e82238f83",
    "lastName": "Juillard"
  },
  "createdAt": "2017-10-18T19:34:02.444Z",
  "flags": [],
  "id": "59e7acaa66914e1e82238f98",
  "reference": "59d734d112406bdd5d6277ff",
  "replies": [],
  "repliesCount": 0,
  "score": -1,
  "text": "En préambule, peut-être faut-il revenir à la source et déjà déterminé ce qu'est un citoyen, ou tout du moins en matière numérique comme définir que l'auteur est un citoyen.\nen l’occurrence, rien que sur cette plateforme 3 possibilités d'identification et aucune à même de garantir l’identité de l'auteur. et pourtant nous disposons tous d'un identifiant unique le NIR.\npour conclure ce préambule, nécessitant de la définition d'une identité numérique du citoyen qui, de mon point de vue, relève du pouvoir régalien.\nUne incidente: une initiative citoyenne doit -elle s'ouvrir explicitement à l'intervention d'acteurs pouvant constituer des regroupements de citoyens? association, entreprises et plus globalement lobby. doit-on clairement identifier leurs contributions comme telles ou les interdire et les laisser recourir à des water army qui vont paraphraser la même proposition et tronquer en un sens le débat. personnellement je suis en faveur de la première option.\nenfin le coeur du sujet,  les initiatives citoyennes. le principe toute proposition sous forme de pétition recueillant, sur une plateforme à définir, un nombre de votes/likes/réponses supérieur à un nombre pouvant être considéré comme représentatif statistiquement et géographiquement devrait être porté par le parlement dans les mêmes conditions qu'une proposition de loi.\nDe mon point de vue, les questions citoyennes au gouvernement pourrait suivre la même règle dans le cadre des questions orales au gouvernement. à ce titre, elle serait porté par un député lors d'une session hebdomadaire, ledit député étant à désigner par le président de l'assemblée.\nles données associées à cette plateforme devront relever de l'open data et permettre un contrôle citoyen afin d'éviter toute éviction de proposition\nc'est l'état de ma réflexion sur le sujet."
}