{
  "author": {
    "avatar": "https://graph.facebook.com/10207802781466031/picture",
    "displayName": "Philippe Saez",
    "firstName": "Philippe",
    "fullName": "Philippe Saez",
    "id": "59fe1dec82abf78a223172bf",
    "lastName": "Saez"
  },
  "createdAt": "2017-11-04T20:34:40.396Z",
  "flags": [],
  "id": "59fe246082abf78a22317531",
  "reference": "59d731a712406bdd5d6277d1",
  "replies": [],
  "repliesCount": 0,
  "score": 0,
  "text": "Humaniser les relations\nPermettre une relation directe entre le citoyen et son député.\nDepuis plusieurs années alors que les moyens de communications se sont démocratisés, les relations entre un député de circonscription et ses mandants se sont distendues. S'il est toujours présents sur les cérémonies, réunions officielles, événements locaux, force est de constater que les convives, donc les relations du député restent les même et qu'il ne s'agit pas de la population mais d'une élite locale. Le citoyen a certes la capacité d'adresser des courriers, des courriels ou de prendre rdv avec le député mais il faut être lucide, ces tentatives de contact passent sous les fourches caudines du filtre des fonctionnaires de l'assemblée ou des attachés parlementaires. Au mieux, certains arrivent à obtenir une entrevue directe après plusieurs mois mais pour quelques secondes, le député ayant une cérémonie ou une visite locale au cours de laquelle la population est tenue à distance. Au mieux, il serait possible d'obtenir un selfie à l'arrivée ou au départ de l'elu.\nAh, il y a bien quelques moments de proximité quand un élu se découvre des talents d'écrivain et qu'il procède à une séance de dédicace dans une librairie locale....mais cette proximité relève comme beaucoup de fois dans notre société d'un moment marketing.\nLa solution réside dans un système de contact ou l'élu serait en lien direct avec les électeurs. Il sait le faire lorsqu'il est en campagne et il serait bon que l'elu se considère en campagne permanente.\nCette distance n'est pas l'apanage du député mais de l'ensemble de l'administration française ou les interlocuteurs de l'administre même s'ils sont de qualité n'ont aucun pouvoir de réponse immédiate et directe. Au mieux, ils prennent en compte votre demande. Qui n'a pas vécu, ces plateformes telephoniques ou l'interlocuteur cite une fiche réflexe ou vous répète des informations que vous avez déjà mais ne peut solutionner votre problème. Qui n'a pas vécu, ses même choses face à un guichet, ou face à un gentil fonctionnaire à qui l'Etat a oublié de lui donner la compétence de solutionner le problème de son administré.\nRendre de l'humanité dans les relations permettrait de restaurer la confiance des citoyens et leur implication"
}