{
  "author": {
    "avatar": "https://graph.facebook.com/1581453218602095/picture",
    "displayName": "Hervé Billiet",
    "firstName": "Hervé",
    "fullName": "Hervé Billiet",
    "id": "59e77d7f66914e1e82238f5f",
    "lastName": "Billiet"
  },
  "createdAt": "2017-10-18T20:10:00.447Z",
  "flags": [],
  "id": "59e7b51866914e1e82238fc3",
  "reference": "59d7325812406bdd5d6277d4",
  "replies": [],
  "repliesCount": 0,
  "score": -1,
  "text": "Certains parlementaires organisent déjà des débats citoyens. Pourquoi ne pas les généraliser?"
}