{
  "author": {
    "avatar": "https://secure.gravatar.com/avatar/e84057dc8249ac9e39ca5ce76a47470f?d=mm",
    "displayName": "isabelle dumarché",
    "extra": {
      "age": "4",
      "job": "8",
      "postal": "07700"
    },
    "firstName": "isabelle",
    "fullName": "isabelle dumarché",
    "id": "59fed68d82abf78a2231905a",
    "lastName": "dumarché"
  },
  "createdAt": "2017-11-07T08:26:42.634Z",
  "flags": [],
  "id": "5a016e4282abf78a2231d662",
  "reference": "59d731a712406bdd5d6277d1",
  "replies": [],
  "repliesCount": 0,
  "score": 0,
  "text": "Pendant la campagne présidentielle,\n\nLa réforme en matière de transparence et d’éthique de la vie publique. est une  nouvelle avancé aux dispositions prises sous la Présidence de François Hollande, en particulier,  le renforcement de l’encadrement des activités de conseil des parlementaires,  la prévention des conflits d’intérêts au sein du Parlement,  l’interdiction des emplois familiaux dans les cabinets politiques,  Il este des progrès à faire sur plusieurs sujets essentiels comme   la transparence des dépenses des parlementaires,  le financement de la vie politique,   le lobbying, De plus, la levée de l'immunité parlementaire systématique doit rentrer dans les faits, lorsqu’il y a demande de la justice, quelques soit les raisons d'une mise en examen, ou de comparution pour témoignage - Cette demande pourrait relever d'un collège spécial composés de 3 magistrats.\nLes activités politiques du parlementaire seraient suspendues pendant la durée des procédures, lesquelles devront être le plus rapide possible."
}