{
  "author": {
    "avatar": "https://secure.gravatar.com/avatar/7754e2d3e3566451d1caec5b18419bbc?d=mm",
    "displayName": "Adriana ANDRONIC",
    "extra": {
      "age": "4",
      "job": "7",
      "postal": "07000"
    },
    "firstName": "Adriana",
    "fullName": "Adriana ANDRONIC",
    "id": "59ff260c82abf78a2231a4ca",
    "lastName": "ANDRONIC"
  },
  "createdAt": "2017-11-05T21:40:26.695Z",
  "flags": [],
  "id": "59ff854a82abf78a2231b91a",
  "reference": "59d734d112406bdd5d6277ff",
  "replies": [],
  "repliesCount": 0,
  "score": 1,
  "text": "Je propose les suivants 15 projets des lois (partie 1) le 5 novembre 2017 à la Consultation.Democratie-Numérique.Assemblée-Nationale.FR\n\n1)Les demandeurs d’emploi devraient bénéficier dès que possible des avantages/facilités fiscales y compris les charges sociales et sans d’être imposés (ou imposées) fiscalement, pendant minimum les premiers 5 ans de la création d’une entreprise ou de la reprise d’une entreprise ;\n\n2)La CAF +Pôle Emploi+ les autres institutions publiques+chaque les employeur d’Etat et privé soit obligés (et obligées) de s’interconnecter et de se fournir/délivrer entre elles/entre eux tous les documents prouvant (attestations d’employeurs, contrats de travail, bulletins de salaires, préavis de licenciement, ruptures de contrats de travail, décisions de licenciement, décisions de démissions, certificats de travail, certificats de congé médical, etc.) l’embauche et l’historique à jour de chaque salarié afin de décharger de ces obligations trop stressantes, fatigantes, énergofagues, qui sont au présent mises sur les épaules des citoyens et chaque telle institution (énumérées plus haut) soit obligée d’envoyer gratuitement et régulièrement à chaque occasion (par semaine ou par mois), PAR EMAIL ET PAR LA POSTE, à chaque personne citoyenne concernée tous les documents et attestations prouvant leur situation personnelle (mise à jour) professionnelle et financière, y compris leur historique professionnel et financier mis à jour : les effets seront bénéfiques pour : A)L’écologie, en diminuant ainsi l’effet de serre et le réchauffement au niveau de la France ; B) L’élimination importante d’un des facteurs de stress et de la dépression qui causent TROP de suicides en France ; C) ainsi sera réalisée une meilleure et plus démocratique inter-connectivité entre les services de L’Etat avec les citoyens ; D) Sera ainsi assurée la meilleure ou la parfaite gestion et mise à jour de l’immense BASE DE DONNEES NATIONALE DE LA France ; E) Sera réalisée ainsi une GRANDE SATISFACTION ET GRATITUDE ET CONFIANCE DE CHAQUE CITOYEN auprès du system, des institutions de L’Etat et du Gouvernement ;\n\n3)La création et l’installation des bornes ou des pôles d’internet (ayant aussi une imprimante et un téléphone publique gratuite pour les appels en France) utilisables NON-STOP et partout en France, sur les domaines publiques, sur les rues, sur les autoroutes, dans les marchés publiques, dans l’intérieur et dans l’extérieur de chaque ville et commune de la France ;\n\n4)La Loi « LA TABLE DE LA NATION FRANCAISE » : par laquelle soit crée dans chaque ville / commune des restaurant-cantines de L’Etat (soutenus financièrement par l’Etat et par des fonds de L’Union Européenne et par les grandes entreprises françaises et étrangères siégées en France et par les milliardaires et millionnaires particuliers français et étrangers imposés en France) un repas chaud (Menu complet) par CHAQUE JOUR 7jr/7jr aux demandeurs d’emploi et à toutes personnes démunies pas imposables fiscalement ;\n\n5)La Loi « LES VOITURES ELECTRIQUES » : par laquelle le Gouvernement va offrir chaque année progressivement à chaque citoyen (en commençant aves les demandeurs d’emploi et les personnes démunies financièrement) une voiture électrique SANS LE DROIT DE LA VENDRE, en obtenant et attirant dans ce but des fonds des grandes entreprises françaises et étrangères en échange de les promouvoir leur produits/services ;\n***Va suivre toute de suite, en bas, la deuxième partie :"
}