{
  "author": {
    "avatar": "C:\\Users\\Annie\\Pictures\\4Annie\\1156b886be02fb527c9877b94bb41ec9.jpg                ",
    "displayName": "Annie COLLIN",
    "extra": {
      "age": "5",
      "job": "6",
      "postal": "54000"
    },
    "firstName": "Annie",
    "fullName": "Annie COLLIN",
    "id": "59fe10ff82abf78a22316c94",
    "lastName": "COLLIN"
  },
  "createdAt": "2017-11-04T20:02:30.017Z",
  "editedAt": "2017-11-04T20:48:58.729Z",
  "flags": [],
  "id": "59fe1cd682abf78a22317249",
  "reference": "59d734d112406bdd5d6277ff",
  "replies": [],
  "repliesCount": 0,
  "score": 0,
  "text": "Excellente initiative. J'ai toujours de l'espoir comme tous nos anciens malgré les échecs à nous faire entendre écouter approuver... et nous sommes pourtant des millions de gens certes beaucoup plus nombreux que tous ces parasites en cols blancs inhumains méprisants incultes qui nous dirigent !"
}