{
  "author": {
    "avatar": "https://graph.facebook.com/359575571131881/picture",
    "displayName": "Rene Fiori",
    "firstName": "Rene",
    "fullName": "Rene Fiori",
    "id": "59dc452d9e1c7be85124e14a",
    "lastName": "Fiori"
  },
  "createdAt": "2017-10-10T04:11:04.588Z",
  "flags": [],
  "id": "59dc48589e1c7be85124e14b",
  "reference": "59d731a712406bdd5d6277d1",
  "replies": [],
  "repliesCount": 0,
  "score": -1,
  "text": "Sur des questions très quotidiennes et au coup par coup et qui concernent certaines administrations, entre autres : le travail (inspection du travail), la consommation ( directions de la concurrence et des prix départementales des réclamations leur sont adressées, qui peuvent trouver un prolongement lors des débats parlementaires. Mais le tempo entre les deux n'est pas le ^même. Est il envisageable de pense à un mode de transmission d'un bilan public sur le site de l'assemblée nationale de ces administrations qui gèrent le quotidien ?"
}