{
  "author": {
    "avatar": "https://graph.facebook.com/1480490395361262/picture",
    "displayName": "Rene Lenoir",
    "firstName": "Rene",
    "fullName": "Rene Lenoir",
    "id": "59feb7da82abf78a2231874d",
    "lastName": "Lenoir"
  },
  "createdAt": "2017-11-05T07:14:30.990Z",
  "flags": [],
  "id": "59feba5682abf78a223187c1",
  "reference": "59d734d112406bdd5d6277ff",
  "replies": [],
  "repliesCount": 0,
  "score": 0,
  "text": "Naturellement je soutiens cette initiative, mais je n'ai pas compris comment il faut faire pour apporter ce soutien. Si quelqu'un a compris merci de m'indiquer la procédure à suivre.\nPlus jamais d'ordonnances ni de 49.3 !"
}