{
  "author": {
    "avatar": "https://secure.gravatar.com/avatar/57db66f4b67c2dcd62b86c3918bdda20?d=mm",
    "displayName": "Sébastien  Piarulli",
    "extra": {
      "age": "2",
      "job": "2",
      "postal": "94300"
    },
    "firstName": "Sébastien ",
    "fullName": "Sébastien  Piarulli",
    "id": "59db7b719e1c7be85124ddb5",
    "lastName": "Piarulli"
  },
  "createdAt": "2017-10-09T13:43:31.014Z",
  "editedAt": "2017-10-09T19:55:20.499Z",
  "flags": [],
  "id": "59db7d039e1c7be85124ddc6",
  "reference": "59d7335412406bdd5d6277e4",
  "replies": [
    {
      "_id": "59db86809e1c7be85124de6c",
      "author": {
        "avatar": "https://secure.gravatar.com/avatar/552f2f0b408ddd8b771c5215d97075e4?d=mm",
        "displayName": "David Libeau",
        "extra": {
          "age": "",
          "job": "8",
          "postal": ""
        },
        "firstName": "David",
        "fullName": "David Libeau",
        "id": "59db7f749e1c7be85124dddc",
        "lastName": "Libeau"
      },
      "createdAt": "2017-10-09T14:24:00.816Z",
      "text": "C'est déjà possible via des questions au gouvernement que les députés poserait, (encore faudrait-il qu'ils aient quelque chose à faire des citoyens et que le gouvernement réponde réellement aux questions qu'on leur posent)."
    },
    {
      "_id": "59dbd43e9e1c7be85124e06c",
      "author": {
        "avatar": "https://secure.gravatar.com/avatar/57db66f4b67c2dcd62b86c3918bdda20?d=mm",
        "displayName": "Sébastien  Piarulli",
        "extra": {
          "age": "2",
          "job": "2",
          "postal": "94300"
        },
        "firstName": "Sébastien ",
        "fullName": "Sébastien  Piarulli",
        "id": "59db7b719e1c7be85124ddb5",
        "lastName": "Piarulli"
      },
      "createdAt": "2017-10-09T19:55:42.582Z",
      "text": "Pardon je voulais dire l’exécutif . J’ai modifié ma contribution. "
    },
    {
      "_id": "59dbf4fb9e1c7be85124e103",
      "author": {
        "avatar": "https://secure.gravatar.com/avatar/24237eb66d428ecd029129dfc9bb896f?d=mm",
        "displayName": "Charlotte ALAIN",
        "extra": {
          "age": "3",
          "job": "2",
          "postal": "75013"
        },
        "firstName": "Charlotte",
        "fullName": "Charlotte ALAIN",
        "id": "59dbe5f29e1c7be85124e0ae",
        "lastName": "ALAIN"
      },
      "createdAt": "2017-10-09T22:15:23.227Z",
      "text": "L'exécutif étant le gouvernement il vous suffit de contacter le député de votre circonscription pour qu'il pose cette question au gouvernement (soit de manière orale pendant les séances de questions au gouvernement soit de manière écrite) ou sinon du député de votre choix s'il correspond plus à vos idées politiques"
    },
    {
      "_id": "59dc89549e1c7be85124e297",
      "author": {
        "avatar": "https://secure.gravatar.com/avatar/57db66f4b67c2dcd62b86c3918bdda20?d=mm",
        "displayName": "Sébastien  Piarulli",
        "extra": {
          "age": "2",
          "job": "2",
          "postal": "94300"
        },
        "firstName": "Sébastien ",
        "fullName": "Sébastien  Piarulli",
        "id": "59db7b719e1c7be85124ddb5",
        "lastName": "Piarulli"
      },
      "createdAt": "2017-10-10T08:48:20.194Z",
      "text": "Par le biais d'une plateforme officielle, le poids de l'interpellation serait plus important et porterait sans doute le message d'une manière plus significative"
    },
    {
      "_id": "59dd19839b28097eb6b41a34",
      "author": {
        "avatar": "https://secure.gravatar.com/avatar/03b6014ac927da400a55374bbbe5152a?d=mm",
        "displayName": "David Marchal",
        "extra": {
          "age": "2",
          "job": "2",
          "postal": "88500"
        },
        "firstName": "David",
        "fullName": "David Marchal",
        "id": "59dc8ec99e1c7be85124e2c5",
        "lastName": "Marchal"
      },
      "createdAt": "2017-10-10T19:03:31.467Z",
      "text": "Ouvrir les questions au gouvernement aux citoyens, voilà un outil de contrôle par les citoyens qui semble approprié. Là encore, le seuil de participations favorables pour que la question soit posée devrait être significativement inférieur à celui nécessaire pour un référendum, sinon on risquerait d’avoir trop peu de questions pour que ce soit utile ; en revanche, une fois la question posée, elle devrait nécessairement recevoir une réponse dans un délai raisonnable, et pas rester lettre morte comme nombre de questions de ce genre. Par ailleurs, la réponse devrait être juste, pas une réponse du type \"l’organigramme interne est trop cloisonné pour vous donner un chiffre exact\", car ce serait le comble, pour une procédure visant à l’ouverture."
    },
    {
      "_id": "59fca55fccdac63cb472bb47",
      "author": {
        "avatar": "https://lh6.googleusercontent.com/-bLpoWADGwbA/AAAAAAAAAAI/AAAAAAAAFyw/AiK7w6L63_0/photo.jpg?sz=50",
        "displayName": "Camille Evangelista",
        "firstName": "Camille",
        "fullName": "Camille Evangelista",
        "id": "59f9a80ce8a9656c1a8e8260",
        "lastName": "Evangelista"
      },
      "createdAt": "2017-11-03T17:20:31.427Z",
      "text": "L'idée de permettre aux citoyens de poser des questions à l'Assemblée nationale pendant les questions au gouvernement est une bonne idée. J'ai d'abord un point négatif à relever : en l'état actuel des choses, les temps de paroles sont très limité pendant cet exercice hebdomadaire. En effet, les ministres n'ont droit qu'à deux minutes pour répondre à la question. Pour faire court, en général ils tombent vite dans des discours démagogiques sans grand intérêt. Par ailleurs, j'ai également mal compris le concept d'interroger les ministres sur le suivi d'une loi ... En effet, une fois la loi votée, les ministres n'ont plus la main sur les décrets qui doivent être rédigés par les préfets ou les collectivités locales ? "
    },
    {
      "_id": "59fca8e7ccdac63cb472bb51",
      "author": {
        "avatar": "https://secure.gravatar.com/avatar/03b6014ac927da400a55374bbbe5152a?d=mm",
        "displayName": "David Marchal",
        "extra": {
          "age": "2",
          "job": "2",
          "postal": "88500"
        },
        "firstName": "David",
        "fullName": "David Marchal",
        "id": "59dc8ec99e1c7be85124e2c5",
        "lastName": "Marchal"
      },
      "createdAt": "2017-11-03T17:35:35.368Z",
      "text": "Les décrets d’application émanent du gouvernement, pas des instances inférieures, autant que je sache."
    },
    {
      "_id": "59fccbb5ccdac63cb472bd39",
      "author": {
        "avatar": "https://secure.gravatar.com/avatar/ba62ab5ef31bf6fae6170fae1e0909f6?d=mm",
        "displayName": "Antoine Marmignon",
        "extra": {
          "age": "3",
          "job": "3",
          "postal": "92130"
        },
        "firstName": "Antoine",
        "fullName": "Antoine Marmignon",
        "id": "59f8becae8a9656c1a8e7f09",
        "lastName": "Marmignon"
      },
      "createdAt": "2017-11-03T20:04:05.632Z",
      "text": "Pour suivre plus ou moins régulièrement les questions orales au gouvernement, c'est beaucoup de langues de bois et très souvent la réponse est à coté de la plaque, je ne suis pas sur de bien comprendre la proposition."
    },
    {
      "_id": "59ff93c682abf78a2231baf9",
      "author": {
        "avatar": "https://secure.gravatar.com/avatar/3c5d0c16392f1d129c6fc61beaf7127f?d=mm",
        "displayName": "stéphane PAYET",
        "extra": {
          "age": "3",
          "job": "2",
          "postal": "92220"
        },
        "firstName": "stéphane",
        "fullName": "stéphane PAYET",
        "id": "59fe1adc82abf78a2231717b",
        "lastName": "PAYET"
      },
      "createdAt": "2017-11-05T22:42:14.261Z",
      "text": "Pour compléter la proposition de Sébastien Piarulli,  il faudrait qu'il y ait un groupe à l'assemblée dédié aux citoyens, afin de poser les questions. Le président lirait à voix haute les questions posées sur une plateforme centrale. ( comme dans toutes émissions TV modernes qui donnent la parole à ses téléspectateurs). Il reste à déterminer comment sont triées ces questions. Ce groupe aurait le même temps de parole que les autres groupes à l'AN. "
    }
  ],
  "repliesCount": 9,
  "score": 45,
  "text": "Les citoyens devraient pouvoir interpeller l’exécutif  sur des questions concernant par exemple l'application des lois. Pourquoi telle ou telle loi n'est pas appliquée etc."
}