{
  "author": {
    "avatar": "https://graph.facebook.com/171083190139900/picture",
    "displayName": "Lucie Escoffiers",
    "firstName": "Lucie",
    "fullName": "Lucie Escoffiers",
    "id": "59fd9658e7c9379d2c562214",
    "lastName": "Escoffiers"
  },
  "createdAt": "2017-11-04T11:10:25.159Z",
  "flags": [],
  "id": "59fda021e7c9379d2c562352",
  "reference": "59d7347212406bdd5d6277f7",
  "replies": [],
  "repliesCount": 0,
  "score": 1,
  "text": "Respecter les députés, élus du peuple, en évitant que les commissions et les séances plénières aient lieu en même temps ; voter les lois à des heures décentes et non pas pendant la nuit ; donner le temps aux échanges entre les députés des différents groupes ; représenter la diversité des agents économiques dans les auditions et ne pas privilégier les groupes de pression...\nBref, avoir un fonctionnement démocratique de l'AN qui n'a pas à voter des lois sous la pression, ni dans l'urgence, ni dans la confusion, ni en présence de quelques dizaines de députés seulement.\nUn tel fonctionnement est indigne.\nEn quoi la consultation directe des citoyens sur l'élaboration des textes de loi peut-elle améliorer la situation ? N'est-ce pas une mascarade qui vise à réduire encore un peu plus le rôle  des députés ?\nDe gros doutes sur les arrières pensées qui conduisent à cette consultation qui se dit démocratique (et qui déjà ne peut concerner que ceux qui ont accès à internet)..."
}