{
  "author": {
    "avatar": "https://secure.gravatar.com/avatar/13a8f8c06dc57cee7839537e63ff3163?d=mm",
    "displayName": "Clément Imbert",
    "extra": {
      "age": "2",
      "job": "4",
      "postal": "13010"
    },
    "firstName": "Clément",
    "fullName": "Clément Imbert",
    "id": "59e36c5966914e1e8223872b",
    "lastName": "Imbert"
  },
  "createdAt": "2017-10-24T14:29:38.685Z",
  "flags": [],
  "id": "59ef4e52896da059218638fd",
  "reference": "59d737c712406bdd5d627805",
  "replies": [
    {
      "_id": "59ef4f08896da05921863901",
      "author": {
        "avatar": "https://secure.gravatar.com/avatar/13a8f8c06dc57cee7839537e63ff3163?d=mm",
        "displayName": "Clément Imbert",
        "extra": {
          "age": "2",
          "job": "4",
          "postal": "13010"
        },
        "firstName": "Clément",
        "fullName": "Clément Imbert",
        "id": "59e36c5966914e1e8223872b",
        "lastName": "Imbert"
      },
      "createdAt": "2017-10-24T14:32:40.781Z",
      "text": "L'idée a déjà été proposé par David Libeau mais parmi d'autres dans une liste. Je souhaite qu'on puisse se prononcer que sur celle-ci."
    }
  ],
  "repliesCount": 1,
  "score": 6,
  "text": "Idée pour la plateforme : Proposer une troisième option de vote \"Mitigé\" et une option pour signaler un hors sujet (comme il peut y en avoir beaucoup). Afficher le score des votes sous forme de diagramme circulaire (comme sur le site Parlement & Citoyens) et non pas sous forme de solde comme aujourd'hui. Voilà à quoi cela pourrait ressembler: [lien vers l'image](https://www.noelshack.com/2017-43-2-1508854571-proposition-vote.png)."
}