{
  "author": {
    "avatar": "https://secure.gravatar.com/avatar/f32a79ff39760c5edfd00ba2e22bc2cb?d=mm",
    "displayName": "Pascal GUILBARD",
    "extra": {
      "age": "4",
      "job": "2",
      "postal": "94100"
    },
    "firstName": "Pascal",
    "fullName": "Pascal GUILBARD",
    "id": "59ff62e882abf78a2231b2de",
    "lastName": "GUILBARD"
  },
  "createdAt": "2017-11-05T22:38:05.349Z",
  "flags": [],
  "id": "59ff92cd82abf78a2231badf",
  "reference": "59d734d112406bdd5d6277ff",
  "replies": [],
  "repliesCount": 0,
  "score": 2,
  "text": "1ère proposition\nAfin de développer les initiatives citoyennes nous proposons la création d'une plate-forme en ligne dédiée, permettant à chaque citoyen de poser une question ou une suggestion à l'Assemblée Nationale, sur un sujet national.\nPour chaque sujet posté, la plateforme permettra à chaque citoyen de soutenir ou non le sujet. \nSi le nombre de soutiens dépasse un certain seuil, par exemple 100 000 soutiens, le sujet sera soumis à l’Assemblée Nationale.\nLa ou les réponses apportées par l’Assemblé Nationale seront inscrites sur la plateforme, permettant ainsi à chaque citoyen d’avoir un retour.\n\nLe même outil pourrait être mis à la disposition de chaque député pour les sujets locaux dépendant de leur circonscription.\n\nAfin de garantir l’information auprès de tous les citoyens, nous suggérons que la mise en place de la plateforme face l’objet d’une campagne nationale de communication : journaux télévisés, journaux nationaux, spot publicitaire, affichage...  \n\n2ème proposition\nLa création d’un Facebook live d’interaction entre le président de l’Assemblée Nationale et les citoyens à l’image de celui proposé par le 1er ministre, Edouard PHILIPPE."
}