{
  "author": {
    "avatar": "https://secure.gravatar.com/avatar/30bb12fe390e7bea6cc92887425e7976?d=mm",
    "displayName": "Benedicte BEVIERE-BOYER",
    "extra": {
      "age": "4",
      "job": "3",
      "postal": "75005"
    },
    "firstName": "Benedicte",
    "fullName": "Benedicte BEVIERE-BOYER",
    "id": "59fed82482abf78a2231910e",
    "lastName": "BEVIERE-BOYER"
  },
  "createdAt": "2017-11-05T10:51:01.218Z",
  "flags": [],
  "id": "59feed1582abf78a22319846",
  "reference": "59d7335412406bdd5d6277e4",
  "replies": [],
  "repliesCount": 0,
  "score": 1,
  "text": "PREVOIR DES SANCTIONS EN CAS DE NON-RESPECT DES LOIS\n- Un nombre croissant de lois voient le jour chaque année et de plus en plus celles-ci ne sont pas appliquées.\n- Une des raisons essentielles est qu’il n’existe pas de sanctions correspondantes en cas d'inapplication. \n- Des contrôles renforcés effectifs devraient intervenir en parallèle.\n\nEn cas de Non Respect de la loi, il conviendrait de prévoir le versement d'amendes ou des travaux d'intérêt généraux pour TOUS LES CITOYENS quel que soit leur situation économique, fiscale, etc. \n\n- Ces sommes permettraient:  \n1) de convaincre toutes les personnes sur le territoire français de respecter la loi\n2) de permettre l'égalité de tous devant l'application de la loi\n3) de faire cesser le sentiment d'impunité qui se développe et qui accroît considérablement le non respect de la loi\n4) de financer les contrôles avec les sommes recueillies par les amendes\n5) de financer de nouveaux projets de l'Etat au profit des citoyens avec l'argent recueilli par les amendes ou du moins de limiter la dette."
}