{
  "author": {
    "avatar": "https://secure.gravatar.com/avatar/7e65431ff926987b853fb08888ff4efc?d=mm",
    "displayName": "Mickaël Mérienne",
    "extra": {
      "age": "3",
      "job": "2",
      "postal": "74210"
    },
    "firstName": "Mickaël",
    "fullName": "Mickaël Mérienne",
    "id": "5a00741982abf78a2231cbf2",
    "lastName": "Mérienne"
  },
  "createdAt": "2017-11-06T15:04:23.628Z",
  "flags": [],
  "id": "5a0079f782abf78a2231cc67",
  "reference": "59d734d112406bdd5d6277ff",
  "replies": [],
  "repliesCount": 0,
  "score": 1,
  "text": "Le droit de s'exprimer fait partie de la démocratie et de plus, le peuple doit avoir le droit sur beaucoup plus de points en ce qui concerne le fonctionnement du gouvernement."
}