{
  "author": {
    "avatar": "https://graph.facebook.com/156455938430927/picture",
    "displayName": "Alexandra Rio",
    "firstName": "Alexandra",
    "fullName": "Alexandra Rio",
    "id": "59fd83f2ccdac63cb472c629",
    "lastName": "Rio"
  },
  "createdAt": "2017-11-04T09:13:38.738Z",
  "flags": [],
  "id": "59fd84c2ccdac63cb472c647",
  "reference": "59d7335412406bdd5d6277e4",
  "replies": [],
  "repliesCount": 0,
  "score": 1,
  "text": "Faire des panels départementaux ou régionaux de citoyens qui évalueront l'application et les implications de certaines lois au quotidien pour les citoyens dont ils sont le plus proches. \"La loi doit être pour tous\" est un principe qui créé parfois plus d'inégalité que d'égalité si on ne fait pas attention à certaines particularités territoriales."
}