{
  "author": {
    "avatar": "https://secure.gravatar.com/avatar/38450e62406e61ecfa1852c06427afe9?d=mm",
    "displayName": "Patrick MAGNIER",
    "extra": {
      "age": "4",
      "job": "",
      "postal": "59140"
    },
    "firstName": "Patrick",
    "fullName": "Patrick MAGNIER",
    "id": "59df699a66914e1e822383a2",
    "lastName": "MAGNIER"
  },
  "createdAt": "2017-10-31T08:52:41.811Z",
  "flags": [],
  "id": "59f839d9e8a9656c1a8e7ba2",
  "reference": "59d7335412406bdd5d6277e4",
  "replies": [],
  "repliesCount": 0,
  "score": -1,
  "text": "Il ne devrait pas être possible de proposer et à fortiori de voter une nouvelle loi sans que celles déjà adoptées sur le même objet n’ai fait l’objet d’une véritable évaluation, de mise en œuvre de moyens adéquats (je prends en exemple les lois portant sur la sécurité). Trop de lois sont votées pour des raisons dogmatiques."
}