{
  "author": {
    "avatar": "https://secure.gravatar.com/avatar/b0a4d59364cf914930a288dc442a7a6e?d=mm",
    "displayName": "anne Durgueil",
    "extra": {
      "age": "4",
      "job": "2",
      "postal": "46090"
    },
    "firstName": "anne",
    "fullName": "anne Durgueil",
    "id": "59e716a966914e1e82238d18",
    "lastName": "Durgueil"
  },
  "createdAt": "2017-10-18T09:55:55.729Z",
  "flags": [],
  "id": "59e7252b66914e1e82238dec",
  "reference": "59d7335412406bdd5d6277e4",
  "replies": [],
  "repliesCount": 0,
  "score": 0,
  "text": "Commencez aussi par relier les lois à des besoins réels et à des cas documentés réclamant la résolution de problème dans la société française.  On pourraient déjà voir combien sont utiles."
}