{
  "author": {
    "avatar": "https://secure.gravatar.com/avatar/5b9b35a042adeeb67fb6b465d58e1130?d=mm",
    "displayName": "Daniel FOLZ",
    "extra": {
      "age": "4",
      "job": "6",
      "postal": "66160"
    },
    "firstName": "Daniel",
    "fullName": "Daniel FOLZ",
    "id": "5a002b9982abf78a2231c325",
    "lastName": "FOLZ"
  },
  "createdAt": "2017-11-06T09:32:58.466Z",
  "flags": [],
  "id": "5a002c4a82abf78a2231c359",
  "reference": "59d734d112406bdd5d6277ff",
  "replies": [],
  "repliesCount": 0,
  "score": 1,
  "text": "Espèrons que cela n'est pas que poudre aux yeux et que les avis des citoyens seront consultés et débattus ..."
}