{
  "author": {
    "avatar": "https://secure.gravatar.com/avatar/5a2dbbdd27c5ff912d69141804735cf3?d=mm",
    "displayName": "F G",
    "extra": {
      "age": "",
      "job": "",
      "postal": ""
    },
    "firstName": "F",
    "fullName": "F G",
    "id": "59dc7f679e1c7be85124e22e",
    "lastName": "G"
  },
  "createdAt": "2017-10-10T20:17:36.419Z",
  "editedAt": "2017-10-11T11:10:11.519Z",
  "flags": [],
  "id": "59dd2ae09b28097eb6b41a6c",
  "reference": "59d7335412406bdd5d6277e4",
  "replies": [
    {
      "_id": "59ddcc7a66914e1e8223803b",
      "author": {
        "avatar": "https://pbs.twimg.com/profile_images/779238336686948352/0Kc7fs1n_400x400.jpg",
        "displayName": "Valentin Chaput",
        "extra": {
          "age": "3",
          "job": "5",
          "postal": "75019"
        },
        "firstName": "Valentin",
        "fullName": "Valentin Chaput",
        "id": "59db32699e1c7be85124dd3c",
        "lastName": "Chaput"
      },
      "createdAt": "2017-10-11T07:47:06.633Z",
      "text": "Bonjour. Merci pour votre signalement, l'URL a été modifié pour rendre le document accessible."
    }
  ],
  "repliesCount": 1,
  "score": 11,
  "text": "On pourrait permettre aux citoyens de déposer sur une plateforme un avis, une question ou une demande à un ou plusieurs parlementaires. Ceux-ci seraient alors tenus de donner une réponse construite et publique (pourquoi pas sur la chaîne parlementaire par exemple). Les obligations de réponse ne concerneraient évidemment que ceux visés par les demandes les plus soutenues."
}