{
  "author": {
    "avatar": "https://secure.gravatar.com/avatar/77738e5dba2eb8c16761e4c821c02f24?d=mm",
    "displayName": "CHRISTIAN LORENT",
    "extra": {
      "age": "4",
      "job": "3",
      "postal": "56680"
    },
    "firstName": "CHRISTIAN",
    "fullName": "CHRISTIAN LORENT",
    "id": "59ff46d082abf78a2231abb2",
    "lastName": "LORENT"
  },
  "createdAt": "2017-11-05T17:21:02.736Z",
  "flags": [],
  "id": "59ff487e82abf78a2231ac36",
  "reference": "59d734d112406bdd5d6277ff",
  "replies": [],
  "repliesCount": 0,
  "score": 0,
  "text": "La modalité de validation pour soutenir cette initiative a dû découragé plus d'une personne qui soutient cette idée. C'est dommage. Bravo malgré tout de travailler en ce sens."
}