{
  "author": {
    "avatar": "https://secure.gravatar.com/avatar/6d258a7aed4a1c1687a46811df8f72a6?d=mm",
    "displayName": "Médias Cité",
    "extra": {
      "age": "3",
      "job": "8",
      "postal": "33100"
    },
    "firstName": "Médias",
    "fullName": "Médias Cité",
    "id": "59fedc0f82abf78a223192cc",
    "lastName": "Cité"
  },
  "createdAt": "2017-11-05T15:34:48.480Z",
  "editedAt": "2017-11-05T15:52:31.599Z",
  "flags": [],
  "id": "59ff2f9882abf78a2231a67a",
  "reference": "59d7325812406bdd5d6277d4",
  "replies": [
    {
      "_id": "59ff30a582abf78a2231a6bf",
      "author": {
        "avatar": "https://secure.gravatar.com/avatar/6d258a7aed4a1c1687a46811df8f72a6?d=mm",
        "displayName": "Médias Cité",
        "extra": {
          "age": "3",
          "job": "8",
          "postal": "33100"
        },
        "firstName": "Médias",
        "fullName": "Médias Cité",
        "id": "59fedc0f82abf78a223192cc",
        "lastName": "Cité"
      },
      "createdAt": "2017-11-05T15:39:17.712Z",
      "text": "B- Rendre la démocratie numérique faisable:\n\nB-1- Garantir l'accès pour tous à l'exercice démocratique à l'ère numérique:\nIl ne s'agit pas de faire en sorte que tout le monde soit obligé mais que personne n'en soit empêché.\nCe qui garantit actuellement l'expression lors des opérations démocratiques s'appuie notamment sur:\n- l'universalité (certes discutable) du process de vote\n- l'information préalable à tout scrutin (campagne, profession de foi...)\n- le temps de réflexion préalable à l'expression (délai de fin de campagne préalable au scrutin)\n- un réseau de lieux neutres d'expression (les écoles publiques et les mairies)\n- un process contribuant à l'expression sans contrainte (l'isoloir)\n- un traitement incluant toutes les parties prenantes de nature à neutraliser le traitement du vote (composition du bureau de vote)\n- une transparence et une lisibilité de nature à garantir la sincérité de l'expression de chacun (urne transparente, dépouillement collectif, ...)\n\nPour que la démocratie numérique puisse être acceptable, il faut donc pouvoir garantir:\n- l'accès pour tous, dans un cadre neutre, susceptible de fournir des clés de lecture et des stratégie d'accompagnement dans l'usage des outils numériques. S'en remettre à l'équipement individuel, à la connexion personnelle, et aux capabilités de chacun relèverait d'une rupture démocratique.  Il existe un réseau maillé de lieux et d'acteurs, comparable aux écoles républicains et susceptible de pouvoir accompagner les citoyens : c'est le réseau des lieux de médiation numérique. Il doit être qualifié au regard de l'enjeu pour pour pouvoir être mobilisé dans le cadre d'une mission de service public, avec toutes les garanties qualitatives que nécessite la mission.\n- le déroulement des process de démocratie numérique doit s'appuyer sur des outils et des plateformes capables de\n-- garantir la loyauté et la transparence des algorithmes et du code,\n-- garantir les usages et la souveraineté des données utilisées et collectées,\n-- garantir les questions d'identité des citoyens contributeurs et/ou des structures contributrices\nPour que la démocratie numérique puisse être mobilisable, il faut enfin garantir:\n- la traçabilité des contributions: ce qu'il en advient et les critères afférents.\n- la transparence dans les expressions : les groupes d'intérêts doivent être déclarés\n- le respect des organisations sociales: la démocratie numérique ne doit pas se traduire par une disqualification des corps intermédiaires.\n"
    },
    {
      "_id": "59ff313c82abf78a2231a6eb",
      "author": {
        "avatar": "https://secure.gravatar.com/avatar/6d258a7aed4a1c1687a46811df8f72a6?d=mm",
        "displayName": "Médias Cité",
        "extra": {
          "age": "3",
          "job": "8",
          "postal": "33100"
        },
        "firstName": "Médias",
        "fullName": "Médias Cité",
        "id": "59fedc0f82abf78a223192cc",
        "lastName": "Cité"
      },
      "createdAt": "2017-11-05T15:41:48.640Z",
      "text": "B-2- Augmenter le pouvoir d'agir des citoyens à l'ère numérique:\n\nIl faut outiller la démocratie numérique: c'est la condition d'une citoyenneté consciente et éclairée à l'ère numérique.\n \nPour cela il faut mettre en place des outils de médiation numérique pour porter une démocratie numérique qui permettent de:\n- traduire les études d'impacts en quelque chose d'appropriable: utiliser pour cela des moyens courts et didactique. Nous pensons par exemple que chaque étude d'impact devrait être facilitée par l'utilisation de la dataviz sur le modèle \"datagueule\" ( https://fr.wikipedia.org/wiki/DataGueule)\n- traduire les sujets traités par la loi en quelque chose de facile à appréhender sur le modèle des motion design\n- traduire les effets visés par la loi en des traductions compréhensibles sur le modèle des serious games.\n- rendre possible la participation: ce sont les civic tech. Les plateformes de civic tech doivent une brique mais ne peuvent être le démarrage ni l'aboutissement de la démocratie numérique, sans quoi on risque de n'être que dans un solutionisme qui favoriser celles et ceux qui s'expriment déjà par tant d'autres canaux.\n- rendre possible différents niveaux de lectures et d'écriture: les plateformes doivent permettre d'utiliser les différentes profondeurs de lectures et différentes profondeurs d'écriture. C'est la garantie pour ne pas \"techniciser\" l'exercice de la démocratie numérique et ne pas le conditionner à la maitrise de nombreux codes. Pour autant, il convient de ne pas sombrer dans la caricature d'une démocratie au pouce levé (ou baissé...).\nCes outils doivent s'accompagner de budgets dédiés sur la modèle des coûts de propagande d'une élection pour permettre que l'ensemble des positions puissent être représentées au même niveau de qualité, par des moyens équitablement disponibles.\n\nD'une manière plus générale, il faut faciliter la compréhension des différentes modes d'actions de l'action publique:  en effet l'effet déceptif peut parfois être renforcé par la mise à l'écart d'une proposition, parce qu'elle ne relève pas du cadre de la loi, mais peuvent relever d'un décret, d'une circulaire, d'une politique d'achat, d'un changement dans le CGCT, peuvent s'opposer au droit européen.Il faut donc conjointement permettre à chacun de mieux comprendre ce qui relève de la loi, tout en séparer les propositions de leur traitement. Ce n'est pas parce qu'une proposition ne relève pas de la loi qu'elle n'est pas traitée par ailleurs.\nIl font donc envisager une \"écologie de la démocratie numérique\" qui vient éclairer le cheminement, l'usage, voire le recyclage d'une contribution.\nAinsi les outils de médiation numériques dédiés à la démocratie numérique doivent être mis à disposition au plus près des citoyens, sur les territoires, sans se limiter à leur disponibilité sur des plateformes.\nIls deviennent évidemment - par nature - disponibles pour celles et ceux qui représentent les territoires, à commencer par les parlementaires, pour qu'ils puissent les utiliser dans leurs propres pratiques de concertation locale.\nPour autant, les parlementaires sont parfois eux-mêmes contraints par l'injonction contradictoire entre représenter leurs territoires et défendre leurs propres positions (ils ont été dûment désignés pour les deux du reste).\n"
    },
    {
      "_id": "59ff316e82abf78a2231a6f2",
      "author": {
        "avatar": "https://secure.gravatar.com/avatar/6d258a7aed4a1c1687a46811df8f72a6?d=mm",
        "displayName": "Médias Cité",
        "extra": {
          "age": "3",
          "job": "8",
          "postal": "33100"
        },
        "firstName": "Médias",
        "fullName": "Médias Cité",
        "id": "59fedc0f82abf78a223192cc",
        "lastName": "Cité"
      },
      "createdAt": "2017-11-05T15:42:38.931Z",
      "text": "C'est pourquoi, il faut également s'appuyer sur des réseaux d'acteurs d'appui à l'émergence d'une démocratie numérique:\n- Les pôles territoriaux de médiation numérique doivent fournir et déployer les outils de médiation numériques dédiés à la démocratie numérique propices à la participation et assurer la montée en compétences des points d'appui locaux. sur ces outillages\n- Les points d'appui locaux à la démocratie numérique (et notamment les lieux de médiation numérique) doivent associer les acteurs de l'éducation populaire et les lieux de médiation numérique.\n- La coopérative La Mednum, parce qu'elle rassemble les parties prenantes de la démocratie numérique (pouvoirs publics, acteurs de la médiation numérique, acteurs du libre, acteurs de la civic tech, acteurs de l'éducation populaire, acteurs de l'éducation au code) devra avoir un rôle stratégique dans l'écosystème à déployer.\n- Les process en jeu doivent pouvoir se faire autour d'une stratégie reposant sur la confiance: c'est pourquoi une articulation entre la CNIL et les services de l'État doit permettre à l'État de jouer ce rôle de tiers de confiance. La direction \"Société Numérique\" de l'Agence du Numérique pourrait jouer ce rôle stratégique. Il conviendrait pour cela de conforté son rôle, ses mandats et ses moyens. La Caisse des Dépôts et Consignations, dans le cadre d'un mandat public, pourrait être l'opérateur contribuant à faciliter le changement d'échelle toutes les innovations sociale et numériques indispensables à la réussite d'une telle ambition, notamment en contribuant à leur robustesse économique tout en contribuant à garantir leur intérêt collectif.\n"
    },
    {
      "_id": "59ff318482abf78a2231a6f4",
      "author": {
        "avatar": "https://secure.gravatar.com/avatar/6d258a7aed4a1c1687a46811df8f72a6?d=mm",
        "displayName": "Médias Cité",
        "extra": {
          "age": "3",
          "job": "8",
          "postal": "33100"
        },
        "firstName": "Médias",
        "fullName": "Médias Cité",
        "id": "59fedc0f82abf78a223192cc",
        "lastName": "Cité"
      },
      "createdAt": "2017-11-05T15:43:00.656Z",
      "text": "B-3- Élargir le périmètre et la diversité des citoyens contributeurs:\n\nLorsqu'on est dans les urgences quotidiennes, le pas de côté permettant de se dire qu'on a légitimité, capacité et utilité à agir sur la chose publique n'est pas aisée. Et pour autant celles et ceux qui sont dans cette urgence ne sont pas les derniers concernés par les sujets en jeux. Mais il existe un méfiance, parfois un défiance, sur l'utilité de tels processus. On doit bien reconnait que bien souvent les pratiques de démocraties contributives / participatives se limitent à des process d'entérinement de décisions déjà prises ailleurs.\nLe corollaire d'agir pour diversifier les contributeurs suppose de pouvoir fournir de garantie quant à l'usage réel qui sera fait du travail produit.\n\nLa question des sans-voix:\n\nIl existe aujourd'hui de nombreuses stratégies: tirages au sort, stimulation de cibles particulières etc...\nNous, nous pensons qu'il faut transformer le sentiment d'incapacité dont témoignent bien des citoyens, en un l'acquisition d'un droit nouveau: c'est le sens de l'outil #APTIC que nous avons créé et qui a notamment pour avantage de transformer ce qui était vécu comme une carence jusqu'à alors, comme un droit nouveau gagné. Ce mécanisme est de nature à toucher des personnes que la médiation numérique avait du mal à cibler et à faire entrer dans des stratégies d'inclusion sociale et numérique. Cet outillage peut également servir les enjeux de démocratie numérique en facilitant le ciblage des publics les plus éloignés."
    },
    {
      "_id": "59ff319682abf78a2231a6fa",
      "author": {
        "avatar": "https://secure.gravatar.com/avatar/6d258a7aed4a1c1687a46811df8f72a6?d=mm",
        "displayName": "Médias Cité",
        "extra": {
          "age": "3",
          "job": "8",
          "postal": "33100"
        },
        "firstName": "Médias",
        "fullName": "Médias Cité",
        "id": "59fedc0f82abf78a223192cc",
        "lastName": "Cité"
      },
      "createdAt": "2017-11-05T15:43:18.406Z",
      "text": "C- Rendre la démocratie numérique soutenable:\n\nC-1- La démocratie numérique doit prioritairement produire des résultats:\n\nLa démocratie numérique ne manque pas de plateformes ni de solutions techniques. De même le citoyen ne manque pas d'occasion de débattre. Il manque d'occasion de participer de manière effective à la décision (cc. Jean-Yves Quemener).\nAussi la démocratie numérique a besoin de produire des effets mesurables et visibles, qui témoignent de manière effective d'un process crédible et d'une prise en compte réelle des contributions.\n\nC-2- La démocratie numérique doit être envisagé comme un investissement d'avenir:\n\nNotre démocratie ne s'est pas construite en 1 jour. Il faut donc, si on souhaite réellement contribuer à \"augmenter\" notre démocratie grâce au numérique voire envisager de la revitaliser grâce au numérique, que les investissements soient massifs et durables. Et qu'ils ne consistent pas qu'en des investissements matériels, dans des plateformes et/ou des outillages. Notre démocratie ne s'est pas fondée sur des bâtiments ou des investissements matériels, mais sur des implications durables : l'école, l'éducation, le financement des représentations citoyennes.\n\nIl faut donc envisager de mobiliser l'ensemble des outils existants, mais également consacrer une part significative du budget des pouvoirs publics (et de la recherche) sur l'invention et le portage d'une démocratie à l'ère numérique.\n\nEnfin la démocratie numérique ne peut consister en l'augmentation du pouvoir de(s) plateformes. Les plateformes doivent être l'outillage, pas l'objet de la démocratie numérique.\n\nC-3- La démocratie numérique doit articuler l'immédiateté du numérique avec le temps long de la loi:\n\nLe numérique se caractérise par une latence très faible entre une action et la réception de ses effets.\nDe ce point de vue, le numérique développe un rapport au monde plutôt fondé sur l'immédiateté. Ce qui est plutôt orthogonal à la fabrication de la loi, dont on peut justifier à bien des égards la nécessité de ne pas la produire dans un cadre \"pulsionnel\".\nLes autres processus tels que les pétitions remplissent ces critères d'immédiateté: non pas nécessairement dans leurs effets réels mais dans leurs effets \"massifs\". On a rapidement d'aboutir à un résultat parce que la mobilisation a déjà produit un effet, celui de rassembler sous une bannière.\nPour être soutenable, la démocratie numérique doit donc conjuguer un \"retour d'effort\" assez rapide, permettant de mesure des effets, tout en faisant que la concertation étaye la \"fabrique\" de la loi: il convient de ne pas faire croire que la contribution signifie que chacun se verra dans la loi, mais plutôt que cela contribue à augmenter la parfaite construction de l'intérêt général. La démocratie numérique doit donc, si elle veut être soutenable, impliquer ET décentrer.\n\nIl faut enfin trouver le moyen de renforcer la culture du développement plutôt que l'injonction du slogan. Tout s'y oppose actuellement. Et pourtant c'est à cet endroit que se situe sans nulle doit une des garanties du caractère soutenable de la démocratie numérique.\n\n"
    },
    {
      "_id": "59ff31bc82abf78a2231a6fe",
      "author": {
        "avatar": "https://secure.gravatar.com/avatar/6d258a7aed4a1c1687a46811df8f72a6?d=mm",
        "displayName": "Médias Cité",
        "extra": {
          "age": "3",
          "job": "8",
          "postal": "33100"
        },
        "firstName": "Médias",
        "fullName": "Médias Cité",
        "id": "59fedc0f82abf78a223192cc",
        "lastName": "Cité"
      },
      "createdAt": "2017-11-05T15:43:56.848Z",
      "text": "Cette contribution est disponible en version intégrale et bien plus lisible sur http://bit.ly/2j1QIH6"
    }
  ],
  "repliesCount": 6,
  "score": 6,
  "text": "**Rendre la démocratie numérique souhaitable, faisable, soutenable.**\n\nA- Rendre la démocratie numérique souhaitable:\nA-1- Tirer les bénéfices des premières expériences:\nCe que l'on peut tirer des premières expériences conduites, et notamment de la concertation pour la loi pour une République Numérique, c'est que:\n- ont contribué majoritairement des acteurs concernés plus que des citoyens épars, plutôt des habitués à la prise de parole qui ont donc trouvé là un canal supplémentaire, que des personnes rares dans le débat public qui auraient trouvé là l'occasion de contribuer.\n- ont été apportés des éléments qui relevaient globalement de ce que pouvait être une feuille de route de l'action publique, sans que soit nécessairement identifié:\n-- ce qui relevait de la politique publique, de la loi, du décret, voire de la circulaire.\n-- ce qui relevait de l'échelon de l'Europe, de l'État et des collectivités\n-- ce qui relevait des compétences de l'État régulateur et de l'État financeur.\n- ont été peu partagés les critères d'arbitrages, de décisions, et de ré-orientations et de suivi des contributions. Ce qui ne signifie pas qu'il n'y en a pas eu.\n- ont été peu tracés les process depuis la concertation jusqu'aux décrets d'application.\nIl convient enfin de noter que:\n- le sujet correspondait au medium : comment rendre possible la démocratie numérique sur des sujets qui ne traitent pas du numérique ?\n- la plateforme n'était pas opensource : comment garantir la loyauté des algorithmes et l'usage des données et des identités ?\n\nA-2- Garantir la controverse plutôt que l'affrontement des opinions:\nEn creux se joue un cap assez déterminant dans notre exercice démocratique. Entre notre modèle républicain et les modèles nord-américains. Ces derniers fonctionnent davantage par l'agrégation d'un grand nombre de personne (les communautés) et/ou d'un haut-niveau d'influence (les lobbys). La décision collective se fait par les rapports de forces entres les blocs qui se constituent sur la plupart des questions. Par opposition, notre modèle, pétrit d'une culture républicaine (au sens res publica), voire d'éducation populaire, prétend placer la \"chose publique\" comme quelque chose qui devrait transcender les intérêts particuliers. Il en résulte les concepts d'intérêt général, d'intérêt collectif. Avec des décisions qui parfois ne sont pas celles des groupes les plus influents mais de l'idée d'une forme de dépassement de chacun au nom d'un intérêt qui nous dépasse un peu et sur lequel on s'écharpe régulièrement.\nOr, dans le même temps les technologies sont pour l'heure essentiellement issues de la culture nord-américaine. Elles sont structurées, par leurs lexiques, leurs codes et leurs algorithmes pour produire deux choses garantissant la fidélisation de leurs communautés:\n- chaque usager se voit et se renforce dans ses avis plus qu'il n'élargit sa représentation du monde: les bulles de filtres\n- ces technologies sont propices à créer des avis dominants : les topics trends\nIl en résulte un risque majeur pour la démocratie : celui de la tyrannie de la majorité. (« Mais la majorité elle-même n’est pas toute-puissante. Au-dessus d’elle, dans le monde moral, se trouvent l’humanité, la justice et la raison ; dans le monde politique, les droits acquis. La majorité reconnaît ces deux barrières, et s’il lui arrive de les franchir, c’est qu’elle a des passions, comme chaque homme, et que, semblable à eux, elle peut faire le mal en discernant le bien. » — Tocqueville)\nIl en résulte que:\n- sans des plateformes numériques développées pour nos approches démocratiques, la démocratie numérique risque de s'apparenter à une démocratie d'opinions: il faut donc contribuer au développement de civic tech basées sur nos codes que d'importer les codes nord-américains en même temps qu'on importe leurs technologies.\n- sans des stratégies de nature à \"ré-enchanter\" nos codes culturels et politiques, les habitants se comporteront d'avantage en usager qu'en citoyen: il faut donc engager de réelles stratégies d'appui à l'émergence des pratiques démocraties à l'ère numérique."
}