{
  "author": {
    "avatar": "https://graph.facebook.com/230523610816026/picture",
    "displayName": "Alexis Rey",
    "firstName": "Alexis",
    "fullName": "Alexis Rey",
    "id": "59ff6f3882abf78a2231b50e",
    "lastName": "Rey"
  },
  "createdAt": "2017-11-05T20:30:59.865Z",
  "flags": [],
  "id": "59ff750382abf78a2231b5cb",
  "reference": "59d731a712406bdd5d6277d1",
  "replies": [],
  "repliesCount": 0,
  "score": -1,
  "text": "Lorsqu'une part (20% à 50% des inscrits d'une circonscription) des citoyens ne se sent plus représentées par son député, une nouvelle élection doit avoir lieu. \n\nAinsi le député aura toujours le bien être de ses concitoyens en ligne de mire."
}