{
  "author": {
    "avatar": "https://lh3.googleusercontent.com/-XdUIqdMkCWA/AAAAAAAAAAI/AAAAAAAAAAA/4252rscbv5M/photo.jpg?sz=50",
    "displayName": "Helene D.",
    "firstName": "Helene",
    "fullName": "Helene D.",
    "id": "59e504e866914e1e82238a5c",
    "lastName": "D."
  },
  "createdAt": "2017-10-16T19:24:49.022Z",
  "flags": [
    {
      "_id": "59fccc78ccdac63cb472bd49",
      "author": "59fcc4fdccdac63cb472bca6",
      "createdAt": "2017-11-03T20:07:20.331Z",
      "value": "spam"
    }
  ],
  "id": "59e5078166914e1e82238a6b",
  "reference": "59d731a712406bdd5d6277d1",
  "replies": [],
  "repliesCount": 0,
  "score": 34,
  "text": "Faire connaitre la consultation !!! J'en ai entendu parler lorsque F De Rugy en a parlé dans l'emission \"on n'est pas couchés\""
}