{
  "author": {
    "avatar": "https://graph.facebook.com/1508745212552761/picture",
    "displayName": "Marie-josèphe Courdouan",
    "firstName": "Marie-josèphe",
    "fullName": "Marie-josèphe Courdouan",
    "id": "59ff149182abf78a2231a136",
    "lastName": "Courdouan"
  },
  "createdAt": "2017-11-05T13:45:18.486Z",
  "flags": [],
  "id": "59ff15ee82abf78a2231a17a",
  "reference": "59d733cb12406bdd5d6277ea",
  "replies": [],
  "repliesCount": 0,
  "score": 0,
  "text": "Oui je soutiens cette proposition pour une véritable prise en compte de l'opinion des citoyens qui jusqu'à présent n'ont servi que de caution pour que la classe politique puisse continuer à exister sans souci du bien public."
}