{
  "author": {
    "avatar": "https://secure.gravatar.com/avatar/0fb5e662187b815f08fc9cd711eccff9?d=mm",
    "displayName": "laura laquet",
    "extra": {
      "age": "4",
      "job": "2",
      "postal": "04160"
    },
    "firstName": "laura",
    "fullName": "laura laquet",
    "id": "59fc94b7ccdac63cb472bade",
    "lastName": "laquet"
  },
  "createdAt": "2017-11-03T16:38:40.865Z",
  "flags": [],
  "id": "59fc9b90ccdac63cb472bb1b",
  "reference": "59d7335412406bdd5d6277e4",
  "replies": [],
  "repliesCount": 0,
  "score": 0,
  "text": "Commentaire rédigé collectivement par le comité local dont je suis l'animatrice\n\nAfin de pouvoir évaluer l'efficacité d'une loi il faut qu’au moment de sa création les objectifs soient clairement explicités.\nNous pourrons à partir de cela faire des sondages simples (type satisfait ? bouton OUI et NON sur une I PAD par exemple). Ces sondages seraient menés à bien par les membres des  comités locaux sur un secteur géographique prédéfini qui compileraient par la suite  les réponses et les feraient remonter au niveau national\nAfin d’intégrer le problème de la fracture numérique nous proposons de faire le rélai aussi par le biais de CL, nous pourrions faire des convocations papier via les boites aux lettres (étant donné que nous visons à intégrer les personnes »exclues « du numérique) pour assister à des permanences définies pour écouter et nous faire l’echo des personnes non connectés"
}