{
  "author": {
    "avatar": "https://secure.gravatar.com/avatar/e28785fbe6d80c67b3d47e57fdc47509?d=mm",
    "displayName": "michèle jobert",
    "extra": {
      "age": "5",
      "job": "6",
      "postal": "71640"
    },
    "firstName": "michèle",
    "fullName": "michèle jobert",
    "id": "59fb7096ccdac63cb472b76b",
    "lastName": "jobert"
  },
  "createdAt": "2017-11-02T19:34:11.253Z",
  "flags": [],
  "id": "59fb7333ccdac63cb472b772",
  "reference": "59d7325812406bdd5d6277d4",
  "replies": [],
  "repliesCount": 0,
  "score": 0,
  "text": "Bonjour,\n \nJe suis une alliée dans le mouvement ATD Quart Monde.Ensemble, militants et alliésn nous luttons pour détruire la misère.\nJ'apporte une contribution personnelle à l'appel à paticiper à l'atelier législatif citoyen relatif à la démocratie numérique et les nouvelles formes de participation citoyenne.\n \n \nJe veux raporter un écrit de Lucien Duquesne volontaire permanent d'ATD Quart Monde suite à un interview du sociologue Fréderic Viguier paru dans le journal d'ATD Quart Monde de Juin 2017 :\n \n\"A la question sur comment les regard des pauvres a changé avec Wresinski F Viguier répond : \"avec lui les pauvres sont des acteurs à part entière de leur prise en charge\".\nCe n'est pas juste de réduire à ce point la pensée de Joseph Wresinski explique Lucien Duquesne, il n'a cessé d'appeler à ce que les personnes les plus exclues puissent débattre là où débattent les autres hommes pour l'avenir de toute l'humanité et non pas pour l'amélioration de leur prise en charge ! Il n'a cessé de répéter que ceux qui ont subi les pires injustices depuis toujours ont une parole essentielle à dire pour faire avancer la justice pour tous et non pour eux seulement\".\n \nFrédéric Viguier dit que Wresinsdi a été le plus cohérent dans la volonté d'appliquer cette expérience jusqu'au bout, à toutes les étapes des politiques sociales. Là encore la penée de Joseph Wresinski est ratatinée. Il s'est battu pour que les citoyens les plus en difficulté aient leur mot à dire dans la conception et dans l'évaluation des politiques publiques pas seulement sociales !\n \nLes personnes qui vivent l'exclusion sont pour beaucoup encore loin des outils permettant d'avoir accès au numérique.\n Comment faire alors pour que leur reflexion puisse être entendue et serve à faire avancer la justice pour tous.\nQuels outils peuvent être mis en place pour que la pensée d'ATD Quart Monde fasse débat ?\n \nJe vous remercie de prendre en compte ma c ontribution.\n\nMichèle jobert\nGivry"
}