{
  "author": {
    "avatar": "https://secure.gravatar.com/avatar/4e20eddd7a0f650bd11ff89f43af4b31?d=mm",
    "displayName": "Christian Mehl",
    "extra": {
      "age": "5",
      "job": "4",
      "postal": "75014"
    },
    "firstName": "Christian",
    "fullName": "Christian Mehl",
    "id": "59df24b366914e1e82238334",
    "lastName": "Mehl"
  },
  "createdAt": "2017-10-12T08:31:55.938Z",
  "flags": [],
  "id": "59df287b66914e1e82238343",
  "reference": "59d7325812406bdd5d6277d4",
  "replies": [
    {
      "_id": "59fd7801ccdac63cb472c534",
      "author": {
        "avatar": "https://lh3.googleusercontent.com/-rzw0PLFNXQs/AAAAAAAAAAI/AAAAAAAAAT4/RT_p8Y-6W5E/photo.jpg?sz=50",
        "displayName": "Frédéric Lointier",
        "firstName": "Frédéric",
        "fullName": "Frédéric Lointier",
        "id": "59fd6dd6ccdac63cb472c488",
        "lastName": "Lointier"
      },
      "createdAt": "2017-11-04T08:19:13.982Z",
      "text": " Je pense effectivement qu’améliorer l’implication citoyenne constructive c’est du long terme, mais je ne pense pas que la fracture numérique sera marginale rapidement : d’où l’intérêt dans la période transitoire actuelle d’articuler les 2 modes (numérique et présentiel)"
    }
  ],
  "repliesCount": 1,
  "score": 0,
  "text": "Ce projet est un projet long terme et d'ici sa mise en place la fracture numérique deviendra marginale. Si ce n'est pas le cas il faudra compléter l'approche numérique, projet par projet suivant le sujet par une approche présentielle"
}