{
  "author": {
    "avatar": "https://lh3.googleusercontent.com/-N2eOCYVEDwA/AAAAAAAAAAI/AAAAAAAAAUk/XW5Xba1Znhw/photo.jpg?sz=50",
    "displayName": "zelda my video",
    "firstName": "zelda",
    "fullName": "zelda my video",
    "id": "59e6269066914e1e82238c1a",
    "lastName": "my video"
  },
  "createdAt": "2017-10-17T16:01:47.790Z",
  "flags": [],
  "id": "59e6296b66914e1e82238c24",
  "reference": "59d7347212406bdd5d6277f7",
  "replies": [],
  "repliesCount": 0,
  "score": -1,
  "text": "ces consultations devraient être systématique, les modalités devraient être simple d'accès et d'utilisation (tout le monde n'a pas internet et une partie de la population se voit privée de donner son avis ou de contribuer à ce genre de consultation)\nElles devraient être organisées par l'organe qui fait la proposition et suffisamment claire pour sa compréhension\nPour s'assurer de leur prise en compte, qu'elles soient bien étudiées, un groupe indépendant de l'organe organisateur devrait être formé. Et pour finir, le résultat et la synthèse de cette consultation devrait être diffusée publiquement"
}