{
  "author": {
    "avatar": "https://graph.facebook.com/1886562938050461/picture",
    "displayName": "Jean-Marc Faure",
    "firstName": "Jean-Marc",
    "fullName": "Jean-Marc Faure",
    "id": "59ff342282abf78a2231a771",
    "lastName": "Faure"
  },
  "createdAt": "2017-11-05T16:02:11.345Z",
  "flags": [],
  "id": "59ff360382abf78a2231a7bf",
  "reference": "59d7335412406bdd5d6277e4",
  "replies": [],
  "repliesCount": 0,
  "score": 0,
  "text": "D'accord"
}