{
  "author": {
    "avatar": "https://secure.gravatar.com/avatar/35c32e982dc81d278948f42dac8368ab?d=mm",
    "displayName": "François Mouillaud",
    "extra": {
      "age": "4",
      "job": "2",
      "postal": "22300"
    },
    "firstName": "François",
    "fullName": "François Mouillaud",
    "id": "59fb98f7ccdac63cb472b826",
    "lastName": "Mouillaud"
  },
  "createdAt": "2017-11-02T22:36:14.071Z",
  "editedAt": "2017-11-02T22:37:11.607Z",
  "flags": [],
  "id": "59fb9ddeccdac63cb472b83b",
  "reference": "59d734d112406bdd5d6277ff",
  "replies": [],
  "repliesCount": 0,
  "score": 0,
  "text": "Le droit de pétition actuel n'est pas moderne (500 000 signatures papier !) et peu contraignant. A l'opposé, le référendum d'initiative partagée est très engageant mais très lourd. Sur ces deux axes, on peut imaginer des voies médianes permettant notamment de moderniser le droit d'interpellation des parlementaires. Sur le mode d'interpellation, par signature électronique (ce serait l'occasion de mettre en oeuvre cette procédure qui existe dans des pays Européens bien plus avancés comme l'Estonie), avec un mécanisme de filtre pour contrôler la validité des interpellations (signataires, constitutionnalité, etc..). Et sur la nature de l'interpellation, on peut imaginer un memorandum, qui ne serait pas une simple question fermée soumise à référendum, mais un ensemble de mesures sous une forme simplifiée, qui pourrait faire lui-même l'objet d'une co-construction par les signataires."
}