{
  "author": {
    "avatar": "https://secure.gravatar.com/avatar/201c38475bfc0cb2dc49a151753df81a?d=mm",
    "displayName": "Loïc  Crouzet",
    "extra": {
      "age": "2",
      "job": "2",
      "postal": "43250"
    },
    "firstName": "Loïc ",
    "fullName": "Loïc  Crouzet",
    "id": "59ff3d9382abf78a2231a933",
    "lastName": "Crouzet"
  },
  "createdAt": "2017-11-05T16:45:45.080Z",
  "flags": [],
  "id": "59ff403982abf78a2231a9c4",
  "reference": "59d734d112406bdd5d6277ff",
  "replies": [],
  "repliesCount": 0,
  "score": 0,
  "text": "LA QUESTION CITOYENNE AU GOUVERNEMENT : Il faut qu'un panel citoyen représentatif de la société française puisse poser une question au Gouvernement chaque semaine. Ce panel sera désigné par tirage au sort après inscription sur cette plateforme et renouvelé une fois les questions posées. Le citoyen mentionnera lors de son inscription sur la plateforme la thématique qu'il souhaite aborder. Cette inscription sur la plateforme devra être accompagnée de la signature d'une charte des valeurs républicaines afin d'éviter des questions inappropriées."
}