{
  "author": {
    "avatar": "https://lh3.googleusercontent.com/-XdUIqdMkCWA/AAAAAAAAAAI/AAAAAAAAAAA/4252rscbv5M/photo.jpg?sz=50",
    "displayName": "Pierre Camescasse",
    "firstName": "Pierre",
    "fullName": "Pierre Camescasse",
    "id": "59fdf75c82abf78a2231580c",
    "lastName": "Camescasse"
  },
  "createdAt": "2017-11-04T17:26:52.892Z",
  "flags": [],
  "id": "59fdf85c82abf78a223158df",
  "reference": "59d734d112406bdd5d6277ff",
  "replies": [],
  "repliesCount": 0,
  "score": 0,
  "text": "La \"Vox populi\" doit rester la \"Vox Dei\" et le fondement de toute Démocratie (Demo Cratos = pouvoir du Peuple), et ce en permanence."
}