{
  "author": {
    "avatar": "https://lh6.googleusercontent.com/-7LedA3M1-A8/AAAAAAAAAAI/AAAAAAAAAIw/YxeZ96uQJpg/photo.jpg?sz=50",
    "displayName": "Karine Bugeja",
    "firstName": "Karine",
    "fullName": "Karine Bugeja",
    "id": "5a01b05c82abf78a2231da68",
    "lastName": "Bugeja"
  },
  "createdAt": "2017-11-07T13:23:33.255Z",
  "flags": [],
  "id": "5a01b3d582abf78a2231da95",
  "reference": "59d7325812406bdd5d6277d4",
  "replies": [],
  "repliesCount": 0,
  "score": -1,
  "text": "Déléguer à plusieurs associations (de jeunesse, de soutien aux démunis, etc...) l’organisation d’Universites Populaires Citoyennes et Politiques dans toute la France avec l’objectif affiché d’aller chercher les plus exclus et les plus éloignés."
}