{
  "author": {
    "avatar": "https://secure.gravatar.com/avatar/c3bd9c7f1368a5ecdf53009ceda4ee3f?d=mm",
    "displayName": "Christophe buhot",
    "extra": {
      "age": "3",
      "job": "2",
      "postal": "78320"
    },
    "firstName": "Christophe",
    "fullName": "Christophe buhot",
    "id": "59ff1a4182abf78a2231a290",
    "lastName": "buhot"
  },
  "createdAt": "2017-11-05T19:00:53.951Z",
  "flags": [],
  "id": "59ff5fe582abf78a2231b271",
  "reference": "59d7347212406bdd5d6277f7",
  "replies": [],
  "repliesCount": 0,
  "score": 17,
  "text": "* Contribution collective Café Citoyen : Présidée par Mme Nadia HAI Députée de la   11ème circonscription des Yvelines *\n**78-11-Q2 Du terrain au Gouvernement, des citoyens sollicités, consultés, impliqués et acteurs**\n\nNiveau 1 : Sur le terrain les **initiatives sont portées librement par la Société Civile**, les associations, syndicats, mouvements et partis politiques par tous moyens d'implications des citoyens adaptés (mode associatif, portes à portes, marchés, débats, contributions volontaires)\n\nNiveau 2 : **Élus et parlementaires organisent le recueil des avis de leurs électeurs**. Notamment la mission du député est élargi à cette **obligation de concertation** mais son mode reste au libre choix du député (exemple des ateliers législatifs citoyens ou rencontres citoyennes).  Seule nouveauté, le Député doit produire un **bilan annuel public** de cette concertation et des actions législatives qui en ont découlés ou pas. \n\n**Niveau 3 CESE** : Le CESE étudie et si nécessaire précise ou reformule les propositions de textes émanent des citoyens (voir 78-11-Q1). Il met à disposition ses compétences en terme d'expertises et conseils techniques ou juridiques pour élaborer des pistes de textes législatives ou pré-projets. Il doit avant tout  se concentrer sur les buts, enjeux, objectifs, voir proposer des indicateurs de mesure d'efficacité. Il a toute latitude pour impliquer les porteurs originaux de l'initiative. Il peut faire évaluer ces nouvelles versions aux citoyens via la plateforme d'initiative citoyenne. Il transmet directement, ou après la consultation précédente, à la 9 eme commission permanente de l'assemblée nationale ou au Gouvernement. \n\n**Niveau 4 la 9eme Commission AN **: Une neuvième commission permanente de l'assemblée nationale est créée afin de traduire en termes législatifs appropriés les propositions émanant des citoyens venues via le CESE, via tout parlementaire à commencer par les députés (ou via la plateforme d'initiative citoyenne). Cette 9eme Commission pourrait auditer les porteurs de l'initiative voire les auditionner ou les impliquer dans la rédaction de cette loi ou texte législatif. Cette commission devra veiller à éviter l'inflation législative (redondance des textes, sécurité juridique, stabilité législative) et garantir une lisibilité des textes.\nDes citoyens pourraient être tirés au sort parmi les citoyens volontaires pour participer aux différentes commissions de l'assemblée nationale. \n\n**Niveau 5 un Sénat citoyen **: Le travail d'analyse des textes, la rédaction des amendements, la relecture des projets législatifs du Sénat pourraient être utilement renforcés en associant   ponctuellement des citoyens tirés au sort parmi des volontaires sans conflit d'intérêt avec les projets étudiés. Ces citoyens tirés au sort sur le mode des tribunaux d'assisses seraient mobilisés sur des périodes courtes pour un ou plusieurs projets de texte et seraient indemnisés pour le temps passé au service de la Nation. Ils pourraient participer à l'ensemble des travaux du Sénat pendant leur mission y compris l'évaluation des lois."
}