{
  "author": {
    "avatar": "https://secure.gravatar.com/avatar/eeaa8a03ed0f5f47d3b2ad82b0728eb7?d=mm",
    "displayName": "Matthieu ROY",
    "extra": {
      "age": "2",
      "job": "1",
      "postal": "89600"
    },
    "firstName": "Matthieu",
    "fullName": "Matthieu ROY",
    "id": "59e50ac066914e1e82238a7f",
    "lastName": "ROY"
  },
  "createdAt": "2017-11-06T15:31:09.178Z",
  "flags": [],
  "id": "5a00803d82abf78a2231ccaf",
  "reference": "59d737c712406bdd5d627805",
  "replies": [],
  "repliesCount": 0,
  "score": 1,
  "text": "Belle idée que cette consultation citoyenne. Mais faire un tri pour ne retenir que  les commentaires les plus populaires est pour moi discutable. Bon nombre de commentaires \"sans like\" sont néanmoins plis intéressants que certains commentaires \"populaires\" qui sont souvent très \"militants\".\n\nEnfin, le gros bémol est le manque de communication autour de cette consultation et donc de visibilité pour les citoyens. Beaucoup de personnes n'ont tout simplement jamais eu connaissance de cette initiative. Ce qui est regrettable vu l'importance et la rareté d'un tel \"événement\".\n\nNéanmoins, heureux que le bureau de l'Assemblée Nationale ai souhaité consulter les citoyens dans le cadre de la modernisation de l'institution. Espérons que ces avis soient maintenant réellement considérés et pris en compte ...!"
}