{
  "author": {
    "avatar": "https://secure.gravatar.com/avatar/0d6e9ddd7b1ad120731e269ec0134b09?d=mm",
    "displayName": "françoise RODSTEIN",
    "extra": {
      "age": "5",
      "job": "6",
      "postal": ""
    },
    "firstName": "françoise",
    "fullName": "françoise RODSTEIN",
    "id": "59e7a6ad66914e1e82238f84",
    "lastName": "RODSTEIN"
  },
  "createdAt": "2017-10-18T19:54:24.408Z",
  "flags": [],
  "id": "59e7b17066914e1e82238fb6",
  "reference": "59d731a712406bdd5d6277d1",
  "replies": [],
  "repliesCount": 0,
  "score": 0,
  "text": "Si l'on numérise , il faut stabiliser certains aspects de la vie politique. Je propose la remise à plat de toutes les circonscriptions électorales de France et leur refonte selon des critères objetifs, géographiques, économiques et sociaux. Le découpage serait fait par une autorité , indépendante de quelque pouvoir que ce soit. Interdiction aux gouvernements de pratiquer du découpage."
}