{
  "author": {
    "avatar": "https://graph.facebook.com/1599507213434620/picture",
    "displayName": "Marc Latiere",
    "firstName": "Marc",
    "fullName": "Marc Latiere",
    "id": "59dcc41c9b28097eb6b4184c",
    "lastName": "Latiere"
  },
  "createdAt": "2017-10-10T13:38:30.346Z",
  "flags": [],
  "id": "59dccd569b28097eb6b418b2",
  "reference": "59d734d112406bdd5d6277ff",
  "replies": [
    {
      "_id": "59f37bc1e8a9656c1a8e704b",
      "author": {
        "avatar": "https://graph.facebook.com/10155852828033841/picture",
        "displayName": "Yvan Bachaud",
        "firstName": "Yvan",
        "fullName": "Yvan Bachaud",
        "id": "59ec210166914e1e82239673",
        "lastName": "Bachaud"
      },
      "createdAt": "2017-10-27T18:32:33.321Z",
      "text": "Il n'y aura quasi pas de particpatif  à un référendum \"consultatif\"... Il le faut décisionnel sir le oui fait un meilleur pouircentage des inscrits que la majorité en place. C'est démocratiquement inattaquable et colle à la situation locale."
    }
  ],
  "repliesCount": 1,
  "score": 0,
  "text": "Au niveau regional: Les grands projets choisis pour le futur ( transport, urbanisation, Santé...) doivent être soumis pour avis consultatif dans le cadre d'un referendum. Avec toutefois un verrou, si 65% des avis est négatif ( à débattre) sur un quorum de participants au referedum ( à définir) alors ce resultat a force de veto sur le projet qui a été Soumis.\nAu niveau national: s'inspirer du système suisse qui intègre la voie participative et la voie parlementaire. L'Election Sénatoriale devrait être au suffrage universel pour éviter des accords caché inter-partis. Aujourd'hui, le Sénat ne représente absolument pas ni la Présidentielle ni les législatives. Les maires pourraient presenter leur choix de représentants au Sénat mais l'élection se ferait auprès de la population.\n\nEnfin, la démocratie participative ne peut exister entre autre que par la transparence de gestion, celle ci fait défaut à tous les étages. La Cours des comptes devrait être non pas seulement \"un expert comptable\" mais bien un tant le directeur Financier. La cours des comptes devrait mettre en place un contrôle de gestion au niveau municipal, intercommunal, regional et national. Ce contrôle de gestion, chaque trimestre, émettrait un avis favorable, neutre ou défavorable, quant à la gestion en cours. Au bout de 3 avis défavorables, un audit serait déclencher sur la gestion avec soumission du rapport au Préfet, ou à Bercy. Ce rapport serait rendu public.\n\nVoici pour le moment, mes 1ères reflexions"
}