{
  "author": {
    "avatar": "https://lh3.googleusercontent.com/-0u13CXpgYjM/AAAAAAAAAAI/AAAAAAAAPfk/K8WJ44UMoJw/photo.jpg?sz=50",
    "displayName": "Sankar Chane",
    "firstName": "Sankar",
    "fullName": "Sankar Chane",
    "id": "59fde829e7c9379d2c562abb",
    "lastName": "Chane"
  },
  "createdAt": "2017-11-04T16:24:57.635Z",
  "flags": [],
  "id": "59fde9d9e7c9379d2c562c9f",
  "reference": "59d731a712406bdd5d6277d1",
  "replies": [],
  "repliesCount": 0,
  "score": 0,
  "text": "Pour le vote obligatoire, la prise en compte du vote blanc, le droit des citoyens à révoquer des élus.\nPour l'application du scrutin de Condorcet randomisé. \nPour la convocation d'une assemblée Constituante tirée au sort (partiellement). \nBref, il est peut-être grand temps de changer de République plutôt que d'appliquer des rustines à la 5ème ?"
}