{
  "author": {
    "avatar": "https://secure.gravatar.com/avatar/08d0cd7d035f42c7292ff4dca49f8d35?d=mm",
    "displayName": "Nicolas K. Blanchard",
    "extra": {
      "age": "2",
      "job": "3",
      "postal": "75014"
    },
    "firstName": "Nicolas K.",
    "fullName": "Nicolas K. Blanchard",
    "id": "59ff3ee082abf78a2231a97e",
    "lastName": "Blanchard"
  },
  "createdAt": "2017-11-05T18:04:01.651Z",
  "flags": [],
  "id": "59ff529182abf78a2231af4f",
  "reference": "59d7347212406bdd5d6277f7",
  "replies": [],
  "repliesCount": 0,
  "score": 1,
  "text": "Les consultations citoyennes n'ont de sens que lorsqu'elles ont un impact sur les décisions politiques, et n'ont de légitimité que lorsqu'elles donnent à toute la population la possibilité de s'exprimer. \nPour garantir cette deuxième partie, il faut pouvoir réduire la fracture numérique et donner des moyens d'accès multiples aux consultations, en encourageant les regroupements citoyens et le partage de l'accès et de l'expertise en stimulant les interactions entre diverses générations. Le vote en ligne peut rester sécurisé et anonyme par de nouvelles procédures cryptographies, mais là n'est pas aujourd'hui la question. Nous disposons déjà des technologies nécessaires, il faut donc les rendre utilisables par tout un chacun. \nPour cela, il faudrait s'appuyer sur plusieurs méthodes en parallèle:\n- l'encouragement à la création de groupes de réflexion locaux\n- la mise en place d'un système d'information/discussion/débat/réflexion à l'échelle nationale permettant non seulement d'avoir accès aux textes mais aussi de suivre les réflexions des citoyens sur ces textes, en s'inspirant de République Numérique mais en intégrant des outils plus avancés de discussion (comme pol.is), qui permettraient au système de rester compréhensible par tous les citoyens sans avoir à investir un temps démentiel. Ces systèmes devraient reconnaître et stimuler les groupes locaux.\n- Un engagement fort de la part non seulement des parlementaires mais des ministres, pour garantir que le gouvernement ne peut pas simplement se permettre d'ignorer certains sujets (ce qui eut lieu avec République Numérique). \nDans un premier temps, ces outils (comme celui-ci) ne seront pas utilisés massivement, car une culture de participation citoyenne se forme sur des décennies. Ce manque de participation viendra non seulement d'une incompréhension (et d'un manque de publicité) mais aussi d'une illégitimité perçue du système par son faible taux de participation. Cela changera avec le temps (comme a été observé avec les procédures de participation locale en Amérique du Sud), et nous ne devons pas abandonner simplement car le succès initial est mitigé."
}