{
  "author": {
    "avatar": "https://secure.gravatar.com/avatar/f9b2313330b0bf0a65313d1a40dbbccf?d=mm",
    "displayName": "Nicolas  Abdo-Hanna",
    "extra": {
      "age": "4",
      "job": "7",
      "postal": "78610"
    },
    "firstName": "Nicolas ",
    "fullName": "Nicolas  Abdo-Hanna",
    "id": "59fdf0ba82abf78a223150cb",
    "lastName": "Abdo-Hanna"
  },
  "createdAt": "2017-11-04T18:16:28.304Z",
  "flags": [],
  "id": "59fe03fc82abf78a22316422",
  "reference": "59d734d112406bdd5d6277ff",
  "replies": [],
  "repliesCount": 0,
  "score": 0,
  "text": "Tout cela pourrait encourager beaucoup de personnes qui ne s'intéressent vraiment à la vie du pays qu'à l'occasion d'élections, à participer tout le temps.\nQuant au fait que cela vienne de change.org, je ne sais quoi en penser à l'instant mais je vais investiguer sur ce mouvement.\nSaluts à toutes et tous."
}