{
  "author": {
    "avatar": "https://lh4.googleusercontent.com/-vNCXeW02pbA/AAAAAAAAAAI/AAAAAAAAAyE/uDEISIFiYSc/photo.jpg?sz=50",
    "displayName": "klugii undefined",
    "firstName": "klugii",
    "fullName": "klugii undefined",
    "id": "59fe055382abf78a22316513"
  },
  "createdAt": "2017-11-04T18:28:11.710Z",
  "flags": [],
  "id": "59fe06bb82abf78a223166a5",
  "reference": "59d731a712406bdd5d6277d1",
  "replies": [],
  "repliesCount": 0,
  "score": 0,
  "text": "Rendre obligatoire le recours au référendum pour garantir le respect de la décision populaire."
}