{
  "author": {
    "avatar": "https://graph.facebook.com/1914929905425913/picture",
    "displayName": "Amar Bechchar",
    "firstName": "Amar",
    "fullName": "Amar Bechchar",
    "id": "59fed4b182abf78a22318f73",
    "lastName": "Bechchar"
  },
  "createdAt": "2017-11-05T09:13:05.229Z",
  "flags": [],
  "id": "59fed62182abf78a2231903b",
  "reference": "59d737c712406bdd5d627805",
  "replies": [],
  "repliesCount": 0,
  "score": 0,
  "text": "Très bonne innovation"
}