{
  "author": {
    "avatar": "https://secure.gravatar.com/avatar/e63ff2117ffd8a44aa0c349d13ac43ae?d=mm",
    "displayName": "Agnes Agarla",
    "extra": {
      "age": "4",
      "job": "3",
      "postal": "38100"
    },
    "firstName": "Agnes",
    "fullName": "Agnes Agarla",
    "id": "5a00582f82abf78a2231c99e",
    "lastName": "Agarla"
  },
  "createdAt": "2017-11-06T12:42:53.238Z",
  "flags": [],
  "id": "5a0058cd82abf78a2231c9ad",
  "reference": "59d734d112406bdd5d6277ff",
  "replies": [],
  "repliesCount": 0,
  "score": 0,
  "text": "Soyons de vrais acteurs de notre démocratie."
}