{
  "author": {
    "avatar": "https://graph.facebook.com/10210063925410765/picture",
    "displayName": "Frédéric Moisy Nguyen",
    "extra": {
      "age": "3",
      "job": "3",
      "postal": "91290"
    },
    "firstName": "Frédéric",
    "fullName": "Frédéric Moisy Nguyen",
    "id": "59e7afdd66914e1e82238faf",
    "lastName": "Moisy Nguyen"
  },
  "createdAt": "2017-10-18T20:38:42.832Z",
  "flags": [],
  "id": "59e7bbd266914e1e82238fdd",
  "reference": "59d737c712406bdd5d627805",
  "replies": [
    {
      "_id": "59fe053482abf78a223164f4",
      "author": {
        "avatar": "https://secure.gravatar.com/avatar/9952f45665007b5c6d5ca878af573d5f?d=mm",
        "displayName": "Jean-Claude HEESEN",
        "extra": {
          "age": "4",
          "job": "6",
          "postal": "82110"
        },
        "firstName": "Jean-Claude",
        "fullName": "Jean-Claude HEESEN",
        "id": "59fdfe8182abf78a22315f6c",
        "lastName": "HEESEN"
      },
      "createdAt": "2017-11-04T18:21:40.885Z",
      "text": "Bonjour, juste pour confirmer ce que tu dis et que, par contre, moi, je n'ai été averti que ce jour 04/11/2017."
    }
  ],
  "repliesCount": 1,
  "score": 39,
  "text": "C'est une belle initiative qui faut amplifier et surtout populariser. Pourtant au fait de la vie politique, je n'ai appris que de la naissance de ce site par le passage du Président de l'Assemblée sur une émission de télévision le 14 octobre ... Le Bureau de l'Assemblée aurait dû transmettre consigne aux Députés de transmettre à leur tour l'information en circonscriptions."
}