{
  "author": {
    "avatar": "https://secure.gravatar.com/avatar/a68520dcbe4aeaf73d5ce0c7b50c4bdc?d=mm",
    "displayName": "Pierre COMBELLES ",
    "extra": {
      "age": "5",
      "job": "6",
      "postal": "65400"
    },
    "firstName": "Pierre",
    "fullName": "Pierre COMBELLES ",
    "id": "5a0040b982abf78a2231c6f1",
    "lastName": "COMBELLES "
  },
  "createdAt": "2017-11-06T11:06:01.048Z",
  "flags": [],
  "id": "5a00421982abf78a2231c70f",
  "reference": "59d734d112406bdd5d6277ff",
  "replies": [],
  "repliesCount": 0,
  "score": 0,
  "text": "Bravo pour cette initiative en faveur de la démocratie participative!"
}