{
  "author": {
    "avatar": "https://secure.gravatar.com/avatar/b7988becea720918f2bb3e0ef223c564?d=mm",
    "displayName": "Maxime ALLART",
    "extra": {
      "age": "3",
      "job": "7",
      "postal": "02390"
    },
    "firstName": "Maxime",
    "fullName": "Maxime ALLART",
    "id": "59fdf47a82abf78a223154c2",
    "lastName": "ALLART"
  },
  "createdAt": "2017-11-04T17:14:21.966Z",
  "flags": [],
  "id": "59fdf56d82abf78a22315626",
  "reference": "59d734d112406bdd5d6277ff",
  "replies": [],
  "repliesCount": 0,
  "score": 0,
  "text": "Bonsoir oui ça serait un plus de pouvoir changer et améliorer cette démocratie"
}