{
  "author": {
    "avatar": "https://lh3.googleusercontent.com/-XdUIqdMkCWA/AAAAAAAAAAI/AAAAAAAAAAA/4252rscbv5M/photo.jpg?sz=50",
    "displayName": "Claude Colomes",
    "firstName": "Claude",
    "fullName": "Claude Colomes",
    "id": "59fe5b1182abf78a2231817a",
    "lastName": "Colomes"
  },
  "createdAt": "2017-11-05T00:39:42.111Z",
  "flags": [],
  "id": "59fe5dce82abf78a223181ae",
  "reference": "59d734d112406bdd5d6277ff",
  "replies": [],
  "repliesCount": 0,
  "score": -1,
  "text": "Et pourquoi pas ? celui  qui ne tente rien n'a rien !"
}