{
  "author": {
    "avatar": "https://secure.gravatar.com/avatar/1a430dfb974df1c7f12f57b5808a264b?d=mm",
    "displayName": "Jean Luc Soutoul",
    "extra": {
      "age": "4",
      "job": "2",
      "postal": "92160"
    },
    "firstName": "Jean Luc",
    "fullName": "Jean Luc Soutoul",
    "id": "59fdfac582abf78a22315b9d",
    "lastName": "Soutoul"
  },
  "createdAt": "2017-11-04T17:40:47.730Z",
  "flags": [],
  "id": "59fdfb9f82abf78a22315c8a",
  "reference": "59d733cb12406bdd5d6277ea",
  "replies": [],
  "repliesCount": 0,
  "score": 1,
  "text": "Excellente proposition que celle de m’en Bodin.."
}