{
  "author": {
    "avatar": "https://secure.gravatar.com/avatar/45fa8558e5da40273caec56133aceefb?d=mm",
    "displayName": "Antoine Rinaldi",
    "extra": {
      "age": "4",
      "job": "2",
      "postal": "95150"
    },
    "firstName": "Antoine",
    "fullName": "Antoine Rinaldi",
    "id": "59fe137f82abf78a22316dcc",
    "lastName": "Rinaldi"
  },
  "createdAt": "2017-11-04T19:30:54.909Z",
  "flags": [],
  "id": "59fe156e82abf78a22316ed5",
  "reference": "59d734d112406bdd5d6277ff",
  "replies": [],
  "repliesCount": 0,
  "score": 0,
  "text": "La Démocratie ne s'arrête pas à une date d'élection quelle qu'elle soit. La véritable Démocratie, c'est tous les jours qu'elle agit et ce sont des Citoyens qui peuvent agir réellement et non pas donner un simple avis consultatif. Cette action de prise en compte des pétitions faites par des Citoyens hors des organisations dites institutionnelles serait une réelle avancée pour la Démocratie."
}