{
  "author": {
    "avatar": "https://lh3.googleusercontent.com/-kbh-bbz0JQY/AAAAAAAAAAI/AAAAAAAAAAw/yHg9YqE1Yw8/photo.jpg?sz=50",
    "displayName": "adrien courdavault",
    "firstName": "adrien",
    "fullName": "adrien courdavault",
    "id": "59dbaece9e1c7be85124dfb4",
    "lastName": "courdavault"
  },
  "createdAt": "2017-10-09T21:01:34.113Z",
  "flags": [],
  "id": "59dbe3ae9e1c7be85124e0a5",
  "reference": "59d733cb12406bdd5d6277ea",
  "replies": [
    {
      "_id": "59e2db4066914e1e8223864c",
      "author": {
        "avatar": "https://secure.gravatar.com/avatar/09f98c381f2ed69119c7df9ca10b2724?d=mm",
        "displayName": "Gérard Bodin",
        "extra": {
          "age": "3",
          "job": "2",
          "postal": "99999"
        },
        "firstName": "Gérard",
        "fullName": "Gérard Bodin",
        "id": "59dc23f99e1c7be85124e13b",
        "lastName": "Bodin"
      },
      "createdAt": "2017-10-15T03:51:28.479Z",
      "text": "Regardez par ici : [Recherche dans la base des amendements](http://www2.assemblee-nationale.fr/recherche/amendements)"
    }
  ],
  "repliesCount": 1,
  "score": -2,
  "text": "Il serait intéressant d avoir un accès  (lecture) au logiciel eliasse de gestion des amendements. Ce logiciel mentionné dans un rapport d entretien avec le responsable de l ifnor donne accès aux amendements de manière numérique qui sont nombreux. Il semble techniquement simple (remativement) d ouvrir cet accès aux citoyens.\n\nNote comme a à chaque fois j encourage à créer un accès nominatif du citoyen. Pas besoin de prouver son identité mais pas de login sous des pseudos masques qui permettent aux haters comme sur Twitter de surcharger la plateforme"
}