{
  "author": {
    "avatar": "https://secure.gravatar.com/avatar/e0a80a28ba6b963cc6e63a6e8388bc4e?d=mm",
    "displayName": "VERONE DELMOTTE",
    "extra": {
      "age": "4",
      "job": "7",
      "postal": "92800"
    },
    "firstName": "VERONE",
    "fullName": "VERONE DELMOTTE",
    "id": "59f9a621e8a9656c1a8e824c",
    "lastName": "DELMOTTE"
  },
  "createdAt": "2017-11-01T11:39:29.051Z",
  "flags": [],
  "id": "59f9b271e8a9656c1a8e829c",
  "reference": "59d7325812406bdd5d6277d4",
  "replies": [],
  "repliesCount": 0,
  "score": 0,
  "text": "PARRAINAGE CITOYEN\nDe belles initiatives associatives existent pour réduire la fracture numériques et sociale (Emmaus connect et diverses actions gouvernementales citées par \"Société numérique\"). Pour œuvrer au niveau local, pourquoi ne pas mettre en place  une application de parrainage entre citoyens de type \"matchons nos compétences\" où une initiation à l'emploi du numérique, à la vie publique, politique serait réalisée à des voisins proches contre un service quel qu’il soit ?!"
}