{
  "author": {
    "avatar": "https://secure.gravatar.com/avatar/8ba9f722c33b5fe8c232c735d8233d58?d=mm",
    "displayName": "Mathieu ZEGGIATO",
    "extra": {
      "age": "2",
      "job": "3",
      "postal": "67100"
    },
    "firstName": "Mathieu",
    "fullName": "Mathieu ZEGGIATO",
    "id": "59f89fd8e8a9656c1a8e7e2a",
    "lastName": "ZEGGIATO"
  },
  "createdAt": "2017-11-03T20:44:50.641Z",
  "flags": [],
  "id": "59fcd542ccdac63cb472be4d",
  "reference": "59d733cb12406bdd5d6277ea",
  "replies": [],
  "repliesCount": 0,
  "score": -1,
  "text": "Contribution collective des comités strasbourgeois En Marche ! :\nConstat : Il est impératif de rétablir un équilibre entre projets et propositions de lois, les citoyens étant exclus de la production législative avec des pouvoirs limités pour impacter la procédure législative (grève, pétition…).\nPropositions :\n- Les citoyens pourront faire des propositions qui seront soumises à une commission, sorte de comité stable et permanent chargé de sélectionner les projets qui pourraient devenir des lois.\n- L'instauration d'une instance parallèle au Parlement. Elle prendrait la forme d’un comité de citoyens bénévoles, tirés au sort parmi des volontaires. Ils auraient accès aux documents de travail du Parlement pour pouvoir expliquer et vulgariser auprès du grand public l’action de ce dernier mais aurait également un droit d’amendement. Pour fonctionner cette instance disposerait d’un budget participatif, pour ne pas dépendre exclusivement de l’Assemblée.\nSon avis sur les textes serait obligatoire.\nCe travail pédagogique se voudrait ludique et de préférence sans attache partisane."
}