{
  "author": {
    "avatar": "https://secure.gravatar.com/avatar/1520775954fa14c028b7ad427aeaddfe?d=mm",
    "displayName": "FLORENCE MORLIGHEM",
    "extra": {
      "age": "3",
      "job": "8",
      "postal": "59000"
    },
    "firstName": "FLORENCE",
    "fullName": "FLORENCE MORLIGHEM",
    "id": "59f347e9e8a9656c1a8e6f95",
    "lastName": "MORLIGHEM"
  },
  "createdAt": "2017-11-03T15:11:51.126Z",
  "flags": [],
  "id": "59fc8737ccdac63cb472ba83",
  "reference": "59d734d112406bdd5d6277ff",
  "replies": [],
  "repliesCount": 0,
  "score": -1,
  "text": "SYNTHESE CONSULTATION CITOYENNE 5911\n\nCréation d’une chambre qui regroupe les idées des citoyens : des élus au contact direct des citoyens pour recenser les problématiques.\nRéalisation d’enquêtes publiques consultatives et retour officiel.\nOptimisation des moyens existants : réseaux sociaux, site Parlement et Citoyens : Empowerment\nCoordonner les actions citoyennes sur le territoire (actions au niveau des villes, métropoles)"
}