{
  "author": {
    "avatar": "https://secure.gravatar.com/avatar/0889599f8f131a9630f7c59f6bb2cdc7?d=mm",
    "displayName": "Nathalie CACHEUX",
    "extra": {
      "age": "4",
      "job": "6",
      "postal": "95100"
    },
    "firstName": "Nathalie",
    "fullName": "Nathalie CACHEUX",
    "id": "59feca9d82abf78a22318c13",
    "lastName": "CACHEUX"
  },
  "createdAt": "2017-11-05T08:29:10.973Z",
  "flags": [],
  "id": "59fecbd682abf78a22318c75",
  "reference": "59d734d112406bdd5d6277ff",
  "replies": [],
  "repliesCount": 0,
  "score": 0,
  "text": "Les pétitions change.org ont du sens et permettent aux citoyens de défendre une idée, une cause. Lorsqu'elles prennent une ampleur importante, l'Assemblée Nationale devrait en tenir compte car c'est l'expression des citoyens (exemple : par rapport à une injustice ou bien une loi qui devrait être modifier)."
}