{
  "author": {
    "avatar": "https://lh4.googleusercontent.com/-NkRlYbptj9Y/AAAAAAAAAAI/AAAAAAAAAL0/-1w-xHhFcu8/photo.jpg?sz=50",
    "displayName": "Lahouari Reguig",
    "firstName": "Lahouari",
    "fullName": "Lahouari Reguig",
    "id": "59fdf4e382abf78a22315575",
    "lastName": "Reguig"
  },
  "createdAt": "2017-11-04T17:17:48.047Z",
  "flags": [],
  "id": "59fdf63c82abf78a223156fb",
  "reference": "59d7347212406bdd5d6277f7",
  "replies": [],
  "repliesCount": 0,
  "score": 0,
  "text": "Bref en quelques mots essayer de faire des textes compréhensible pour la plupart une citrouille ayant un bagage intellectuel ou pas pouvoir avoir une meilleure idée ce qui se trame sous les textes et pourquoi pas plateforme téléphonique qui pourrait expliquer les choses plus en profondeur donc voilà ce que j'ai à dire beaucoup de gens beaucoup de gens aimeraient s'investir plus dans notre système mais vu Descriptif de certaines moi très difficile à déconner pour certains on du mal avoir participé aux débats une discussion et à proposer donc encore une fois plateforme téléphonique puisse bien expliquer les choses tout le monde plus que tout le monde puisse comprendre"
}