{
  "author": {
    "avatar": "https://secure.gravatar.com/avatar/bb4a867635a4e94270d281a2ce296c24?d=mm",
    "displayName": "Kévin SAK",
    "extra": {
      "age": "3",
      "job": "3",
      "postal": "35136"
    },
    "firstName": "Kévin",
    "fullName": "Kévin SAK",
    "id": "59fdaf61e7c9379d2c5624bb",
    "lastName": "SAK"
  },
  "createdAt": "2017-11-05T18:40:26.683Z",
  "flags": [],
  "id": "59ff5b1a82abf78a2231b18b",
  "reference": "59d734d112406bdd5d6277ff",
  "replies": [],
  "repliesCount": 0,
  "score": 1,
  "text": "-\tAccessibilité : ruralité, populations en situation de précarité, trop âgées, les applicatifs.\n-\tFormation : méthodologie du numérique, fonctionnement de la politique, institutions.\n-\tAccompagnement : accompagner les citoyens à la dématérialisation, service civique.\n\nContribution collective du comité LREM Rennes Centre Sud"
}