{
  "author": {
    "avatar": "https://graph.facebook.com/10210411130103663/picture",
    "displayName": "Isabelle Delaroque",
    "firstName": "Isabelle",
    "fullName": "Isabelle Delaroque",
    "id": "59eb4dec66914e1e82239560",
    "lastName": "Delaroque"
  },
  "createdAt": "2017-10-21T13:44:31.191Z",
  "flags": [],
  "id": "59eb4f3f66914e1e8223958b",
  "reference": "59d7335412406bdd5d6277e4",
  "replies": [],
  "repliesCount": 0,
  "score": -1,
  "text": "La lecture et la compréhension des lois faisant appel à des connaissances juridiques et à un registre de vocabulaire technique , il serait intéressant que des relais citoyens puissent en vulgariser le contenu et grâce à un maillage territorial d'individus, les expliquer en réunion publique, aux élus locaux et aux citoyens du territoire de proximité."
}