{
  "author": {
    "avatar": "https://secure.gravatar.com/avatar/5b9ee099beb469aa9b63a02bc2c88403?d=mm",
    "displayName": "Danièle Quesnel",
    "extra": {
      "age": "5",
      "job": "6",
      "postal": "80110"
    },
    "firstName": "Danièle",
    "fullName": "Danièle Quesnel",
    "id": "59ff88e982abf78a2231b9a0",
    "lastName": "Quesnel"
  },
  "createdAt": "2017-11-05T22:02:52.924Z",
  "flags": [],
  "id": "59ff8a8c82abf78a2231b9ea",
  "reference": "59d734d112406bdd5d6277ff",
  "replies": [],
  "repliesCount": 0,
  "score": 0,
  "text": "il faut, qu' enfin , nos députés (ées) qui nous représentent, prennent en compte nos idées et nos revendications."
}