{
  "author": {
    "avatar": "https://secure.gravatar.com/avatar/6103149fbb7c9113ff990f789c43dd2e?d=mm",
    "displayName": "Guénaëlle Bouquet",
    "extra": {
      "age": "3",
      "job": "5",
      "postal": "13430"
    },
    "firstName": "Guénaëlle",
    "fullName": "Guénaëlle Bouquet",
    "id": "59fd7979ccdac63cb472c546",
    "lastName": "Bouquet"
  },
  "createdAt": "2017-11-04T08:58:17.265Z",
  "flags": [],
  "id": "59fd8129ccdac63cb472c5e0",
  "reference": "59d7335412406bdd5d6277e4",
  "replies": [],
  "repliesCount": 0,
  "score": 0,
  "text": "Les associations à but non lucratif sont un vivier de ressources de compétences, d'expérimentations et d'actions.\nSouvent apolitiques, elles suppléent bénévolement, à partir de décisions prises démocratiquement, à un manque d'action publique. Leurs avis et propositions, dans leurs domaines de compétence (ce qui se vérifie par leurs statuts) devraient être recherchés et valorisés car émanant déjà démocratiquement de collectifs de citoyens engagés."
}