{
  "author": {
    "avatar": "https://secure.gravatar.com/avatar/1f5c69d8d3588c21622a5163a2a8a6ec?d=mm",
    "displayName": "Gilles Neveux",
    "extra": {
      "age": "5",
      "job": "6",
      "postal": "33115"
    },
    "firstName": "Gilles",
    "fullName": "Gilles Neveux",
    "id": "59fe93a682abf78a223183d7",
    "lastName": "Neveux"
  },
  "createdAt": "2017-11-05T04:41:00.006Z",
  "flags": [],
  "id": "59fe965c82abf78a223183fa",
  "reference": "59d7325812406bdd5d6277d4",
  "replies": [],
  "repliesCount": 0,
  "score": 0,
  "text": "Rien n'est pas parfait, ceci ne doit pas empêcher d'avancer. La consultation numérique n'est qu'un élément dans la prise de décision"
}