{
  "author": {
    "avatar": "https://secure.gravatar.com/avatar/9d463dad7e1e79d1b5cdd09ac457a97a?d=mm",
    "displayName": "anne cans",
    "extra": {
      "age": "5",
      "job": "4",
      "postal": "92410"
    },
    "firstName": "anne",
    "fullName": "anne cans",
    "id": "5a01b86182abf78a2231daed",
    "lastName": "cans"
  },
  "createdAt": "2017-11-07T14:13:17.843Z",
  "flags": [],
  "id": "5a01bf7d82abf78a2231db5e",
  "reference": "59d7325812406bdd5d6277d4",
  "replies": [],
  "repliesCount": 0,
  "score": -1,
  "text": "- les difficultés liées à la fracture numérique sont réelles : on pourrait prévoir une plateforme en Mairie pour permettre un accès au plus grand nombre\n- par ailleurs la multiplication possible des profils et adresses pour une seule et meme personne peut nuire à la rigueur et l'impartialité de la consultation\nPourrait on travailler à partir d'un numéro d'identification unique (ex le num de sécurité sociale, numero fiscal .. ?) pour permettre à chacun d'intervenir de façon plus sûr ?"
}