{
  "author": {
    "avatar": "https://lh3.googleusercontent.com/-wx7emq5Pq4g/AAAAAAAAAAI/AAAAAAAAAng/UEChbesuT6E/photo.jpg?sz=50",
    "displayName": "Adrien FABRE",
    "firstName": "Adrien",
    "fullName": "Adrien FABRE",
    "id": "59dcfa559b28097eb6b41945",
    "lastName": "FABRE"
  },
  "createdAt": "2017-10-10T22:07:20.515Z",
  "editedAt": "2017-10-11T22:47:22.257Z",
  "flags": [],
  "id": "59dd44989b28097eb6b41af9",
  "reference": "59d733cb12406bdd5d6277ea",
  "replies": [
    {
      "_id": "59fe059a82abf78a2231656d",
      "author": {
        "avatar": "https://secure.gravatar.com/avatar/1c2f918385b5acb549a86a7c9068313a?d=mm",
        "displayName": "Phil Pernod",
        "extra": {
          "age": "4",
          "job": "4",
          "postal": "45170"
        },
        "firstName": "Phil",
        "fullName": "Phil Pernod",
        "id": "59fdfa9b82abf78a22315b65",
        "lastName": "Pernod"
      },
      "createdAt": "2017-11-04T18:23:22.245Z",
      "text": "Et un seul mandat"
    },
    {
      "_id": "59fe081d82abf78a22316791",
      "author": {
        "avatar": "https://secure.gravatar.com/avatar/8c451d476c297d3fff176198c57e1826?d=mm",
        "displayName": "Michel CORDIER",
        "extra": {
          "age": "4",
          "job": "6",
          "postal": "01960"
        },
        "firstName": "Michel",
        "fullName": "Michel CORDIER",
        "id": "59fdfa3382abf78a22315acd",
        "lastName": "CORDIER"
      },
      "createdAt": "2017-11-04T18:34:05.285Z",
      "text": "100% d'accord avec cette idée ... avec des quotas par catégories socio professionnelles."
    },
    {
      "_id": "59fe458082abf78a22317f0e",
      "author": {
        "avatar": "https://secure.gravatar.com/avatar/ba62ab5ef31bf6fae6170fae1e0909f6?d=mm",
        "displayName": "Antoine Marmignon",
        "extra": {
          "age": "3",
          "job": "3",
          "postal": "92130"
        },
        "firstName": "Antoine",
        "fullName": "Antoine Marmignon",
        "id": "59f8becae8a9656c1a8e7f09",
        "lastName": "Marmignon"
      },
      "createdAt": "2017-11-04T22:56:00.970Z",
      "text": "Pourquoi des quotas? basés sur quoi? c'est contre le principe meme du tirage au sort? que se passe-t-il si un jour quelqu'un décide de changer les quotas? "
    },
    {
      "_id": "59fe45b482abf78a22317f1f",
      "author": {
        "avatar": "https://secure.gravatar.com/avatar/ba62ab5ef31bf6fae6170fae1e0909f6?d=mm",
        "displayName": "Antoine Marmignon",
        "extra": {
          "age": "3",
          "job": "3",
          "postal": "92130"
        },
        "firstName": "Antoine",
        "fullName": "Antoine Marmignon",
        "id": "59f8becae8a9656c1a8e7f09",
        "lastName": "Marmignon"
      },
      "createdAt": "2017-11-04T22:56:52.434Z",
      "text": "Si il y a plus d'ouvrier et d'employés en france, si le nombre de tirés au sort en suffisamment grand ils devraient etre mathématiquement plus représentés non?"
    },
    {
      "_id": "59fed80082abf78a223190ff",
      "author": {
        "avatar": "https://secure.gravatar.com/avatar/8c451d476c297d3fff176198c57e1826?d=mm",
        "displayName": "Michel CORDIER",
        "extra": {
          "age": "4",
          "job": "6",
          "postal": "01960"
        },
        "firstName": "Michel",
        "fullName": "Michel CORDIER",
        "id": "59fdfa3382abf78a22315acd",
        "lastName": "CORDIER"
      },
      "createdAt": "2017-11-05T09:21:04.391Z",
      "text": "La plupart des ouvriers, employés, artisans ne se sentent pas capables de siéger.\nAvec votre système de second (et 3èmè, 4ème, etc) tirage, les catégories CSP sortiraient forcément sur-représentées.\nC'est pour cela que je suis plutôt favorable à l'établissement de listes de volontaires et tirage au sort dans ces listes par catégorie socio-professionnelle.\nJe suis pour l'établissement de listes de volontaires car je sais très bien qu'au moins 80 % des gens n'oseraient pas siéger .... alors le tirage au sort pourrait durer longtemps !!"
    },
    {
      "_id": "59ff4f0982abf78a2231ae32",
      "author": {
        "avatar": "https://secure.gravatar.com/avatar/ba62ab5ef31bf6fae6170fae1e0909f6?d=mm",
        "displayName": "Antoine Marmignon",
        "extra": {
          "age": "3",
          "job": "3",
          "postal": "92130"
        },
        "firstName": "Antoine",
        "fullName": "Antoine Marmignon",
        "id": "59f8becae8a9656c1a8e7f09",
        "lastName": "Marmignon"
      },
      "createdAt": "2017-11-05T17:48:57.827Z",
      "text": "Ca se tient et se défend effectivement, je comprend mieux avec cette explication, merci. Mais on tombe dans un autre biais. Les volontaires étant je crois (à vérifier c'est carrément au doigt mouillé) plus fortement politisé (donc partisan? c'est un autre débat) Reste à savoir quel biais est le moins pire?"
    },
    {
      "_id": "59ff509a82abf78a2231aeb9",
      "author": {
        "avatar": "https://lh3.googleusercontent.com/-wx7emq5Pq4g/AAAAAAAAAAI/AAAAAAAAAng/UEChbesuT6E/photo.jpg?sz=50",
        "displayName": "Adrien FABRE",
        "firstName": "Adrien",
        "fullName": "Adrien FABRE",
        "id": "59dcfa559b28097eb6b41945",
        "lastName": "FABRE"
      },
      "createdAt": "2017-11-05T17:55:38.631Z",
      "text": "Je pense que c'est une mauvaise idée de tirer au sort parmi des volontaires car les volontaires ne sont pas du tout représentatifs des opinions politiques.\nJe ne suis pas convaincu qu'il y aurait beaucoup de gens qui refusent d'être sénateurs et que ce serait lié à la classe sociale. Mais si c'était le cas, alors il faudrait mettre en place des quotas, comme vous le proposez. Mais nul besoin de partir d'une liste de volontaires : on tirerait au sort 20% d'ouvriers, et s'il y en a parmi eux qui refusent, on en prendrait d'autres aléatoirement."
    }
  ],
  "repliesCount": 7,
  "score": 8,
  "text": "Tirer les sénateurs au sort. Toute personne tirée au sort peut refuser de siéger, on procède dans ce cas à un nouveau tirage.\n\nSeuls [26% des Français](voter davantage sur des propositions que sur des personnes) rejettent cette idée (54% sont d'accord ou très d'accord)."
}