{
  "author": {
    "avatar": "https://secure.gravatar.com/avatar/880f87c05e0182a6ced4095479e512e5?d=mm",
    "displayName": "Bernard Demay",
    "extra": {
      "age": "5",
      "job": "6",
      "postal": "17340"
    },
    "firstName": "Bernard",
    "fullName": "Bernard Demay",
    "id": "59fdf30282abf78a2231532a",
    "lastName": "Demay"
  },
  "createdAt": "2017-11-05T07:43:09.325Z",
  "flags": [],
  "id": "59fec10d82abf78a22318996",
  "reference": "59d734d112406bdd5d6277ff",
  "replies": [],
  "repliesCount": 0,
  "score": 0,
  "text": "Enfin une possibilité pratique et facile de s'exprimer et que cela soit pris en compte."
}