{
  "author": {
    "avatar": "https://secure.gravatar.com/avatar/ab7940ed7981c2421359fda24a01fd73?d=mm",
    "displayName": "Nelly Grebert",
    "extra": {
      "age": "4",
      "job": "7",
      "postal": "34270"
    },
    "firstName": "Nelly",
    "fullName": "Nelly Grebert",
    "id": "59eb187f66914e1e82239473",
    "lastName": "Grebert"
  },
  "createdAt": "2017-11-02T15:22:43.571Z",
  "flags": [],
  "id": "59fb3843ccdac63cb472b633",
  "reference": "59d737c712406bdd5d627805",
  "replies": [],
  "repliesCount": 0,
  "score": 5,
  "text": "A la question « Comment intégrer les citoyens »  en ce qui concerne l’évaluation et le contrôle de la mise en œuvre des lois,  voici le résultat de nos réflexions :\nEn amont l’Assemblée Nationale devra communiquer sur cette ouverture aux citoyens (par voies de presse, son site, LCP…)\nModalités\n1 - le citoyen volontaire s’inscrit sur le site de l’assemblée dédié (en préambule il signe une charte de probité)\n2 – il communique avec l’AN par voie informatique (plateforme d’échange similaire à celle mise en place pour la consultation actuelle)\n3 – l’AN envoie systématiquement les thèmes sur lesquels le citoyen peut apporter sa contribution\n4 – le citoyen y répond ou pas selon l’intérêt qu’il porte à la thématique\n5 – dans tous les cas l’AN continue à le tenir informé de l’avancement des travaux par voie informatique\n6 – si le citoyen choisit de travailler sur  un sujet il peut :\na)\tSimplement transmettre ses retours à l’AN sans avoir à se déplacer\nb)\tS’il souhaite participer à des réunions « en personne » il s’inscrit sur une 2nd liste où il sera tiré au sort\nc)\tCe tirage au sort pourrait être graduel :\n-\t1er temps : 1 citoyen par région\n-\t2ème temps : (afin d’éviter 1 surnombre entrainant des frais conséquents) tri parmi les citoyens présélectionnés pour arriver à 5/6 personnes maximum.\n-\tCe tirage au sort serait valable pour la durée de la thématique. Il serait assorti d’un planning\n7 – Comment traiter les retours des citoyens ?\na)\tPar le biais d’une Intelligence Artificielle capable de regrouper les réflexions identiques et de faire le tri\nb)\tGrâce à des personnels dédiés aptes à faire la même chose que l’IA mais qui « ressentent mieux » les choses\nc)\tDans tous les cas il faudra « in fine » des personnes pour affiner ces retours, en faire une synthèse et la rapporter à l’Assemblée et aux citoyens inscrits ou pas par tous les moyens possibles\n8 – Quels thèmes ?\n\tUn  citoyen inscrit pourrait proposer un thème et s’il est également évoqué par d’autres citoyens (nécessité de définir un nombre) l’Assemblée pourrait le mettre à l’ordre du jour."
}