{
  "author": {
    "avatar": "https://secure.gravatar.com/avatar/28feb2a85005a9816c294080db64bfac?d=mm",
    "displayName": "Roman Zilliox",
    "extra": {
      "age": "1",
      "job": "1",
      "postal": "92150"
    },
    "firstName": "Roman",
    "fullName": "Roman Zilliox",
    "id": "59db81fe9e1c7be85124de32",
    "lastName": "Zilliox"
  },
  "createdAt": "2017-10-25T23:52:36.931Z",
  "flags": [],
  "id": "59f123c4896da05921863b97",
  "reference": "59d733cb12406bdd5d6277ea",
  "replies": [
    {
      "_id": "59f1ba93896da05921863c2c",
      "author": {
        "avatar": "https://pbs.twimg.com/profile_images/779238336686948352/0Kc7fs1n_400x400.jpg",
        "displayName": "Valentin Chaput",
        "extra": {
          "age": "3",
          "job": "5",
          "postal": "75019"
        },
        "firstName": "Valentin",
        "fullName": "Valentin Chaput",
        "id": "59db32699e1c7be85124dd3c",
        "lastName": "Chaput"
      },
      "createdAt": "2017-10-26T10:36:03.815Z",
      "text": "Suite du commentaire de Roman Zilliox, qu'il est préférable de regrouper pour faciliter le suivi : \n\n\"Je vous ai fait un résumé : Elle consiste à créer un groupe d’une cinquantaine de personnes que je pensais appeler Commission Citoyenne. Ces membres se seraient inscrits pour participer à des débats entre les membres de cette commission . Le but étant de discuter des lois actuelles . Les but de ces discussions sont -1 : permettre l’écriture d’un amendement par les membres de la CC. Celui si serait proposé en commission permanente avec les députés. Ensuite si le texte est accepté, il serait voté en séance dans l’hémicycle. -2: Après les discussions, il serait possible que certains membres de la Commission Citoyenne prennent la parole pendant une séance de commission permanente avec les députés. Dans le but de s’exprimer devant les parlementaires. -2 .2 : Après les discussions si l’ensemble des membres de la CC s’oppose à un amendement, il serait possible de créer un veto citoyen. Pour ensuite permettre la proposition d’un nouvel amendement -3 : Après discussions, permettre à certains membres de la CC à prendre la parole en séance dans l’hémicycle. Les membres de la CC s’inscrivent pour une date. Ensuite pour la prochaine date, 50 autres citoyens peuvent s’inscrire. Ça permet de faire changer les points de vue et que le plus d’avis du plus grand nombre de citoyen soient entendus . Je me suis dis que les séances de la commission citoyenne pouvaient se faire le Week end pour que plus de monde puisse participer.\nPour participer à nos échanges, vous pouvez me contacter via le mail ci-dessous romanzilliox1@gmail.com\""
    }
  ],
  "repliesCount": 1,
  "score": 0,
  "text": "Bonsoir, \nCe que je propose n'a pas été proposé jusque là. \nDes anciens de ce débat pourront vois confirmer que j'y participe depuis le début même si toutefois je n'y est plus participer depuis quelques temps. La raison de mon silence est la réflexion. En effet, j'ai formé un groupe de discussion autour de notre projet. \nPrenant ce rôle d'un sérieux inébranlable j'ai donc recueillis le plus d'avis possible du plus grand nombre de personnes possible ."
}