{
  "author": {
    "avatar": "https://lh3.googleusercontent.com/-XdUIqdMkCWA/AAAAAAAAAAI/AAAAAAAAAAA/4252rscbv5M/photo.jpg?sz=50",
    "displayName": "Alain Badin de Montjoye",
    "firstName": "Alain",
    "fullName": "Alain Badin de Montjoye",
    "id": "59ff625182abf78a2231b2c5",
    "lastName": "Badin de Montjoye"
  },
  "createdAt": "2017-11-05T19:39:57.764Z",
  "flags": [],
  "id": "59ff690d82abf78a2231b40c",
  "reference": "59d734d112406bdd5d6277ff",
  "replies": [],
  "repliesCount": 0,
  "score": 0,
  "text": "L'engagement et l'investissement dans le débat politique ne devrait jamais être une profession et rémunéré en tant que tel. Les professionnels de la politique ne sont plus des citoyens mais bien ces rats installés dans leur fromage, croqués sans complaisance, déjà au XVIIe siècle, par Jean de La Fontaine. Comment croire, au regard des avantages toujours croissants qu'ils s'octroient, que leur quête unique soit le bien commun pour la défense duquel ils ont été élus ?"
}