{
  "author": {
    "avatar": "https://graph.facebook.com/10212459314590208/picture",
    "displayName": "Michel Dufay",
    "extra": {
      "age": "4",
      "job": "3",
      "postal": "35200"
    },
    "firstName": "Michel",
    "fullName": "Michel Dufay",
    "id": "59dc63e59e1c7be85124e183",
    "lastName": "Dufay"
  },
  "createdAt": "2017-10-21T09:50:17.624Z",
  "flags": [],
  "id": "59eb185966914e1e8223946f",
  "reference": "59d7335412406bdd5d6277e4",
  "replies": [],
  "repliesCount": 0,
  "score": -1,
  "text": "les gens doivent interpeller l’exécutif par le biais d'une antenne rattaché a la présidence ou au 1er ministre  qui doit être dédier a la vie quotidienne  des gens et des injustices et violence faite aux gens pour permettre de corriger les dérives des lois  et les souffrances fait au gens exemple les frais exceptionnels a des prix exorbitant et non encadré en plus de la pension alimentaire  décidé par un ou une juge des affaires familiale sans l'accord de l'autre parent débiteur laisse le parent débiteur en surendettement et voir en exclusion"
}