{
  "author": {
    "avatar": "https://graph.facebook.com/1581453218602095/picture",
    "displayName": "Hervé Billiet",
    "firstName": "Hervé",
    "fullName": "Hervé Billiet",
    "id": "59e77d7f66914e1e82238f5f",
    "lastName": "Billiet"
  },
  "createdAt": "2017-10-18T19:27:20.628Z",
  "flags": [],
  "id": "59e7ab1866914e1e82238f8d",
  "reference": "59d7347212406bdd5d6277f7",
  "replies": [],
  "repliesCount": 0,
  "score": -1,
  "text": "La multiplication des sites est un frein à la diffusion des informations. Je plaide pour l'existence d'un front office unique pour toute consultation officielle quelque soit l'organisme public à son origine. Ce front office pourrait être le lieu d'identification des contributeurs tout en laissant le libre accès en lecture à tous. Il n'est pas contradictoire avec la mise en ligne sur des sites différents des consultations, sites qui doivent cependant rester exclusivement public en format ouvert pour garantir la lisibilité et la traçabilité des travaux."
}