{
  "author": {
    "avatar": "https://secure.gravatar.com/avatar/47731cfb4c73a3fda391f47b4c87df3f?d=mm",
    "displayName": "Étienne Gonnu",
    "extra": {
      "age": "3",
      "job": "8",
      "postal": "75014"
    },
    "firstName": "Étienne",
    "fullName": "Étienne Gonnu",
    "id": "59db8e869e1c7be85124debe",
    "lastName": "Gonnu"
  },
  "createdAt": "2017-10-27T09:15:35.213Z",
  "editedAt": "2017-10-27T09:18:50.983Z",
  "flags": [],
  "id": "59f2f937896da05921863e1d",
  "reference": "59d733cb12406bdd5d6277ea",
  "replies": [
    {
      "_id": "5a00171b82abf78a2231c068",
      "author": {
        "avatar": "https://secure.gravatar.com/avatar/bf0c2e4ad1d8a3ec459a0b915d80c7ab?d=mm",
        "displayName": "René  Lalement ",
        "extra": {
          "age": "4",
          "job": "3",
          "postal": "75011"
        },
        "firstName": "René ",
        "fullName": "René  Lalement ",
        "id": "59ff7c4a82abf78a2231b734",
        "lastName": "Lalement "
      },
      "createdAt": "2017-11-06T08:02:35.873Z",
      "text": "Ce souci d’un développement des plateformes de consultation en libre est louable et j’y souscris, en le complétant par le recours aux formats ouverts, ce qui est essentiel.\n\nCependant, je crois que beaucoup de discussions autour des textes mis en consultation n’auront pas lieu seulement sur la plateforme officielle de consultation, mais aussi sur les réseaux sociaux usuels. Dans la situation actuelle, ces réseaux sociaux sont des mondes fermés, dont seuls les entreprises propriétaires peuvent exploiter librement les données collectées, leurs utilisateurs en ayant un contrôle très limité. \n\nDans cet objectif de maîtrise de nos données, il faut aussi promouvoir des réseaux sociaux libres (comme _Mastodon_ et ses instances, au lieu de Twitter), notamment en permettant le partage sur de tels réseaux sociaux depuis les sites de consultation."
    }
  ],
  "repliesCount": 1,
  "score": 96,
  "text": "**Les plateformes de consultation publique en ligne doivent être basées sur du logiciel libre**\n  \n*« La qualité des outils logiciels – plateformes dédiées, messagerie, outils collaboratifs... – est déterminante pour l'exercice. [...] Le logiciel doit, de préférence, être un logiciel libre dont le code soit accessible et puisse ainsi être audité par le public. Les choix méthodologiques de la consultation doivent être publics et doivent pouvoir être discutés. »*\nConsultations ouvertes sur internet organisées par les administrations; un instrument précieux au service de la participation du public qui requiert une forte implication des organisateurs, [Novembre 2016, COEPIA](https://cdn2.nextinpact.com/medias/coepia_consultations_ouvertes_sur_internet_2016.pdf).\n  \nSeule l'utilisation de logiciel libre, intrinsèquement transparent et donc auditable par tous, peut offrir un niveau de confiance suffisant en préservant contre toute possibilité de manipulation. L'outil conditionne l'usage ;\n*« Le code est loi »* disait Lawrence Lessig en 2001.  \n  \nLire en ce sens ce billet de Regards Citoyens : [Le numérique ne pourra aider la démocratie sans en adopter les fondements](https://www.regardscitoyens.org/civic-tech-ou-civic-business-le-numerique-ne-pourra-pas-aider-la-democratie-sans-en-adopter-les-fondements/).\n  \nPar ailleurs, le modèle de gestion horizontale des logiciels libres s'inscrit parfaitement dans l'esprit d'une démocratie plus participative et plus proche des citoyens.\n\nDans cette objectif , garantir la possibilité de partage, de réutilisation et de reproductibilité des logiciels de consultation publique en ligne semble particulièrement opportune. On pourra ainsi imaginer des initiatives citoyennes locales, ainsi que des collectivités, qui pourraient avoir accès à des outils puissants, de confiance, et bénéficiant d'un investissement mutualiser."
}