{
  "author": {
    "avatar": "https://secure.gravatar.com/avatar/fabcb00cffa15d09acc3a2b532f28337?d=mm",
    "displayName": "Esther Cluzel",
    "extra": {
      "age": "2",
      "job": "2",
      "postal": "78500"
    },
    "firstName": "Esther",
    "fullName": "Esther Cluzel",
    "id": "59dde1dd66914e1e82238061",
    "lastName": "Cluzel"
  },
  "createdAt": "2017-10-11T09:45:27.254Z",
  "flags": [],
  "id": "59dde83766914e1e82238076",
  "reference": "59d731a712406bdd5d6277d1",
  "replies": [
    {
      "_id": "59ddf64266914e1e822380cb",
      "author": {
        "avatar": "https://graph.facebook.com/10155160023292607/picture",
        "displayName": "Janique Laudouar",
        "firstName": "Janique",
        "fullName": "Janique Laudouar",
        "id": "59dde0e366914e1e8223805f",
        "lastName": "Laudouar"
      },
      "createdAt": "2017-10-11T10:45:22.654Z",
      "text": "Très intéressant : les lois sont actuellement interprétées différemment selon les territoires, avec parfois des écarts considérables, ce qui n'est pas acceptable. Mais une nouvelle commission est-elle la solution ou plutôt une réforme du droit quand il donne lieu à trop d'interprétation diverses des lois? Cas concret vécu : un jugement en cour d'appel qui devait être définitif peut donner lieu à 4 ans supplémentaires de batailles d'avocats + un an de Cour de Cassation. Simplement parce qu'un juge a omis une d'ajouter à son arrêt de cour d'appel une interprétation claire de la loi citée. Ce qui devrait être une obligation. Prolonger de 5 ans une procédure, la justice se plaint de manques de moyens, mais n'est-il pas temps d'actualiser le droit qui semble \"intouchable\" en France,  et les lenteurs des procédures qui ravagent la vie des citoyens et que tous jugent inadmissible et hors normes européennes? Sans compter les cas dramatiques, voir les actualités."
    },
    {
      "_id": "59de007f66914e1e822380d5",
      "author": {
        "avatar": "https://secure.gravatar.com/avatar/fabcb00cffa15d09acc3a2b532f28337?d=mm",
        "displayName": "Esther Cluzel",
        "extra": {
          "age": "2",
          "job": "2",
          "postal": "78500"
        },
        "firstName": "Esther",
        "fullName": "Esther Cluzel",
        "id": "59dde1dd66914e1e82238061",
        "lastName": "Cluzel"
      },
      "createdAt": "2017-10-11T11:29:03.415Z",
      "text": "Concernant la problématique de l'engorgement des tribunaux et de l'allongement des délais de procédure que cela entraîne, je ne peux qu'aller dans votre sens  même s'il s'agit d'un autre sujet (bien que connexe).\nPour en revenir à la question de la création de commissions interprétatives, en l'absence de telles commissions, il est vrai qu'il déjà possible pour le législateur de réformer la loi pour la préciser. Les gouvernements successifs s'y exercent régulièrement. Pour autant, se contenter des solutions actuelles n'est pas à mon sens satisfaisant, car il peut s'écouler plusieurs années avant que le législateur ou le juge se saisisse de la question, si tant est qu'il s'en saisisse.\nCréer une commission d'interprétation des lois et donner les moyens aux citoyens de la saisir c'est améliorer la réactivité des institutions, réduire l'insécurité juridique, et permettre au citoyen d'être un acteur à part entière dans l'élaboration de la norme.\nCela peut également contribuer à plus de transparence. "
    },
    {
      "_id": "59e7339066914e1e82238e5c",
      "author": {
        "avatar": "https://secure.gravatar.com/avatar/b0a4d59364cf914930a288dc442a7a6e?d=mm",
        "displayName": "anne Durgueil",
        "extra": {
          "age": "4",
          "job": "2",
          "postal": "46090"
        },
        "firstName": "anne",
        "fullName": "anne Durgueil",
        "id": "59e716a966914e1e82238d18",
        "lastName": "Durgueil"
      },
      "createdAt": "2017-10-18T10:57:20.318Z",
      "text": "heu écrire des lois claires qui ne nécessitent pas d'interprétation, et réécrire celle qui laissent les juges pantois plutôt en priorité avec débat prioritaire?"
    }
  ],
  "repliesCount": 3,
  "score": -1,
  "text": "Créer des commissions interprétatives des lois :\nA/L'intérêt\nCertaines dispositions sont sujettes à interprétation.\n1/ L'interprétation qui en est faite par le juge peut être contraire à l'esprit du texte.\n2/ Parfois, le juge n'a pas l'occasion de se prononcer se qui conduit les justiciables à se trouver en insécurité juridique.\nB/Le fonctionnement\nAprès le vote d'une loi, je propose de nommer des députés et sénateurs ayant participé au vote qui constitueront la commission interprétative. Si le besoin s'en fait sentir ultérieurement, cette commission pourra être saisie et émettre un avis qui s'imposera aux juges et aux justiciables.\nIl conviendra de définir selon quelles modalités cette commission interprétative pourra être saisie : je propose de permettre la saisine de cette commission sur une initiative citoyenne. Les requérants pourront proposer l'interprétation qui leur semble être la plus appropriée et désigner une ou plusieurs personnes compétentes pour présenter leur problématique auprès de la commission.\nUne seconde modalité de saisine pourrait s'inspirer de celles relatives à la saisine du Conseil constitutionnel (article 61-1 de la Constitution) : lorsque, à l'occasion d'une instance en cours devant une juridiction, il est soutenu qu'une disposition législative est sujette à une pluralité d'interprétation, la commission interprétative pourrait être saisie de cette question sur renvoi du Conseil d'État ou de la Cour de cassation qui se prononcerait dans un délai déterminé.\nC/Des mécanismes ayant une finalité comparable\nIls existes déjà des mécanismes permettant l'interprétation de normes juridiques édictées à un niveau différent de celui de la loi : \n1/Les commissions paritaires d'interprétation des conventions et accords collectifs de branche\n2/La question préjudicielle permettant de saisir la CJUE en vue de l'interprétation des textes de l'Union européenne\nPourquoi ne pas donner les mêmes outils pour ce qui concerne l'interprétation de la loi ?"
}