{
  "author": {
    "avatar": "https://secure.gravatar.com/avatar/722f91f60ab7545f5fb239af96bd471f?d=mm",
    "displayName": "OLIVIER LENDEN",
    "extra": {
      "age": "3",
      "job": "3",
      "postal": "17180"
    },
    "firstName": "OLIVIER",
    "fullName": "OLIVIER LENDEN",
    "id": "59efb478896da0592186398f",
    "lastName": "LENDEN"
  },
  "createdAt": "2017-10-24T22:02:08.499Z",
  "flags": [],
  "id": "59efb860896da05921863996",
  "reference": "59d731a712406bdd5d6277d1",
  "replies": [],
  "repliesCount": 0,
  "score": 0,
  "text": "En France, à combien se montent les frais de bouche, de représentation, de déplacement, de l'ensemble des responsables publics? L'idée de réduire chacune de ces enveloppes ainsi que celle des rémunération, pour les fusionner en une enveloppe unique me plait assez. Chacun serait rémunéré sur le solde de l'enveloppe unique qui sera je n'en doute pas, bien mieux gérée...\nUn responsable rémunéré 5000€ par mois, frais de bouches 3000€, de déplacement 3000€, de représentation 3000€, se verrait attribuer une enveloppe globale de 10000€. A charge pour lui de préserver sa rémunération qui pourrait d'ailleurs être d'un montant supérieur à précédemment mais plafonnée..."
}