{
  "author": {
    "avatar": "https://secure.gravatar.com/avatar/9f8ce436a21dda55479462170730ffd4?d=mm",
    "displayName": "REMI ARNOUX",
    "extra": {
      "age": "1",
      "job": "1",
      "postal": "78110"
    },
    "firstName": "REMI",
    "fullName": "REMI ARNOUX",
    "id": "59f097af896da05921863a78",
    "lastName": "ARNOUX"
  },
  "createdAt": "2017-10-25T14:38:35.440Z",
  "flags": [],
  "id": "59f0a1eb896da05921863a94",
  "reference": "59d731a712406bdd5d6277d1",
  "replies": [],
  "repliesCount": 0,
  "score": 0,
  "text": "Bonjour,\n\nPour renforcer la participation des citoyens à l’élaboration et à l’application de la loi, il me semble nécessaire d'ouvrir davantage l'Assemblée nationale sur la Cité. L'ouvrir physiquement, c'est-à-dire faciliter l'entrée du citoyen au sein du Palais Bourbon. J'ai 16 ans et j'ai déjà visité plusieurs Parlements en Europe : à Berlin, à Budapest, etc. Accéder à l'Assemblée nationale française est très compliqué et je ne l'ai jamais fait. Les citoyens patientent pendant les journées du Patrimoine pour pénétrer derrière ses grands murs et ses grandes grilles. \nPour participer à la loi, le citoyen français doit développer avec le législateur une relation privilégiée :  elle ne peut pas être seulement numérique ou épistolaire.  Ouvrez !"
}