{
  "author": {
    "avatar": "https://secure.gravatar.com/avatar/e9463461d38e7f17e4eb726755b03f36?d=mm",
    "displayName": "Hervé Tiphaine",
    "extra": {
      "age": "5",
      "job": "6",
      "postal": "74000"
    },
    "firstName": "Hervé",
    "fullName": "Hervé Tiphaine",
    "id": "59feec2282abf78a223197e1",
    "lastName": "Tiphaine"
  },
  "createdAt": "2017-11-05T13:51:45.905Z",
  "flags": [],
  "id": "59ff177182abf78a2231a1cc",
  "reference": "59d7325812406bdd5d6277d4",
  "replies": [],
  "repliesCount": 0,
  "score": 1,
  "text": "Effectivement le numérique pourait permettre de généraliser la participation au travaux du parlement, néanmoins il faudrait retirer le 49.3 et les votes par ordonnance qui n'ont rien de démocratique et détériore les relations entre le peuple et les politiciens."
}