{
  "author": {
    "avatar": "https://secure.gravatar.com/avatar/d9bd3fffe21369a65eef7d4f103a2047?d=mm",
    "displayName": "Yves Chevalier",
    "extra": {
      "age": "5",
      "job": "6",
      "postal": "56860"
    },
    "firstName": "Yves",
    "fullName": "Yves Chevalier",
    "id": "59fc430cccdac63cb472b920",
    "lastName": "Chevalier"
  },
  "createdAt": "2017-11-03T10:32:33.208Z",
  "flags": [],
  "id": "59fc45c1ccdac63cb472b933",
  "reference": "59d7335412406bdd5d6277e4",
  "replies": [],
  "repliesCount": 0,
  "score": 0,
  "text": "L'écriture de la loi vise à ordonner la vie démocratique selon les règles républicaines; cependant, il s'agit toujours d'une \"construction intellectuelle\", comme le droit dans son ensemble. Les effets de bord, les effets pervers ne peuvent pas tous apparaître immédiatement au législateur. Face à ces effets indésirables le grand public tend trop facilement à voir une incapacité à gérer démocratiquement le vie publique. Repli dans l'abstention, populisme, voire pire. Il faut donc imaginer les moyens d'expliquer la complexité.\nDes outils existent; on pense spontanément au numérique. Pourtant un des outils les plus adaptés ne serait-il pas la télévision (accessible aussi bien entendu sur le web) ? Pourquoi ne pas imaginer une émission (ou des émissions) qui expliqueraient cette complexité avec des moyens simples, orientés vers le plus grand nombre. Cela pourrait s'appeler, par exemple, \"Pourquoi ça coince ?\" ou \"La loi et les grains de sable\", etc. Chaque émission aborderait une thématique, réaliserait une enquête de terrain, solliciterait des citoyens. La parole serait bien sûr donnée au législateur, à des grands témoins, des solutions seraient esquissées et proposées. \nTiens, au fait, il existe une chaîne parlementaire. Cela ne pourrait-il pas être une de ses missions ?"
}