{
  "author": {
    "avatar": "https://secure.gravatar.com/avatar/ceb309521d0b555296f4b6aa8020aff9?d=mm",
    "displayName": "Yann lasquellec",
    "extra": {
      "age": "3",
      "job": "3",
      "postal": "97354"
    },
    "firstName": "Yann",
    "fullName": "Yann lasquellec",
    "id": "59ff956f82abf78a2231bb23",
    "lastName": "lasquellec"
  },
  "createdAt": "2017-11-05T23:53:46.424Z",
  "flags": [],
  "id": "59ffa48a82abf78a2231bcea",
  "reference": "59d7335412406bdd5d6277e4",
  "replies": [],
  "repliesCount": 0,
  "score": 0,
  "text": "L'évaluation des lois? Mais jamais les politiques ne s'en occupent! Il faut à chaque fois réformer (en rappelant à quel point c'est difficile de le faire en france) sans faire le bilan des précédentes lois ou des besoins sur le terrain (il y a pourtant toujours du positif à garder voir à développer et des points à améliorer). L'évaluation devrait pourtant être à la base de projet\nLes citoyens pourraient facilement être associé à cette étape avec des indicateurs précis (qui doivent être déterminés en même temps que le projet de loi)"
}