{
  "author": {
    "avatar": "https://graph.facebook.com/10213389159870943/picture",
    "displayName": "So Dge",
    "firstName": "So",
    "fullName": "So Dge",
    "id": "59ecc8e066914e1e82239714",
    "lastName": "Dge"
  },
  "createdAt": "2017-10-22T17:26:22.071Z",
  "flags": [],
  "id": "59ecd4be66914e1e8223972c",
  "reference": "59d734d112406bdd5d6277ff",
  "replies": [
    {
      "_id": "59ee025e896da0592186379f",
      "author": {
        "avatar": "https://pbs.twimg.com/profile_images/779238336686948352/0Kc7fs1n_400x400.jpg",
        "displayName": "Mathilde Jeuland",
        "extra": {
          "age": "2",
          "job": "1",
          "postal": "75020"
        },
        "firstName": "Mathilde",
        "fullName": "Mathilde Jeuland",
        "id": "59db6f7e9e1c7be85124dd43",
        "lastName": "Jeuland"
      },
      "createdAt": "2017-10-23T14:53:18.747Z",
      "text": "Bonjour So Dge, nous vous remercions pour votre proposition. Nous vous proposons de soumettre cette idée dans la rubrique qui correspond mieux à votre propos, soit: \" Participation à l'évaluation de la mise en oeuvre des lois\". Agréable journée."
    }
  ],
  "repliesCount": 1,
  "score": -1,
  "text": "En ce qui concerne l'évaluation de la mise en oeuvre des lois ! Je propose un débat entre les différents acteurs (représentants du gouvernement ou du parlement et partenaires sociaux) avec un moment de réponse aux questions populaires qui ont eu le plus de succès (sur une plateforme en ligne de questions avec notation de ces questions par le peuple)  et après le débat  un vote sous forme de référendum en ligne avec la question simple : approuvez- vous la mise en oeuvre ou non ! Si le résultat est non le représentant légal du gouvernement ou parlement devra représenter dans un délai décidé lors du débat un nouveau plan prenant en compte les remarques du débat ! Les personnes qui participent a ce genre d'initiative populaire pourraient le faire avec un identifiant lié à leur papier d'identité !"
}