{
  "author": {
    "avatar": "https://secure.gravatar.com/avatar/e5c069e6cfc73ea5d3d6c2a437490cdd?d=mm",
    "displayName": "Ludovic Peran",
    "extra": {
      "age": "2",
      "job": "2",
      "postal": "75010"
    },
    "firstName": "Ludovic",
    "fullName": "Ludovic Peran",
    "id": "59fa19d1ccdac63cb472b334",
    "lastName": "Peran"
  },
  "createdAt": "2017-11-06T22:55:49.436Z",
  "flags": [],
  "id": "5a00e87582abf78a2231d4b2",
  "reference": "59d731a712406bdd5d6277d1",
  "replies": [],
  "repliesCount": 0,
  "score": 1,
  "text": "Bonjour, Le think tank point d’aencrage a publié cette année son rapport démocratie, technologie & citoyenneté. \n\nhttp://pointdaencrage.org/2017/05/09/democratie-technologie-citoyennete-construire-nos-institutions-numeriques/\n\nParmi les 10 propositions du rapport on trouve en particulier:\nTIRER AU SORT DES CONFÉRENCES DE CITOYENS POUR\nORIENTER LES ENJEUX DE LONG TERME\n\nSur le modèle des G1000 organisés en Belgique, en Islande et récemment en Espagne, un\nambitieux processus démocratique permettrait de confier à des citoyens tirés au sort et\naccompagnés par des facilitateurs professionnels la définition de grandes orientations\npolitiques de long terme ou la résolution de problématiques dont le débat public peine à se\nsaisir de manière efficace ou rationnelle. Le projet lancé par le collectif Echo Citoyen sur la\npolitique des drogues pourrait servir d’exemple."
}