{
  "author": {
    "avatar": "https://lh6.googleusercontent.com/-KbgwXUBA3cI/AAAAAAAAAAI/AAAAAAAAIR0/avoCLDaXTcQ/photo.jpg?sz=50",
    "displayName": "Christophe Martinolli",
    "extra": {
      "age": "3",
      "job": "4",
      "postal": "75019"
    },
    "firstName": "Christophe",
    "fullName": "Christophe Martinolli",
    "id": "5a0324ee1c7d53dc73dba313",
    "lastName": "Martinolli"
  },
  "createdAt": "2017-11-08T15:54:01.396Z",
  "flags": [],
  "id": "5a0328991c7d53dc73dba3b2",
  "reference": "59d731a712406bdd5d6277d1",
  "replies": [],
  "repliesCount": 0,
  "score": 0,
  "text": "Revenir à un calendrier électoral qui donnera mécaniquement plus de pouvoir à l'Assemblée nationale en soumettant le vote à mi-mandat du Président de la République."
}