{
  "author": {
    "avatar": "https://secure.gravatar.com/avatar/cd1ea2070211f9fe6dfeb8e6a4844704?d=mm",
    "displayName": "Johann CALAC",
    "extra": {
      "age": "3",
      "job": "3",
      "postal": "35190"
    },
    "firstName": "Johann",
    "fullName": "Johann CALAC",
    "id": "59fdf12082abf78a2231513b",
    "lastName": "CALAC"
  },
  "createdAt": "2017-11-05T22:03:16.106Z",
  "flags": [],
  "id": "59ff8aa482abf78a2231ba1c",
  "reference": "59d731a712406bdd5d6277d1",
  "replies": [
    {
      "_id": "59ff9c1982abf78a2231bc02",
      "author": {
        "avatar": "https://secure.gravatar.com/avatar/018157ca9a723be6b9e91c0fe97cd3b0?d=mm",
        "displayName": "Charlie Tessier",
        "extra": {
          "age": "2",
          "job": "",
          "postal": ""
        },
        "firstName": "Charlie",
        "fullName": "Charlie Tessier",
        "id": "59fe4eac82abf78a2231808d",
        "lastName": "Tessier"
      },
      "createdAt": "2017-11-05T23:17:45.814Z",
      "text": "Sans rentrer, pour ma part, sur le débat des messages véhiculés par les médias, je suis tout à fait d'accord avec ce que vous dites. Au sortir du lycée, il y un grand manque de connaissance concernant le fonctionnement de la démocratie, nos droits, devoirs. Comment peut on s'investir dans quelque chose que l'on ne connait pas/comprends pas. Il y a bien des rares cours \"d'éducation civique\" mais c'est largement insuffisant (je le dis en étant étudiant sortant du lycée il y a quelques années). Alors bien sur on peut se renseigner par soi même. Mais l'Ecole devrait fournir une éducation complète concernant ces thèmes et donner envie aux jeunes de s'impliquer et d'être acteur de notre futur. "
    }
  ],
  "repliesCount": 1,
  "score": 2,
  "text": "Bonne idée que de faire participer les citoyens, mais il faut faire de l'éducation populaire au sens politique du terme. Que les citoyens connaissent leur droits, leur histoire, comprendre par exemple les enjeux réels des lois (ex: loi travail, ou encore la baisse des cotisations  sociales ) en gros, pouvoir comprendre à qui profite la loi!!! D'autre part, séparer les médias de toute relations de l'état et de surtout des puissances des entreprises multinationales qui véhiculent bien souvent l'idéologie néo-libérale."
}