{
  "author": {
    "avatar": "https://i0.wp.com/www.dlp15.org/wp-content/uploads/2017/09/DLP15-Illdy2-header-01.png?fit=104%2C75",
    "displayName": "Selda BESNIER",
    "extra": {
      "age": "4",
      "job": "4",
      "postal": "75015"
    },
    "firstName": "Selda",
    "fullName": "Selda BESNIER",
    "id": "59ff1f7082abf78a2231a375",
    "lastName": "BESNIER"
  },
  "createdAt": "2017-11-05T14:36:33.694Z",
  "editedAt": "2017-11-05T15:28:19.393Z",
  "flags": [],
  "id": "59ff21f182abf78a2231a3e6",
  "reference": "59d731a712406bdd5d6277d1",
  "replies": [
    {
      "_id": "59ff9d4582abf78a2231bc25",
      "author": {
        "avatar": "https://secure.gravatar.com/avatar/018157ca9a723be6b9e91c0fe97cd3b0?d=mm",
        "displayName": "Charlie Tessier",
        "extra": {
          "age": "2",
          "job": "",
          "postal": ""
        },
        "firstName": "Charlie",
        "fullName": "Charlie Tessier",
        "id": "59fe4eac82abf78a2231808d",
        "lastName": "Tessier"
      },
      "createdAt": "2017-11-05T23:22:45.924Z",
      "text": "Très bonne proposition. Je reprend la réponse que j'ai publié plus haut à une proposition similaire. \n\"Au sortir du lycée, il y un grand manque de connaissance concernant le fonctionnement de la démocratie, nos droits, devoirs. Comment peut on s’investir dans quelque chose que l’on ne connait pas/comprends pas. Il y a bien des rares cours “d’éducation civique” mais c’est largement insuffisant (je le dis en étant étudiant sortant du lycée il y a quelques années). Alors bien sur on peut se renseigner par soi même. Mais l’Ecole devrait fournir une éducation complète concernant ces thèmes et donner envie aux jeunes de s’impliquer et d’être acteur de notre futur. "
    }
  ],
  "repliesCount": 1,
  "score": 0,
  "text": "**\"Les Lycéens au cœur de la Démocratie et du devenir de celle-ci\"**\n\nLa mise en place d’un portail spécifiquement pensé pour les Jeunes serait très importante.\nNotre association Démocratie Locale Participative du XVème a constaté lors des stages qu’elle organisait avec des lycéens en seconde que la **défiance qu’ils portent vis-à-vis de la politique tient sa source principalement d'un manque d’informations** quant aux possibilités offertes aux citoyens.\n\nCe portail pourrait s’organiser en plusieurs sections avec des **contenus explicatifs** d’une part, et des **espaces de discussion, modérés par des équipes pédagogique**s de concert avec des membres de l’Assemblée Nationale, d’autre part.\n\nVoici un exemple de schéma d’organisation de la plate-forme suivant la \"vie\" d’une loi :\n\n1. **Présentation de l’état du droit existant** sur l’objet de la loi mise en débat public : les avancées qu’elle a déjà portées en cas de révision et les écueils qu’elle doit annihiler. Des exemples concrets illustreront cette présentation introductive.\n\n2. **Présentation du projet en cours de discussion** : ses objectifs et les avancées dans son élaboration, appuyés encore une fois de projections et d’exemples concrets.\n\n3. **Ouverture d’un espace numérique dédié** à recueillir leurs réflexions et leurs propositions. Cet espace pourrait être segmenté selon les points de cette loi ou segmenté suivant les institutions partenaires de cette expérimentation. En effet, il pourrait être proposé des espaces de discussion, modérés par un/des enseignants d’un établissement volontaire, qui seraient ouverts à tous les lycéens de cet établissement. Afin de comprendre les attentes, notamment suivant les quartiers d’implantation ou les statuts socio-économiques, la lecture des échanges de tous ces espaces dédiés à des établissements volontaires serait accessible à tous les citoyens, sans négliger la sécurité des contributeurs.\n\n4. **Analyse de la loi définitivement votée** avec les amendements proposés par les lycéens au cours de cette consultation et pris en compte dans la nouvelle loi.\n\n5. Enfin, au terme de trois ans d’existence, ou bien lors d’un nouveau débat public concernant cette loi, les espaces d’échanges coopératifs par établissements, pourraient être ré-ouverts pour **recueillir les évaluations de cette loi et les améliorations à apporter** dans un article ou dans les décrets d’application.\n\nL’intérêt de cette coopération est qu’elle démontre **l’importance des travaux des députés** de l’Assemblée Nationale auprès de jeunes citoyens qui auront bientôt le droit de les désigner et qu’elle n’empiète pas sur la légitimité et les responsabilités des membres de cette Assemblée.\n\nCette démarche de concertation proposée par l’Assemblée Nationale, n’excluant aucune autre forme de concertation, intégrerait **\"Les Lycéens au cœur de la Démocratie et du devenir de celle-ci\"**.\n\n**L'association DLP15** (http://www.dlp15.org) est prête à coopérer pour mettre en œuvre une expérimentation.\n\n**Pour connaître nos activités** : https://twitter.com/DLP_15"
}