{
  "author": {
    "avatar": "https://secure.gravatar.com/avatar/2a1468729e499bc5466ae8696b459d5a?d=mm",
    "displayName": "Raymond Bonomo Raymond",
    "extra": {
      "age": "5",
      "job": "6",
      "postal": "92100"
    },
    "firstName": "Raymond",
    "fullName": "Raymond Bonomo Raymond",
    "id": "59dda88966914e1e82237ff0",
    "lastName": "Bonomo Raymond"
  },
  "createdAt": "2017-10-11T05:42:26.652Z",
  "flags": [],
  "id": "59ddaf4266914e1e8223800a",
  "reference": "59d734d112406bdd5d6277ff",
  "replies": [
    {
      "_id": "59dfba2566914e1e8223841a",
      "author": {
        "avatar": "https://secure.gravatar.com/avatar/552f2f0b408ddd8b771c5215d97075e4?d=mm",
        "displayName": "David Libeau",
        "extra": {
          "age": "",
          "job": "8",
          "postal": ""
        },
        "firstName": "David",
        "fullName": "David Libeau",
        "id": "59db7f749e1c7be85124dddc",
        "lastName": "Libeau"
      },
      "createdAt": "2017-10-12T18:53:25.310Z",
      "text": "Tout à fait d'accord, l'éducation est la pierre angulaire de la démocratie.\n\nJ'ajouterai l'apprentissage de l'éloquence, savoir bien parler devant une assemblée est primordial !"
    }
  ],
  "repliesCount": 1,
  "score": 0,
  "text": "Information, formation citoyenne.\nL’Etat a la responsabilité de donner au citoyen les éléments lui permettant de participer, faire des choix.\nCet apprentissage doit commencer dès l’école avec l’instruction civique et se poursuivre dans la vie d’adulte par des publications Internet, voir des émissions pédagogiques dans l’audiovisuel.\nLa sensibilisation à la participation des citoyens, voire le vote obligatoire avec comptabilisation des bulletins blancs dans les suffrages exprimés,  va dans ce sens. \nDe même que l’ouverture des données publiques («Open data) et l'initiative présente.\nIl faut mettre en place l'environnement pour que le citoyen se sente concerné.\nLa démocratie participative est une voie indispensable pour reconquérir la confiance du citoyen dans ses élus et dans ses institutions.\nInformation, formation citoyenne."
}