{
  "author": {
    "avatar": "https://secure.gravatar.com/avatar/49a2ac696b353e0f0c6a83c7ee78068c?d=mm",
    "displayName": "gael dufour",
    "extra": {
      "age": "3",
      "job": "7",
      "postal": "29000"
    },
    "firstName": "gael",
    "fullName": "gael dufour",
    "id": "59de14b566914e1e8223812a",
    "lastName": "dufour"
  },
  "createdAt": "2017-10-11T13:01:47.440Z",
  "editedAt": "2017-10-11T13:02:08.538Z",
  "flags": [],
  "id": "59de163b66914e1e82238142",
  "reference": "59d731a712406bdd5d6277d1",
  "replies": [
    {
      "_id": "59f1c441896da05921863c59",
      "author": {
        "avatar": "https://graph.facebook.com/10155852828033841/picture",
        "displayName": "Yvan Bachaud",
        "firstName": "Yvan",
        "fullName": "Yvan Bachaud",
        "id": "59ec210166914e1e82239673",
        "lastName": "Bachaud"
      },
      "createdAt": "2017-10-26T11:17:21.335Z",
      "text": "Quand on aura le référendum d'initiative citoyenne  une proposition de loi en ce sens pourra être déposée. Cela a été le cas en SUISSE il y a quelques mois et cela a été rejeté je crois avec 75% de NON;"
    },
    {
      "_id": "5a02d34782abf78a2231e322",
      "author": {
        "avatar": "https://lh3.googleusercontent.com/-XdUIqdMkCWA/AAAAAAAAAAI/AAAAAAAAAAA/4252rscbv5M/photo.jpg?sz=50",
        "displayName": "sens aris",
        "firstName": "sens",
        "fullName": "sens aris",
        "id": "5a02bd5d82abf78a2231e227",
        "lastName": "aris"
      },
      "createdAt": "2017-11-08T09:49:59.755Z",
      "text": "Plus que le revenu universel, le salaire universel serait plus juste (voir Friot pour plus d'explications).\nMais cette mesure ne serait qu'un remède à un dysfonctionnement plus grave. De fait, NOS institutions ne peuvent plus refléter la volonté du souverain (la population). En effet, la France est soumise aux règles de l'UE qui par une incroyable forfaiture, ont posé institué des principes irrévocables autres que les droits de l'homme et du citoyens, et même contraire, puisque le vote populaire ne peut plus révoquer ces lois ! Sauf de manière 'catastrophique' comme l'est le Brexit.\nL'introduction de règles ultralibérales, c'est à dire impliquant la loi du plus fort est une absurdité démocratique, un viol.\nEnsuite devoir quémander à nos gouvernements d'appliquer les droits de l'homme c'est perdu d'avance. La contradiction est trop forte, c'est absurde.\nOn ne peut pas d'un coté transformer chaque entité de droit (les personnes, les entreprises, les états, ...) en optimiseur du capital (favoriser la rente) et se plaindre de l'autre laisser libre la prédation du capital (les richesses). Il y a contradiction dans les termes. La richesse étant finie, sa prédation massive actuelle prive les autres (personnes et États notamment) de moyens. Les personnes sombrent dans la misère ce qui génère de la violence inexorablement, les États n'ont plus les moyens de répartir la richesse qu'ils n'ont pas - la violence ne peut être mâtée que par plus de violence - cercle vicieux.\nDonc il FAUT casser l'UE (irréformable de fait) pour redonner aux citoyens et aux États les moyens de \"faire société\" en empêchant toute accumulation de capital privé. Le capital, la richesse à investir, est l'affaire des institutions démocratiques et en aucun cas de potentats. L'arbitraire est a-démocratique. \n"
    }
  ],
  "repliesCount": 2,
  "score": 13,
  "text": "Débattons sérieusement du temps de travail et du revenu universel . Le préambule de la Constitution du 27 octobre 1946 indique :\n\n10. La Nation assure à l'individu et à la famille les conditions nécessaires à leur développement.\n\n11. Elle garantit à tous, notamment à l'enfant, à la mère et aux vieux travailleurs, la protection de la santé, la sécurité matérielle, le repos et les loisirs. Tout être humain qui, en raison de son âge, de son état physique ou mental, de la situation économique, se trouve dans l'incapacité de travailler a le droit d'obtenir de la collectivité des moyens convenables d'existence.\n\nCe qui n'est absolument pas le cas en France : pourquoi ne pas se partager le travail et peut on réellement vivre décemment avec 470 euros par mois ?"
}