{
  "author": {
    "avatar": "https://graph.facebook.com/1831975340210618/picture",
    "displayName": "Maxime Prat",
    "firstName": "Maxime",
    "fullName": "Maxime Prat",
    "id": "59fe1b3282abf78a22317194",
    "lastName": "Prat"
  },
  "createdAt": "2017-11-04T20:08:46.216Z",
  "flags": [],
  "id": "59fe1e4e82abf78a223172e3",
  "reference": "59d734d112406bdd5d6277ff",
  "replies": [],
  "repliesCount": 0,
  "score": 0,
  "text": "CE sont nos élus qui auraient du prendre cette initiative pour soutenir les valeurs pour lesquelles nous les avons délégués ..Bravo pour l'action que vous menez!"
}