{
  "author": {
    "avatar": "https://graph.facebook.com/10155852828033841/picture",
    "displayName": "Yvan Bachaud",
    "firstName": "Yvan",
    "fullName": "Yvan Bachaud",
    "id": "59ec210166914e1e82239673",
    "lastName": "Bachaud"
  },
  "createdAt": "2017-10-22T07:38:10.810Z",
  "flags": [],
  "id": "59ec4ae266914e1e82239697",
  "reference": "59d734d112406bdd5d6277ff",
  "replies": [
    {
      "_id": "59ed9d4b66914e1e8223981a",
      "author": {
        "avatar": "https://pbs.twimg.com/profile_images/779238336686948352/0Kc7fs1n_400x400.jpg",
        "displayName": "Mathilde Jeuland",
        "extra": {
          "age": "2",
          "job": "1",
          "postal": "75020"
        },
        "firstName": "Mathilde",
        "fullName": "Mathilde Jeuland",
        "id": "59db6f7e9e1c7be85124dd43",
        "lastName": "Jeuland"
      },
      "createdAt": "2017-10-23T07:42:03.237Z",
      "text": "Bonjour Yvan, nous vous remercions pour votre message. En effet, l’initiative est partagée dans la mesure où la proposition de loi parlementaire doit être soutenue par  un  dixième  des  électeurs  inscrits. "
    },
    {
      "_id": "59f625f7e8a9656c1a8e72cb",
      "author": {
        "avatar": "https://graph.facebook.com/10155852828033841/picture",
        "displayName": "Yvan Bachaud",
        "firstName": "Yvan",
        "fullName": "Yvan Bachaud",
        "id": "59ec210166914e1e82239673",
        "lastName": "Bachaud"
      },
      "createdAt": "2017-10-29T19:03:19.609Z",
      "text": "il faut être sérieuse...Si l'initiative parlementaire doit en effet être soutenue par 10% des inscrits c'est bien que ce derniers ne partage pas l'initiative! relisez l'article 11. vous verrez \"soutenuE \" c'est l'initiative qui est soutenue; au féminin!\nsi c'était 20% de parlementaires, soutenu serait au masculin.\nC'est une évidence;\nj'ai demandé à la rapporteur PAULA FORTENZA de faire rectifier; si ce n'est pas fait je saisirai la déontologue!\nCordialement."
    },
    {
      "_id": "59ff684682abf78a2231b3d5",
      "author": {
        "avatar": "https://secure.gravatar.com/avatar/7754e2d3e3566451d1caec5b18419bbc?d=mm",
        "displayName": "Adriana ANDRONIC",
        "extra": {
          "age": "4",
          "job": "7",
          "postal": "07000"
        },
        "firstName": "Adriana",
        "fullName": "Adriana ANDRONIC",
        "id": "59ff260c82abf78a2231a4ca",
        "lastName": "ANDRONIC"
      },
      "createdAt": "2017-11-05T19:36:38.086Z",
      "text": "Bien vu, Yvan: je suis d'accord avec vous et vous avez mon vote. Belle soirée"
    }
  ],
  "repliesCount": 3,
  "score": 1,
  "text": "Très urgent. le 22.10.2017\n Objet : Rectification du document :\" Petition_et_referendum.pdf\"\nEn application de la \"charte de consultation\"  qui indique que sont proscrits:\nles affirmations graves non prouvées ou notoirement inexactes \"\n je demande que le titre erronné :\"Référendum d'initiative partagée \" soit remplacé par \" référendum d'initiative parlementaire\".                                                        Il est en effet factuel que l'initiative de cette procédure sui generis est d'initiative EXCLUSIVEMENT parlementaire. \nIl suffit de lire l'article 11.\nCordiales salutations citoyennes."
}