{
  "author": {
    "avatar": "https://secure.gravatar.com/avatar/4f24f8b15ece5e622db322bae29eea07?d=mm",
    "displayName": "Jean-François Drut",
    "extra": {
      "age": "4",
      "job": "6",
      "postal": "42800"
    },
    "firstName": "Jean-François",
    "fullName": "Jean-François Drut",
    "id": "59f1b181896da05921863c0b",
    "lastName": "Drut"
  },
  "createdAt": "2017-10-30T09:31:42.263Z",
  "flags": [],
  "id": "59f6f17ee8a9656c1a8e731e",
  "reference": "59d7325812406bdd5d6277d4",
  "replies": [],
  "repliesCount": 0,
  "score": 0,
  "text": "Les comptes-rendus de mandat des élus (parlementaires ou élus territoriaux) sont le plus souvent des actes militants qui permettent de conforter et fidéliser un électorat.\nS’ils étaient encadrés par la loi, rendus obligatoires, pilotés par des modérateurs plus techniciens que partisans et adossés à des outils de suivi construits à partir des programmes et engagements des élus, ils pourraient trouver une efficacité autre que la simple justification de telle ou telle position.\nPar ailleurs, même si l’expression des citoyens doit d’abord s’envisagera à travers une participation physique, par exemple aux réunions de compte-rendu de mandat évoquées ci-dessus, un bureau virtuel de propositions peut être mis en place,  dans chaque préfecture permettant sur telle ou telle proposition citoyenne de recueillir  le soutien d’une majorité d’électeurs. Le terme « majorité «  est important, car 5%, 10%  des électeurs ne sauraient remettre en cause une loi votée par un parlement à priori représentatif ."
}