{
  "author": {
    "avatar": "https://secure.gravatar.com/avatar/7be603f06c5170f612fd8233ef40c09f?d=mm",
    "displayName": "Jean-Pierre Blin",
    "extra": {
      "age": "5",
      "job": "6",
      "postal": "92140"
    },
    "firstName": "Jean-Pierre",
    "fullName": "Jean-Pierre Blin",
    "id": "5a00a4c482abf78a2231cffd",
    "lastName": "Blin"
  },
  "createdAt": "2017-11-08T18:45:09.414Z",
  "flags": [],
  "id": "5a0350b51c7d53dc73dba4e2",
  "reference": "59d7335412406bdd5d6277e4",
  "replies": [],
  "repliesCount": 0,
  "score": 1,
  "text": "Dans les messages abordant l'évaluation, une tendance à la généralisation est fréquente. Une partie du domaine à évaluer ne nécessite pas la même attention puisque celui-ci est très vaste : la loi de finances annuelle (et ses révisions), la loi de santé publique annuelle sans oublier tous les projets de loi inscrits dans la session parlementaire.\nParmi les projets de loi, certains modifient le code du travail, le code de la santé, le code civil, le code pénal... Pour évaluer, il est préférable de connaître le domaine. La formation de quelques heures mentionnée dans un message me parait insuffisante sur de tels sujets. On pourrait penser à choisir des membres d'associations de malades ou de proches de malades pour la santé, de syndicalistes pour le travail, mais il sera difficile de trouver suffisamment de bénévoles pour les 99 codes du droit national. \n\nUn autre aspect consiste à évaluer les services publics. L’Education Nationale publie régulièrement des résultats. Il existe également les rapports PISA qui permettent de comprendre qu’il existe une grande disparité de résultats à l’Education Nationale. En complément à la proposition d’assemblées, je propose que des publications complémentaires de résultats d’accompagnement, de formation, de soins…soient préparées par des personnes choisies parmi les membres d’associations sensibles à la fragilité (élèves handicapés, personnes âgées en EHPAD, personnes atteintes de troubles psychiques, adultes handicapés….). L'objectif serait d'éviter la trop grande disparité que l'on peut découvrir entre certains services d'un domaine donné (Education Nationale, EHPAD, adultes handicapés, troubles psychiques ...)."
}