{
  "author": {
    "avatar": "https://secure.gravatar.com/avatar/f8d2775cc55a2bb6494b5d86e318b397?d=mm",
    "displayName": "Benjamin  Larue ",
    "extra": {
      "age": "3",
      "job": "8",
      "postal": "13015"
    },
    "firstName": "Benjamin ",
    "fullName": "Benjamin  Larue ",
    "id": "59feed6c82abf78a2231986b",
    "lastName": "Larue "
  },
  "createdAt": "2017-11-05T10:55:53.175Z",
  "flags": [],
  "id": "59feee3982abf78a223198f2",
  "reference": "59d734d112406bdd5d6277ff",
  "replies": [],
  "repliesCount": 0,
  "score": 2,
  "text": "La démocratie, ce n'est pas seulement une élection tous les cinq ans, c'est aussi écouter les citoyens au quotidien. Les pétitions en ligne sont un bon moyen d'expression et doivent être entendues."
}