{
  "author": {
    "avatar": "https://secure.gravatar.com/avatar/1cb249e799674716f9acbff585870e64?d=mm",
    "displayName": "Sébastien Vanzieleghem",
    "extra": {
      "age": "3",
      "job": "2",
      "postal": "76116"
    },
    "firstName": "Sébastien",
    "fullName": "Sébastien Vanzieleghem",
    "id": "59dbe2129e1c7be85124e098",
    "lastName": "Vanzieleghem"
  },
  "createdAt": "2017-10-11T12:56:31.425Z",
  "flags": [],
  "id": "59de14ff66914e1e82238131",
  "reference": "59d731a712406bdd5d6277d1",
  "replies": [],
  "repliesCount": 0,
  "score": -1,
  "text": "Mettre en place une commission d'enquête parlementaire sur le pillage économique et industriel des dernières années (abandons de fleurons comme Alstom, Alcatel, EADS…) et permettre la mise en examen et la détention préventive des suspects"
}