{
  "author": {
    "avatar": "https://graph.facebook.com/10215248472354368/picture",
    "displayName": "Thierry Sanchis",
    "firstName": "Thierry",
    "fullName": "Thierry Sanchis",
    "id": "59dcbf7a9b28097eb6b4183f",
    "lastName": "Sanchis"
  },
  "createdAt": "2017-10-10T12:58:41.459Z",
  "flags": [],
  "id": "59dcc4019b28097eb6b41848",
  "reference": "59d734d112406bdd5d6277ff",
  "replies": [
    {
      "_id": "59dcdf239b28097eb6b418e6",
      "author": {
        "avatar": "https://graph.facebook.com/10155547125285937/picture",
        "displayName": "La Francesa",
        "firstName": "La",
        "fullName": "La Francesa",
        "id": "59dcda579b28097eb6b418d0",
        "lastName": "Francesa"
      },
      "createdAt": "2017-10-10T14:54:27.935Z",
      "text": "C'est un bon point! Ne permettre la signature electronique des petitions en ligne qu'aux citoyens inscrits sur les listes electorales. L'attrait du numerique ne doit pas obliterer les formes d expression democratique traditionnelles.  "
    },
    {
      "_id": "59dd155d9b28097eb6b41a05",
      "author": {
        "avatar": "https://secure.gravatar.com/avatar/552f2f0b408ddd8b771c5215d97075e4?d=mm",
        "displayName": "David Libeau",
        "extra": {
          "age": "",
          "job": "8",
          "postal": ""
        },
        "firstName": "David",
        "fullName": "David Libeau",
        "id": "59db7f749e1c7be85124dddc",
        "lastName": "Libeau"
      },
      "createdAt": "2017-10-10T18:45:49.883Z",
      "text": "Vous commencez votre proposition par un beau slogan \"Trop de démocratie tue la démocratie\" sans vraiment donner de justification ensuite. Pouvez-vous étayer votre propos ? Je ne comprends pas.\n\nLes députés ont déjà beaucoup de poids et d'outils pour \"être de vrais relayeur des revendications des territoires \" avec les questions au gouvernement, les débats parlementaires, les propositions d'amendement/de lois…"
    },
    {
      "_id": "59e3e63466914e1e822387f3",
      "author": {
        "avatar": "https://secure.gravatar.com/avatar/0db9769aa745a9e7e8c733f01a5c6df9?d=mm",
        "displayName": "Richard Arnaud",
        "extra": {
          "age": "3",
          "job": "3",
          "postal": "74140"
        },
        "firstName": "Richard",
        "fullName": "Richard Arnaud",
        "id": "59e3db3266914e1e822387e4",
        "lastName": "Arnaud"
      },
      "createdAt": "2017-10-15T22:50:28.161Z",
      "text": "Croire que nos députés soient des relais relève de l'angélisme Thierry. Je comprend vos craintes concernant l'aspect direct de cette démocratie. Elle semble moins ordonnée que cette prétendue représentativité dont nous sommes les dindons de la farce actuellement mais ce serait pourtant un très fort rappel à l'ordre pour nos représentants institutionnels. Sur la méthode, il est clair que tout reste à faire et l'inscription sur les listes électorale est un minimum. Il ne s'agit pas de créer un \"réseau social institutionnel\" mais bien un outil de démocratie directe.\nQuoi qu'il en soit, une initiative populaire, un référendum ou une proposition de loi citoyenne aura besoin d'un appui par une association ou un collectif sans quoi chacune d'elle courra au désastre voir vers l'oubli. Il ne s'agit pas de créer des sondages mais bien des propositions de loi. Et pour ça, en effet, nous aurons besoin de professionnels (du monde juridique notamment) pour pouvoir créer la substance de cette loi.\nIl nous faut reprendre la main sur les institutions de notre pays et peser en tant que peuple _directement_ dans la vie politique de notre nation!"
    }
  ],
  "repliesCount": 3,
  "score": -5,
  "text": "Trop de démocratie tue la démocratie. Par les élections présidentielles puis les élections législatives les français ont les moyens d'exprimer leurs opinions. Ils le font pour bon nombre d'entre eux en toute connaissance de cause. Les programmes des candidats sont publics. Donner au peuple ( donc pas forcement tous des personnes inscrites sur les listes électorales) par des pétitions en ligne, référendum d’initiative populaire, propositions de loi citoyennes, questions au gouvernement citoyennes c'est instaurer de l'instabilité dans le fonctionnement des institutions. Donner plus de poids aux députés pour pouvoir être de vrais relayeur des revendications des territoires me semble plus approprié."
}