{
  "author": {
    "avatar": "https://secure.gravatar.com/avatar/0d3467294976bbfc5064cdd601ff0658?d=mm",
    "displayName": "Yves TOMBETTE",
    "extra": {
      "age": "5",
      "job": "6",
      "postal": "22430"
    },
    "firstName": "Yves",
    "fullName": "Yves TOMBETTE",
    "id": "59fece6282abf78a22318d60",
    "lastName": "TOMBETTE"
  },
  "createdAt": "2017-11-05T09:11:51.282Z",
  "flags": [],
  "id": "59fed5d782abf78a22318ff0",
  "reference": "59d7335412406bdd5d6277e4",
  "replies": [],
  "repliesCount": 0,
  "score": 0,
  "text": "La publication des contrôles déjà existants serait une première mesure pour informer les citoyens des évaluations mises en oeuvre par les parlementaires. La deuxième mesure importante est de mettre en place un outil numérique pour communiquer avec nos parlementaires afin d'alimenter leur connaissance de la mise en oeuvre des lois sur leur territoire."
}