{
  "author": {
    "avatar": "https://graph.facebook.com/1470248759695534/picture",
    "displayName": "Laurent Thouvenin",
    "firstName": "Laurent",
    "fullName": "Laurent Thouvenin",
    "id": "59fd90e1e7c9379d2c56219a",
    "lastName": "Thouvenin"
  },
  "createdAt": "2017-11-04T10:07:28.831Z",
  "flags": [],
  "id": "59fd9160e7c9379d2c5621b1",
  "reference": "59d734d112406bdd5d6277ff",
  "replies": [],
  "repliesCount": 0,
  "score": 1,
  "text": "Il est temps de faire pressions sur les acteurs qui dirigent avec des motivations de moins en moins en équation avec les peuples...Surtout en France..."
}