{
  "author": {
    "avatar": "https://lh3.googleusercontent.com/-rjP_ZIxLo7I/AAAAAAAAAAI/AAAAAAAAB-0/-y1M8_9hq44/photo.jpg?sz=50",
    "displayName": "Arielle Langouet",
    "firstName": "Arielle",
    "fullName": "Arielle Langouet",
    "id": "59fe0f3082abf78a22316b86",
    "lastName": "Langouet"
  },
  "createdAt": "2017-11-04T19:07:53.436Z",
  "flags": [],
  "id": "59fe100982abf78a22316beb",
  "reference": "59d7335412406bdd5d6277e4",
  "replies": [],
  "repliesCount": 0,
  "score": 0,
  "text": "Excellente initiative. En souhaitant être entendus"
}