{
  "author": {
    "avatar": "https://graph.facebook.com/10214460362649196/picture",
    "displayName": "Fabrice Ficara",
    "firstName": "Fabrice",
    "fullName": "Fabrice Ficara",
    "id": "59e26a7d66914e1e822385ae",
    "lastName": "Ficara"
  },
  "createdAt": "2017-10-14T19:58:36.334Z",
  "flags": [],
  "id": "59e26c6c66914e1e822385af",
  "reference": "59d7335412406bdd5d6277e4",
  "replies": [],
  "repliesCount": 0,
  "score": 13,
  "text": "La mise en œuvre de lois incluant  des economies et/ ou des depenses devrait etre auditees regulierement. Ceci permettrait de verifier qu on arrive bien aux résultats attendus. Ces résultats pourront être consultable en ligne..."
}