{
  "author": {
    "avatar": "https://lh4.googleusercontent.com/-IbGm_3TTDPg/AAAAAAAAAAI/AAAAAAAABB0/xstmnWdV6kY/photo.jpg?sz=50",
    "displayName": "Maxime Forest",
    "firstName": "Maxime",
    "fullName": "Maxime Forest",
    "id": "59ecc6d766914e1e82239708",
    "lastName": "Forest"
  },
  "createdAt": "2017-10-22T17:03:11.562Z",
  "flags": [],
  "id": "59eccf4f66914e1e8223971d",
  "reference": "59d7325812406bdd5d6277d4",
  "replies": [],
  "repliesCount": 0,
  "score": 8,
  "text": "Avant de parler de plateforme numérique, je pense que le lien des citoyens avec le parlement doit passer par ces députés ou sénateurs. Il serait intéressant de former ces élus (ou collaborateurs) à la concertation, le recueil d'avis (et pourquoi pas à la mise en place de plateforme numérique) pour les inciter à animer et mieux informer localement leurs citoyens. \nC'est notamment une des idées qui est remonté de ce travail en région centre val de Loire https://www.democratie-permanente.fr/ ."
}