{
  "author": {
    "avatar": "https://lh3.googleusercontent.com/-XdUIqdMkCWA/AAAAAAAAAAI/AAAAAAAAAAA/4252rscbv5M/photo.jpg?sz=50",
    "displayName": "numa vernet",
    "firstName": "numa",
    "fullName": "numa vernet",
    "id": "59e1d67766914e1e8223852e",
    "lastName": "vernet"
  },
  "createdAt": "2017-10-15T10:00:58.159Z",
  "flags": [],
  "id": "59e331da66914e1e822386c1",
  "reference": "59d7347212406bdd5d6277f7",
  "replies": [
    {
      "_id": "5a0035e182abf78a2231c515",
      "author": {
        "avatar": "https://secure.gravatar.com/avatar/c4d88a70fb293e283a872e1b1c7fb22d?d=mm",
        "displayName": "Alassane DIA",
        "extra": {
          "age": "3",
          "job": "8",
          "postal": "31100"
        },
        "firstName": "Alassane",
        "fullName": "Alassane DIA",
        "id": "59de87f966914e1e822382b8",
        "lastName": "DIA"
      },
      "createdAt": "2017-11-06T10:13:53.823Z",
      "text": "Effectivement, il serait utile de prendre en compte les avis des citoyens dans le processus législatif. Il semble déraisonnable de consulter sans que les avis exprimés ne soient pris en compte. Toutefois, je suppose qu'étant démocratiquement désignées, le Parlement dispose d'une responsabilité politique qui lui laisse le dernier mot dans l'adoption de la loi. Je propose qu'en l'absence de prise en compte des avis, la loi adoptée soit bien motivée afin de présenter clairement les raisons de droit et de fait ayant poussé le Parlement à agir sans prendre en compte les avis exprimés dans le processus législatif."
    }
  ],
  "repliesCount": 1,
  "score": 8,
  "text": "La difficulté principale des textes est qu'ils sont difficilement lisibles pour tous les citoyens. Les lois votées sont souvent des dispositions modifiant des lois des lois antérieures. Ainsi si la loi se matérialise dans un texte, en revanche dans le code il est indiqué sont modifiés comme suit.\nIl y a donc un travail de lisibilité de la loi à effectuer \nJe prends l'exemple des circulaires qui \nL'outil informatique offre de nombreuses possibilités s'agissant de la consultation citoyenne. \nIl me semble donc impératif de s'en saisir.\nJ'ajoute que cette consultation doit être effective. Je vais prendre l'exemple des enquêtes publiques qui malheureusement bien souvent ne tiennent pas compte de l'avis des participants.\nIl faudrait donc dans cette réflexion définir un seuil de participants qui,une fois atteint, oblige les parlementaires à tenir compte des propositions (sous le forme d'une question citoyenne par exemple avec une réponse apportée et/ou un amendement proposé)\nVous pouvez peut être aussi vous inspirer des conseils de développement qui pour certains commencent à mettre en place des démarches de co construction des textes. (Loi Maptam)"
}