{
  "author": {
    "avatar": "https://secure.gravatar.com/avatar/79139337e5b94a1fc23e261d813e1f1f?d=mm",
    "displayName": "loic magon",
    "extra": {
      "age": "1",
      "job": "1",
      "postal": "13510"
    },
    "firstName": "loic",
    "fullName": "loic magon",
    "id": "59efd467896da059218639a1",
    "lastName": "magon"
  },
  "createdAt": "2017-10-25T00:14:11.290Z",
  "flags": [],
  "id": "59efd753896da059218639a5",
  "reference": "59d7347212406bdd5d6277f7",
  "replies": [],
  "repliesCount": 0,
  "score": -1,
  "text": "un referundum via ce site peut etre mis en place lors de la propositions d'une nouvelle loi et le resultat peut etre pris en compte par l'assamblé (comme un vote citoyen symbolique par exemple)"
}