{
  "author": {
    "avatar": "https://secure.gravatar.com/avatar/38cae2f6cd1641e63a2f2ff47a4a8eea?d=mm",
    "displayName": "Alexis Lavielle",
    "extra": {
      "age": "2",
      "job": "1",
      "postal": "75015"
    },
    "firstName": "Alexis",
    "fullName": "Alexis Lavielle",
    "id": "59fdd143e7c9379d2c562717",
    "lastName": "Lavielle"
  },
  "createdAt": "2017-11-04T14:50:51.588Z",
  "flags": [],
  "id": "59fdd3cbe7c9379d2c56275f",
  "reference": "59d731a712406bdd5d6277d1",
  "replies": [],
  "repliesCount": 0,
  "score": 1,
  "text": "Transparence des députés et présence aux séances\nIl faut absolument que les députés non présents aux séances et commissions soient sanctionnés, de la même manière qu'un citoyen le serait s'il ne va pas au travail. Il faut que la sanction soit dissuasive et encourage les députés à faire ce pour quoi ils ont été élus. \nDe plus, un site avec la publication officielle des dépenses, contrôlées indépendamment de l'AN, doit être ouvert pour l'information des citoyens."
}