{
  "author": {
    "avatar": "https://secure.gravatar.com/avatar/84b2d3a18568e6346d0b0029ec6dafd3?d=mm",
    "displayName": "Florence de Massol ",
    "extra": {
      "age": "4",
      "job": "8",
      "postal": "75020"
    },
    "firstName": "Florence",
    "fullName": "Florence de Massol ",
    "id": "59fe244082abf78a22317526",
    "lastName": "de Massol "
  },
  "createdAt": "2017-11-04T21:06:52.048Z",
  "flags": [],
  "id": "59fe2bec82abf78a22317877",
  "reference": "59d7335412406bdd5d6277e4",
  "replies": [],
  "repliesCount": 0,
  "score": -1,
  "text": "autre proposition : pourquoi ne pas imaginer qu'on fasse des lois à l'essai , en les testant pendant un laps de temps suffisant\nUne loi testée a plus de chanceê ensuite vraiment appliquée."
}