{
  "author": {
    "avatar": "https://lh3.googleusercontent.com/-XdUIqdMkCWA/AAAAAAAAAAI/AAAAAAAAAAA/4252rscbv5M/photo.jpg?sz=50",
    "displayName": "Couderc Fabien",
    "firstName": "Couderc",
    "fullName": "Couderc Fabien",
    "id": "59ff42f082abf78a2231aa85",
    "lastName": "Fabien"
  },
  "createdAt": "2017-11-05T17:34:04.021Z",
  "flags": [],
  "id": "59ff4b8c82abf78a2231ad11",
  "reference": "59d7347212406bdd5d6277f7",
  "replies": [],
  "repliesCount": 0,
  "score": 1,
  "text": "Il faut systématiser les consultations citoyennes pour toutes les lois. Une plate-forme de consultation doit être ouverte sans interruption. Chaque projet ou proposition de loi  doit être soumis à l'avis des citoyens sur cette plate-forme.\n\nIl faut grandement améliorer la communication sur toute initiative de consultation des citoyens. J'ai appris seulement deux jours avant la fermeture l’existence de cette consultation à laquelle je participe. Cela doit être communiqué dans tous les grands médias."
}