{
  "author": {
    "avatar": "https://secure.gravatar.com/avatar/e514416f06a0c2e277ffd451796ff701?d=mm",
    "displayName": "pierre cousty",
    "extra": {
      "age": "5",
      "job": "6",
      "postal": "40120"
    },
    "firstName": "pierre",
    "fullName": "pierre cousty",
    "id": "59fde7f0e7c9379d2c562a69",
    "lastName": "cousty"
  },
  "createdAt": "2017-11-04T16:38:43.710Z",
  "flags": [],
  "id": "59fded1382abf78a22314d41",
  "reference": "59d734d112406bdd5d6277ff",
  "replies": [],
  "repliesCount": 0,
  "score": 2,
  "text": "Les consultations citoyennes devraient être obligatoires pour toutes les décisions engageant l'avenir du pays, que ce soit sur le plan financier, social, ou de la politique extérieure. Il faut redonner toute sa place au citoyen, dans les affaires du pays, de la région, du département ou de la commune. Nous ne votons pas pour élire des maitres mais pour que ceux qui sont désignés, mettent en oeuvre les moyens nécessaires à la réalisation des aspirations du peuple qui les payent pour cela. Ce qui sous-entend que le peuple doit aussi pouvoir les congédier, comme ferait n'importe quel patron, insatisfait des performances de son employé."
}