{
  "author": {
    "avatar": "https://graph.facebook.com/10212797567511633/picture",
    "displayName": "Alexandre Eury",
    "firstName": "Alexandre",
    "fullName": "Alexandre Eury",
    "id": "59fe26fb82abf78a22317674",
    "lastName": "Eury"
  },
  "createdAt": "2017-11-04T20:55:10.315Z",
  "editedAt": "2017-11-04T20:56:40.094Z",
  "flags": [],
  "id": "59fe292e82abf78a22317762",
  "reference": "59d734d112406bdd5d6277ff",
  "replies": [],
  "repliesCount": 0,
  "score": 1,
  "text": "Instauration d un droit voire d un devoir de signalement des textes legislatifs trop complexes par un groupe de citoyen a definir, afin que l assemblee synthetise dans un texte unique les principes generaux retenus pour les lois concernes. Les dispositions detaillees demeurant au niveau reglementaire, cela constituerait egalement une aide pour le juge et contribuerait a une veritable accessibilite a la loi pour la population.\n\nConscient que ce chantier n est pas mince mais en donnant l initiative au peuple, c est celui ci qui determinera les urgences."
}