{
  "author": {
    "avatar": "https://secure.gravatar.com/avatar/b0a4d59364cf914930a288dc442a7a6e?d=mm",
    "displayName": "anne Durgueil",
    "extra": {
      "age": "4",
      "job": "2",
      "postal": "46090"
    },
    "firstName": "anne",
    "fullName": "anne Durgueil",
    "id": "59e716a966914e1e82238d18",
    "lastName": "Durgueil"
  },
  "createdAt": "2017-10-18T12:15:43.133Z",
  "flags": [],
  "id": "59e745ef66914e1e82238eac",
  "reference": "59d7347212406bdd5d6277f7",
  "replies": [],
  "repliesCount": 0,
  "score": -1,
  "text": "ça se gère comme un projet, il y a une phase de démarrage, où on pose un problème, et ça serait bien si on pouvait aussi intégrer la notion de son coût, 1 phase d'étude de faisabilité (et de rentabilité?), une phase d'établissement du cahier des charges et de planification, une phase de développement, un phase de test/pilote, une livraison (promulgation) et une évaluation post-mortem.  \n\nIl y a une structure avec un chef de projet qui répond à une groupe directeur du projet avec les chefs des intervenants, et nous nous devrions en faire partie en ayant à tout moment accès aux détails du projet.  \n\nOn suggère pour ce faire un compte twitter par projet qu'on suivrait suivant le niveau d'intérêt qu'il suscite en nous, ou où on pourrait envoyer des remarques ponctuelles si les médias attirent notre attention sur tel ou tel point, et où on pourrait voter le passage d'une phase à l'autre. Le chef de projet  en ferait l'animation et y fournirait les liens vers le site où seront stocké les documents de travail, les textes en cours les amendements etc. pour consultation.  \n\nSeuls les comptes certifiés électeur français devraient pouvoir accéder aux  comptes projet de loi.\nVoir avec twitter c'est une fonctionnalité qu'ils peuvent coder facilement, et ils peuvent aussi vous fournir un site spécifique accessible de manière transparente mais relié à vos systèmes pour permettre ce contrôle et situé derrière un pare-feu.  Ils ne devraient pas vous faire pas payer ça très cher, avec un développement pareil, quel saut dans l'avenir et pour la cote de leur action..\nLe grand avantage d'une telle solution est une mise en place éclair.  D'ailleurs vous pourriez déjà commencer avec deux trois prototypes sur des projets de lois d'importance moyenne.\n\nDésolé si c'est un peu long."
}