{
  "author": {
    "avatar": "https://secure.gravatar.com/avatar/72dde378577ef879b96bc86573610b99?d=mm",
    "displayName": "Eric Birot",
    "extra": {
      "age": "4",
      "job": "2",
      "postal": "94000"
    },
    "firstName": "Eric",
    "fullName": "Eric Birot",
    "id": "59db8c599e1c7be85124dea5",
    "lastName": "Birot"
  },
  "createdAt": "2017-10-10T11:48:47.655Z",
  "flags": [],
  "id": "59dcb39f9b28097eb6b41809",
  "reference": "59d734d112406bdd5d6277ff",
  "replies": [],
  "repliesCount": 0,
  "score": 0,
  "text": "les avancées des technologie de l'information permettent aujourd'hui des avancées dans l'expression d'un démocratie directe, n'est-ce pas la finalité de la démocratie. Cette plateforme montre qu'il existe une prise de conscience des élus en ce sens , soyons modernes !"
}