{
  "author": {
    "avatar": "https://secure.gravatar.com/avatar/15fe278394acf21094b4be9aefc2c46d?d=mm",
    "displayName": "Constance Lavayssière",
    "extra": {
      "age": "3",
      "job": "2",
      "postal": "75013"
    },
    "firstName": "Constance",
    "fullName": "Constance Lavayssière",
    "id": "59fdb2f8e7c9379d2c562536",
    "lastName": "Lavayssière"
  },
  "createdAt": "2017-11-04T14:15:46.794Z",
  "flags": [],
  "id": "59fdcb92e7c9379d2c562678",
  "reference": "59d734d112406bdd5d6277ff",
  "replies": [],
  "repliesCount": 0,
  "score": 20,
  "text": "Suite à une réunion d'environ 40 citoyens de Paris, le premier constat réalisé est le fait que les initiatives citoyennes, dans le cadre de l’élaboration et l’application des lois, sont mal connues par les citoyens.  Alors même que des réformes constitutionnelles ont permis de mettre en place des initiatives citoyennes, il n’y a pas de communication sur les processus d’initiatives possibles.\n\nActions : \n-\tPermettre au citoyen de se sentir concerné et lui donner une vraie place dans  l’élaboration et l’application des lois : \no\tAccentuer la communication sur les dispositifs déjà existants.\no\tMettre en place des communications spécifiques sur la compréhension de la citoyenneté adaptées à chaque âge de la citoyenneté : plateforme numérique, réunions/débats, évènements éducatifs, musée interactif de la citoyenneté.\n-\tProposer une part de budget de l’Etat en budget participatif : donner la possibilité aux citoyens de proposer des projets à compétence étatique/législatif puis vote des citoyens sur une plateforme numérique et en préfecture"
}