{
  "author": {
    "avatar": "https://secure.gravatar.com/avatar/e26b6c12d4f7cf9a163347f7077d3a14?d=mm",
    "displayName": "sarah fallon",
    "extra": {
      "age": "3",
      "job": "4",
      "postal": "74420"
    },
    "firstName": "sarah",
    "fullName": "sarah fallon",
    "id": "59fe237682abf78a223174d6",
    "lastName": "fallon"
  },
  "createdAt": "2017-11-04T20:37:21.197Z",
  "flags": [],
  "id": "59fe250182abf78a22317575",
  "reference": "59d734d112406bdd5d6277ff",
  "replies": [],
  "repliesCount": 0,
  "score": 0,
  "text": "Depuis le temps que j'attends une reforme de ce genre, j'ai l'impression qu'il y a une trop grosse deconection entre le peuple et le gouvernement. Des initiatives de ce genres permettent d'être a nouveau entendu et ça fait vraiment du bien."
}