{
  "author": {
    "avatar": "https://secure.gravatar.com/avatar/febba6f25e3fc3a56c361e7147a22dd2?d=mm",
    "displayName": "Christelle Abatut",
    "extra": {
      "age": "3",
      "job": "5",
      "postal": "79180"
    },
    "firstName": "Christelle",
    "fullName": "Christelle Abatut",
    "id": "59f65bc0e8a9656c1a8e72ec",
    "lastName": "Abatut"
  },
  "createdAt": "2017-11-04T08:46:03.723Z",
  "flags": [],
  "id": "59fd7e4bccdac63cb472c5be",
  "reference": "59d731a712406bdd5d6277d1",
  "replies": [],
  "repliesCount": 0,
  "score": -1,
  "text": "Création d'une chaine TV sur internet pour chaque département. Ces chaines   abriteraient  des interventions vidéos du préfet du département et du préfet de région. L'objectif de ces communications étant d'expliquer le pourquoi des décisions aux citoyens et donc de donner du sens aux décisions/actions/choix pris ou subis. Les préfets seraient ainsi des véritables relais de communication grand public. La perte de sens, souvent en raison d'une méconnaissance du pourquoi, est selon moi un des facteurs clés du désintérêt des citoyens vis à vis de la vie politique"
}