{
  "author": {
    "avatar": "https://secure.gravatar.com/avatar/6a6d681524223a446c99a7a5ea0297da?d=mm",
    "displayName": "Patrick VINCENT",
    "extra": {
      "age": "4",
      "job": "3",
      "postal": "84130"
    },
    "firstName": "Patrick",
    "fullName": "Patrick VINCENT",
    "id": "59e3354366914e1e822386c9",
    "lastName": "VINCENT"
  },
  "createdAt": "2017-10-15T10:26:45.859Z",
  "editedAt": "2017-10-15T10:28:14.387Z",
  "flags": [],
  "id": "59e337e566914e1e822386cc",
  "reference": "59d731a712406bdd5d6277d1",
  "replies": [],
  "repliesCount": 0,
  "score": -1,
  "text": "On ne peut pas tancer les jeunes d'irrespect envers la police ou les professeurs et tolérer le spectacle pitoyable, quasi quotidien, de l'irrespect des orateurs, des lazzis, des noms d'oiseaux et autres gestes qui vaudraient outrages dans d'autres lieux et pour d'autres personnes. De même, une tenue correcte, y compris ne pas dormir, être avachi ou consulter son smartphone pendant les débats semble le minimum minimorum qu'on peut attendre d'un élu de la représentation nationale. Enfin un présentéisme rigoureux sur tous les débats et pas seulement le jour des questions au gouvernement, filmé, est là encore un minimum en terme d'exemplarité. Le niveau de présence donnera lieux à une proratisation du traitement et sera communiqué chaque mois. Par ailleurs, le fait que les députés ne puissent embaucher d'attachés parlementaires de leur famille me semble inepte. S'ils veulent tricher, ils pourront toujours embaucher un membre de la famille d'un collègue qui leur rendra la politesse. Il me semble plus pertinent de rendre accessible le travail des attachés ainsi que leurs qualifications. Je souhaite, in fine, une réduction du nombre de députés qui seront mieux rémunérés mais devront un travail à plein temps."
}