{
  "author": {
    "avatar": "https://secure.gravatar.com/avatar/e4befa89e0a536bf0f3c57127b6181ae?d=mm",
    "displayName": "Karine Lenoir Capelle",
    "extra": {
      "age": "3",
      "job": "5",
      "postal": "38000"
    },
    "firstName": "Karine",
    "fullName": "Karine Lenoir Capelle",
    "id": "59ff5c3c82abf78a2231b1d0",
    "lastName": "Lenoir Capelle"
  },
  "createdAt": "2017-11-05T20:53:53.362Z",
  "flags": [],
  "id": "59ff7a6182abf78a2231b6d8",
  "reference": "59d733cb12406bdd5d6277ea",
  "replies": [],
  "repliesCount": 0,
  "score": 0,
  "text": "Proposition : introduire une démarche de Co-Design dans le travail des commissions. \n\nLe rapporteur pourrait organiser des ateliers participatifs regroupant plusieurs types d'acteurs concernés.  Cette démarche est différente des auditions dans leur forme actuelle, où le rapporteur interroge successivement des experts ou des représentants. Ici, on chercherait à rassembler, lors d'un ou plusieurs ateliers, des acteurs de terrain et surtout les faire travailler ENSEMBLE lors des ateliers pour CO-CONSTRUIRE le projet.\n\nCes démarches favorisent l’intelligence collective et permettent de faire émerger des solutions innovantes. De nombreuses méthodes peuvent être utilisées par des facilitateurs externes, qui n’interviennent pas sur le fond du dossier mais posent un cadre qui  permet à chaque participant de mieux comprendre le points de vue des autres, et de converger vers des solutions qui conviennent à tous.\n\nExemple : Pour la rédaction d’une loi sur la réforme de la pédagogie en lycée, organiser des ateliers qui regrouperaient des lycéens, des enseignants, des proviseurs, des experts en pédagogie, des assistants, des concepteurs de manuels scolaires… etc  pour les faire réagir ensemble sur les projets."
}