{
  "author": {
    "avatar": "https://secure.gravatar.com/avatar/476e197bb79d0effddd82a6a808333b1?d=mm",
    "displayName": "Hakim Benbadra",
    "extra": {
      "age": "2",
      "job": "7",
      "postal": "94600"
    },
    "firstName": "Hakim",
    "fullName": "Hakim Benbadra",
    "id": "5a00c54b82abf78a2231d1dd",
    "lastName": "Benbadra"
  },
  "createdAt": "2017-11-06T20:38:30.115Z",
  "flags": [],
  "id": "5a00c84682abf78a2231d230",
  "reference": "59d733cb12406bdd5d6277ea",
  "replies": [],
  "repliesCount": 0,
  "score": 0,
  "text": "Il me semble que la meilleure façon de faire participer les citoyens au processus législatif serait le tirage au sort. Bien que critiqué, c'est le moyen le plus juste pour désigner des personnes. Pas de surenchères électorales, de beaux discours ou autres. Seulement un système de tirage au sort grâce auquel on pourrait désigner un nombre de citoyens qui serait le plus adapté pour s'occuper d'un projet de loi de A à Z sur une thématique donnée. Ce groupe de citoyens travailleraient alors sur un projet précis et pourraient proposer un projet de loi à l'Assemblée nationale et puis participer aux débats sur le texte. \nOn resterait dans le système représentatif avec une dose de tirage au sort, le choix des Dieux comme disaient les Grecs anciens."
}