{
  "author": {
    "avatar": "https://secure.gravatar.com/avatar/317c1061edec86513d41f54d2db9225d?d=mm",
    "displayName": "Elodie Fabre",
    "extra": {
      "age": "3",
      "job": "3",
      "postal": "30310"
    },
    "firstName": "Elodie",
    "fullName": "Elodie Fabre",
    "id": "5a01a0b082abf78a2231d920",
    "lastName": "Fabre"
  },
  "createdAt": "2017-11-07T12:21:18.701Z",
  "flags": [],
  "id": "5a01a53e82abf78a2231d982",
  "reference": "59d7325812406bdd5d6277d4",
  "replies": [],
  "repliesCount": 0,
  "score": 0,
  "text": "Programmes de sensibilisation (exemples du Royaume Uni)\nToutes les législatures britanniques ont des services de sensibilisation et d’éducation dont la mission est d’améliorer la connaissance des citoyen.ne.s sur le travail de leur législature et d’encourager l’engagement citoyen avec cette législature. Le travail des services de sensibilisation (outreach) consiste en particulier à expliquer aux citoyen.ne.s et aux organismes comment influencer le travail de la législature par le biais des consultations écrites. Ils organisent ainsi des sessions d’information sur les consultations parlementaires pour les publics intéressés. D’autre part, ils s’efforcent à engager les publics plus marginalisés, qui ont une connaissance limitée du parlement et de ses modes d’accès, en leur proposant directement des informations sur le parlement et les consultations parlementaires. Si ce travail est difficile, il est important afin de développer la diversité des personnes auditionnées par les commissions et ainsi s’assurer de la diversité des points de vue. \n\nRecommandations :\n-\tDévelopper les services de sensibilisation de l’Assemblée Nationale \n-\tProposer des sessions d’information sur la façon de participer aux consultations parlementaires\n-\tDévelopper des initiatives afin d’améliorer l’engagement citoyen avec l’Assemblée des groupes marginalisés et leur représentants (personnes en difficulté financières, demandeur.se.s d’emploi, minorités, etc.)"
}