{
  "author": {
    "avatar": "https://graph.facebook.com/1962997447286467/picture",
    "displayName": "Serge Lambottin",
    "firstName": "Serge",
    "fullName": "Serge Lambottin",
    "id": "59fed71082abf78a2231909c",
    "lastName": "Lambottin"
  },
  "createdAt": "2017-11-05T09:28:04.495Z",
  "flags": [],
  "id": "59fed9a482abf78a22319183",
  "reference": "59d734d112406bdd5d6277ff",
  "replies": [],
  "repliesCount": 0,
  "score": 0,
  "text": "Bonne idée, afin que soient pris en  considération les désidératas du peuple."
}