{
  "author": {
    "avatar": "https://www.agoravox.fr/local/cache-vignettes/L248xH250/auton3525-88888.jpg",
    "displayName": "s dm",
    "extra": {
      "age": "4",
      "job": "2",
      "postal": "94170"
    },
    "firstName": "s",
    "fullName": "s dm",
    "id": "59db73bf9e1c7be85124dd50",
    "lastName": "dm"
  },
  "createdAt": "2017-10-09T14:14:41.068Z",
  "flags": [],
  "id": "59db84519e1c7be85124de52",
  "reference": "59d733cb12406bdd5d6277ea",
  "replies": [],
  "repliesCount": 0,
  "score": -1,
  "text": "N’hésitez pas à exploiter la consultation réalisée sur ce sujet en novembre dernier par Patrice Martin-Lalande & Luc Belot sur la plateforme Parlement et Citoyens ici : Généraliser les consultations en ligne : https://parlement-et-citoyens.fr/project/generaliser-les-consultations-en-ligne/consultation/consultation-29"
}