{
  "author": {
    "avatar": "https://lh3.googleusercontent.com/-XdUIqdMkCWA/AAAAAAAAAAI/AAAAAAAAAAA/4252rscbv5M/photo.jpg?sz=50",
    "displayName": "Martial HURLISIS",
    "firstName": "Martial",
    "fullName": "Martial HURLISIS",
    "id": "59f8df70e8a9656c1a8e7fff",
    "lastName": "HURLISIS"
  },
  "createdAt": "2017-10-31T21:26:18.634Z",
  "flags": [],
  "id": "59f8ea7ae8a9656c1a8e806c",
  "reference": "59d7347212406bdd5d6277f7",
  "replies": [],
  "repliesCount": 0,
  "score": 0,
  "text": "Les députés doivent aller au devant des concitoyens de leur circonscription pour avoir l'avis du terrain sur les projets de lois mais le calendrier de l'assemblée nationale le permet-il. Il faut imposer cette consultation en amont par l'organisation de réunions publiques avec documents préalablement établis pour centraliser les apports citoyens. Les députés seront en mesure de transmettre les idées consignées dans un document type pour étayer les débats parlementaires."
}