{
  "author": {
    "avatar": "https://graph.facebook.com/1609221445807953/picture",
    "displayName": "Cath Rbn",
    "firstName": "Cath",
    "fullName": "Cath Rbn",
    "id": "59fc22a6ccdac63cb472b8b0",
    "lastName": "Rbn"
  },
  "createdAt": "2017-11-03T10:11:53.659Z",
  "flags": [],
  "id": "59fc40e9ccdac63cb472b911",
  "reference": "59d731a712406bdd5d6277d1",
  "replies": [],
  "repliesCount": 0,
  "score": 0,
  "text": "les citoyens n'ont plus confiance dans les politiques et quoi que l'on dise ou quoi que l'on fasse il y a encore  de la suspicion. Engagée depuis 3 ans comme élue locale, je ressens régulièrement cette défiance qui me navre . Je propose de  travailler sur les compétences que devrait acquérir chaque élu :\nsavoir être : exemplarité, écoute active, empathie, dynamisme\nsavoir :  instruction civique et citoyenne, quelques notions en droit public\nsavoir faire : animer des réunions, construire un discours, monter un projet, manager une équipe, s'exprimer oralement pour être entendu et écouté\netc...\nPar ailleurs, je pense nécessaire d'encourager l'engagement politique des citoyen en  donnant un vrai statut aux élus : des droits à la retraite, la possibilité offerte à  tous de retrouver l'emploi après le mandat, de vivre décemment quand la responsabilité nécessite beaucoup de temps et demande parfois de laisser son emploi..."
}