{
  "author": {
    "avatar": "https://graph.facebook.com/124110604920773/picture",
    "displayName": "Oscar Akakpovi",
    "firstName": "Oscar",
    "fullName": "Oscar Akakpovi",
    "id": "59dcf09d9b28097eb6b4192a",
    "lastName": "Akakpovi"
  },
  "createdAt": "2017-10-10T17:11:54.666Z",
  "flags": [],
  "id": "59dcff5a9b28097eb6b41981",
  "reference": "59d737c712406bdd5d627805",
  "replies": [
    {
      "_id": "59dde98166914e1e82238083",
      "author": {
        "avatar": "https://graph.facebook.com/279360879241144/picture",
        "displayName": "Sophie Aparici",
        "firstName": "Sophie",
        "fullName": "Sophie Aparici",
        "id": "59dc82d29e1c7be85124e25e",
        "lastName": "Aparici"
      },
      "createdAt": "2017-10-11T09:50:57.242Z",
      "text": "Entièrement d'accord."
    }
  ],
  "repliesCount": 1,
  "score": 4,
  "text": "Voilà un outil fort indispensable qui ravivera j'en suis sûr, la passion de la fabrication de la lois et l'intérêt pour la démocratie participative."
}