{
  "author": {
    "avatar": "https://secure.gravatar.com/avatar/dae610ce90a4e95c3c91f3df960190d7?d=mm",
    "displayName": "Suzanne Marion",
    "extra": {
      "age": "4",
      "job": "8",
      "postal": "34080"
    },
    "firstName": "Suzanne",
    "fullName": "Suzanne Marion",
    "id": "59ff1c0a82abf78a2231a2cf",
    "lastName": "Marion"
  },
  "createdAt": "2017-11-05T14:16:49.286Z",
  "flags": [],
  "id": "59ff1d5182abf78a2231a31c",
  "reference": "59d734d112406bdd5d6277ff",
  "replies": [],
  "repliesCount": 0,
  "score": 0,
  "text": "Bravo pour cette décision démocratique qui donne aux Français et à leurs élus les moyen de communiquer par le biais des technologies de notre ère !"
}