{
  "author": {
    "avatar": "https://graph.facebook.com/1840498672644737/picture",
    "displayName": "Joan-Loís Escafit",
    "firstName": "Joan-Loís",
    "fullName": "Joan-Loís Escafit",
    "id": "59fe3a6682abf78a22317c82",
    "lastName": "Escafit"
  },
  "createdAt": "2017-11-04T22:25:57.737Z",
  "flags": [],
  "id": "59fe3e7582abf78a22317d86",
  "reference": "59d734d112406bdd5d6277ff",
  "replies": [],
  "repliesCount": 0,
  "score": 3,
  "text": "Ce n'est pas seulement lorsqu’elles apportent un point de vue différent de celui des organisations syndicales, patronales ou des associations que les pétitions doivent être considérées comme recevables car les pétitions initiées ou soutenues par ces structures ou des pétitions convergentes sont un moyen d'évaluer les implications de soutien mais aussi des compléments d'argumentation.\nDans tous les cas, la recevabilité des pétitions en ligne suppose que leur système de collecte de signature soit sécurisé notamment par un système de confirmation évitant qu'une signature soit décomptée à l'insu du détenteur de l'adresse électronique donnée ou , autant que possible, qu'un même internaute signe sous plusieurs noms et adresses."
}