{
  "author": {
    "avatar": "https://lh3.googleusercontent.com/-XdUIqdMkCWA/AAAAAAAAAAI/AAAAAAAAAAA/4252rscbv5M/photo.jpg?sz=50",
    "displayName": "Nicolas Beauvais",
    "extra": {
      "age": "2",
      "job": "8",
      "postal": "35000"
    },
    "firstName": "Nicolas",
    "fullName": "Nicolas Beauvais",
    "id": "59e779d966914e1e82238f59",
    "lastName": "Beauvais"
  },
  "createdAt": "2017-10-19T09:12:28.558Z",
  "editedAt": "2017-10-19T09:15:21.633Z",
  "flags": [],
  "id": "59e86c7c66914e1e82239063",
  "reference": "59d7347212406bdd5d6277f7",
  "replies": [],
  "repliesCount": 0,
  "score": -1,
  "text": "PREALABLE à l'interaction du citoyen dans une loi :\n\nUne procédure claire devrait être appliquée, au sens qu'avant de pouvoir faire une proposition, le citoyen a l'obligation de prendre connaissance des tenants et aboutissant de cette loi.\nEn aval un comité d'experts universitaires indépendants doit faire une synthèse des enjeux que peuvent avoir les modifications de la législation actuelle, en s'appuyant sur des données fiables et chiffrées.\nLe citoyen doit lire cette synthèse et peut faire une proposition argumentée de son point de vue, qui peut aller dans un des sens de cette synthèse ou différée si elle est construite avec des exemples concrets, remettant en cause un ou plusieurs points de la synthèse.\nAvec pour objectif final de concilier l’intérêt général avec l’intérêt individuel."
}