{
  "author": {
    "avatar": "https://secure.gravatar.com/avatar/a25a922166bf82b8cf2037cca0ddb922?d=mm",
    "displayName": "Jean-Christophe BOINE",
    "extra": {
      "age": "4",
      "job": "8",
      "postal": "40000"
    },
    "firstName": "Jean-Christophe",
    "fullName": "Jean-Christophe BOINE",
    "id": "59fdedab82abf78a22314da6",
    "lastName": "BOINE"
  },
  "createdAt": "2017-11-04T16:45:00.808Z",
  "flags": [],
  "id": "59fdee8c82abf78a22314e82",
  "reference": "59d731a712406bdd5d6277d1",
  "replies": [],
  "repliesCount": 0,
  "score": 0,
  "text": "Faire passer en France un vote pour le maintien ou non du Sénat en précisant son utilité réelle."
}