{
  "author": {
    "avatar": "https://secure.gravatar.com/avatar/1cb249e799674716f9acbff585870e64?d=mm",
    "displayName": "Sébastien Vanzieleghem",
    "extra": {
      "age": "3",
      "job": "2",
      "postal": "76116"
    },
    "firstName": "Sébastien",
    "fullName": "Sébastien Vanzieleghem",
    "id": "59dbe2129e1c7be85124e098",
    "lastName": "Vanzieleghem"
  },
  "createdAt": "2017-10-11T12:45:51.317Z",
  "flags": [],
  "id": "59de127f66914e1e8223810b",
  "reference": "59d731a712406bdd5d6277d1",
  "replies": [],
  "repliesCount": 0,
  "score": -1,
  "text": "Combattre la sondocratie : interdire les sondages dans les jours précédant les élections et adopter la proposition de loi sur les sondages votée à l'unanimité par le Sénat en 2011 et enterrée depuis"
}