{
  "author": {
    "avatar": "https://graph.facebook.com/230523610816026/picture",
    "displayName": "Alexis Rey",
    "firstName": "Alexis",
    "fullName": "Alexis Rey",
    "id": "59ff6f3882abf78a2231b50e",
    "lastName": "Rey"
  },
  "createdAt": "2017-11-05T20:34:57.240Z",
  "flags": [],
  "id": "59ff75f182abf78a2231b5e5",
  "reference": "59d731a712406bdd5d6277d1",
  "replies": [],
  "repliesCount": 0,
  "score": 1,
  "text": "Il faut rendre la présence des parlementaires obligatoires. Il faut aussi rendre la création d'un compte rendu officiel et annuel du travail du député OBLIGATOIRE !!!!"
}