{
  "author": {
    "avatar": "https://secure.gravatar.com/avatar/f479d022fc99145c3c3136ed77bebce4?d=mm",
    "displayName": "martine ribiere",
    "extra": {
      "age": "4",
      "job": "4",
      "postal": "75002"
    },
    "firstName": "martine",
    "fullName": "martine ribiere",
    "id": "59fe96d782abf78a22318401",
    "lastName": "ribiere"
  },
  "createdAt": "2017-11-05T15:31:38.975Z",
  "flags": [],
  "id": "59ff2eda82abf78a2231a661",
  "reference": "59d731a712406bdd5d6277d1",
  "replies": [],
  "repliesCount": 0,
  "score": 0,
  "text": "La question des algorithmes de la démocratie numérique - quelle que soit sa forme - me semble essentielle. Un thème capital et concret, qui doit être étudié."
}