{
  "author": {
    "avatar": "https://secure.gravatar.com/avatar/bfe66e2808f3c93f30b243753d24e241?d=mm",
    "displayName": "Pierre Neimault",
    "extra": {
      "age": "5",
      "job": "6",
      "postal": "75013"
    },
    "firstName": "Pierre",
    "fullName": "Pierre Neimault",
    "id": "59f0a9a1896da05921863a9f",
    "lastName": "Neimault"
  },
  "createdAt": "2017-11-04T18:50:08.918Z",
  "flags": [],
  "id": "59fe0be082abf78a223169bb",
  "reference": "59d734d112406bdd5d6277ff",
  "replies": [],
  "repliesCount": 0,
  "score": 0,
  "text": "Rousseau a montré il y a 245 ans que la démocratie exigeait que les lois soient conformes à la volonté générale.\n\nInternet permet enfin d'exprimer cette volonté.\n\nIl suffit de réfléchir un peu pour le comprendre et d'avoir quelques connaissances de base en informatique pour réaliser un outil adéquat. \n\nPar contre, les pétitions n'expriment pas la volonté générale, mais une opinion moyenne. \n\nIl faut donc reconstruire les outils informatiques mis en place par l'Assemblée Nationale, dont celui-ci, pour accéder enfin à la démocratie."
}