{
  "author": {
    "avatar": "https://secure.gravatar.com/avatar/946b756c355e3bab990f0c7ad002179c?d=mm",
    "displayName": "Atelier citoyen contributif   ",
    "extra": {
      "age": "",
      "job": "",
      "postal": ""
    },
    "firstName": "Atelier citoyen contributif",
    "fullName": "Atelier citoyen contributif   ",
    "id": "59fb62e9ccdac63cb472b723",
    "lastName": "  "
  },
  "createdAt": "2017-11-03T16:03:44.020Z",
  "flags": [],
  "id": "59fc9360ccdac63cb472bace",
  "reference": "59d733cb12406bdd5d6277ea",
  "replies": [],
  "repliesCount": 0,
  "score": 0,
  "text": "La création d'un vrai droit à l'information sur le travail réalisé en commission et en hémicycle : \n- Il faudrait rendre public les votes des députés ; la conséquence est la mise en place d'une possibilité de participer à distance aux débats, les députés n'ayant pas la possibilité d'être en permanence en hémicycle. \n- Il faudrait créer une plateforme numérique permettant un accès total aux informations de l'Assemblée nationale. La plateforme devra être lisible et accessible : aujourd'hui difficulté à trouver les amendements, suivre les débats en hémicycle. La possibilité d'avoir une newsletter du travail réalisé au sein de l'Assemblée en fonction de sujets qui intéressent le citoyen constituerait aussi un pas vers cette ouverture. \n- Il faudrait rendre obligatoire dans les missions dévolues aux députés celle d'expliquer leur travail. Ainsi un certain nombre de documents serait rendu public car deviendrait transmissible aux citoyens. \n- Lors du travail en commission, les députés ont eux-aussi besoin d'un meilleur droit à l'information. Les auditions sont des monologues, il conviendrait d'organiser des débats contradictoires afin d'avoir dans une audition les tenants et aboutissants de la question et que la position du député soit plus éclairée."
}