{
  "author": {
    "avatar": "https://media-exp1.licdn.com/mpr/mpr/shrinknp_400_400/p/3/005/087/367/0355cf2.jpg",
    "displayName": "Xavier Charpentier",
    "extra": {
      "age": "4",
      "job": "2",
      "postal": "78100"
    },
    "firstName": "Xavier",
    "fullName": "Xavier Charpentier",
    "id": "59e97f5766914e1e822391a0",
    "lastName": "Charpentier"
  },
  "createdAt": "2017-11-06T22:14:46.205Z",
  "flags": [],
  "id": "5a00ded682abf78a2231d423",
  "reference": "59d7335412406bdd5d6277e4",
  "replies": [],
  "repliesCount": 0,
  "score": 0,
  "text": "Proposer, débattre, amender, constitue le cœur de notre démocratie parlementaire. Cependant, malgré un effort certain ces dernières années, [l'application des lois](https://www.senat.fr/notice-rapport/2016/r16-677-notice.html) reste en deçà de l'énergie que nos parlementaires y mettent et frustre l'attente des citoyens quant l'efficacité de ses représentants. \n\nEst-il raisonnable qu'il faille plus de 6 mois en moyenne entre le vote d'une loi et sa mise en application ? La confiance votée à l'exécutif qui, d'après le [rapport du Sénat](https://www.senat.fr/rap/r16-677/r16-6771.pdf), omet de fournir 40% des rapports demandés par le Parlement ne doit elle pas être remise en cause sur ce critère ? \n\nPour renouer avec la confiance entre les citoyens et les gouvernants au sens large, il semble impératif d'être exemplaire sur l'applicabilité de la loi votée par les représentants du peuple."
}