{
  "author": {
    "avatar": "https://secure.gravatar.com/avatar/e0a80a28ba6b963cc6e63a6e8388bc4e?d=mm",
    "displayName": "VERONE DELMOTTE",
    "extra": {
      "age": "4",
      "job": "7",
      "postal": "92800"
    },
    "firstName": "VERONE",
    "fullName": "VERONE DELMOTTE",
    "id": "59f9a621e8a9656c1a8e824c",
    "lastName": "DELMOTTE"
  },
  "createdAt": "2017-11-01T11:23:46.590Z",
  "flags": [],
  "id": "59f9aec2e8a9656c1a8e828c",
  "reference": "59d7347212406bdd5d6277f7",
  "replies": [],
  "repliesCount": 0,
  "score": 1,
  "text": "REGAGNER LA CONFIANCE DES CITOYENS / ELARGIR LES PROFILS PARTICIPANT\nPour envisager une participation active d'une base élargie et diversifiée des citoyens, il s'agit de leur redonner confiance envers les politiques et d'oeuvrer à la diminution de la fracture sociale et numérique. Lourde tâche ! En complément des commentaires de Mathieu Roy et Sophie Iza que je partage, commençons par éduquer nos enfants à l'art de l'échange bienveillant. Ensuite, impliquons davantage les citoyens sur des sujets locaux touchant à leur quotidien au travers de conseils citoyens de quartier à intensifier. Peu sont véritablement au fait pour prendre position, pire, à voter, sur des projets de loi..."
}