<?xml version="1.0" encoding="UTF-8" standalone="no"?>
<!-- Created with Inkscape (http://www.inkscape.org/) -->

<svg
   xmlns:dc="http://purl.org/dc/elements/1.1/"
   xmlns:cc="http://creativecommons.org/ns#"
   xmlns:rdf="http://www.w3.org/1999/02/22-rdf-syntax-ns#"
   xmlns:svg="http://www.w3.org/2000/svg"
   xmlns="http://www.w3.org/2000/svg"
   xmlns:sodipodi="http://sodipodi.sourceforge.net/DTD/sodipodi-0.dtd"
   xmlns:inkscape="http://www.inkscape.org/namespaces/inkscape"
   id="svg2"
   version="1.1"
   inkscape:version="0.48.5 r10040"
   width="512"
   height="512"
   sodipodi:docname="amsn.svg">
  <metadata
     id="metadata8">
    <rdf:RDF>
      <cc:Work
         rdf:about="">
        <dc:format>image/svg+xml</dc:format>
        <dc:type
           rdf:resource="http://purl.org/dc/dcmitype/StillImage" />
        <dc:title />
      </cc:Work>
    </rdf:RDF>
  </metadata>
  <defs
     id="defs6" />
  <sodipodi:namedview
     pagecolor="#ffffff"
     bordercolor="#666666"
     borderopacity="1"
     objecttolerance="10"
     gridtolerance="10"
     guidetolerance="10"
     inkscape:pageopacity="0"
     inkscape:pageshadow="2"
     inkscape:window-width="1313"
     inkscape:window-height="700"
     id="namedview4"
     showgrid="false"
     inkscape:zoom="0.65186405"
     inkscape:cx="-5.0770046"
     inkscape:cy="380.60457"
     inkscape:window-x="15"
     inkscape:window-y="39"
     inkscape:window-maximized="0"
     inkscape:current-layer="svg2" />
  <path
     inkscape:connector-curvature="0"
     id="path2995"
     d="m 38.574835,439.78392 c -3.31444,-4.69126 -8.83461,-16.37505 -11.48528,-24.30935 -4.55082,-13.62205 -5.23917,-18.55066 -5.16753,-37 0.0607,-15.63216 0.34962,-18.54996 2.70697,-27.33721 8.5821,-31.99054 29.84378,-58.44348 60.209985,-74.91083 12.18661,-6.6087 12.65687,-7.75989 5.58765,-13.67857 -9.95798,-8.3373 -19.104745,-21.8931 -23.508295,-34.84005 -13.32649,-39.18151 4.62581,-81.92856 41.691085,-99.27256 21.01665,-9.83434 47.44247,-9.83434 68.45912,0 37.0876,17.35445 55.18107,60.5286 41.67758,99.44993 -4.49054,12.94315 -12.86044,25.41166 -22.97121,34.21984 -5.03551,4.38678 -5.58487,5.22263 -4.61888,7.0276 0.60301,1.12674 4.37837,3.76453 8.38967,5.86175 4.0113,2.09722 8.97184,4.8632 11.02341,6.14662 2.05157,1.28341 4.30157,2.31294 5,2.28784 0.69843,-0.0251 3.51987,-3.03968 6.26987,-6.69905 11.42714,-15.20589 30.8233,-31.3764 49,-40.85113 9.89015,-5.15531 13.51125,-7.93015 13.47845,-10.32849 -0.0118,-0.86663 -2.94226,-3.94645 -6.51202,-6.84405 -13.65263,-11.08191 -26.94953,-32.08236 -31.48869,-49.73164 -14.48021,-56.30238 19.80818,-112.021554 76.33764,-124.049826 4.07829,-0.86778 12.36009,-1.45017 20.62177,-1.45017 11.42833,0 15.50787,0.43077 23.68463,2.50093 17.86657,4.5234 33.37665,13.345502 46.45422,26.423072 12.62258,12.62258 21.36543,27.719864 26.10355,45.075994 2.03,7.43607 3.9404,9.33451 3.89027,24.64407 -0.0527,16.10543 -1.90205,19.57313 -4.4153,27.85593 -5.76377,18.99538 -17.55338,37.55822 -30.60438,48.18686 -3.25056,2.64723 -6.17933,5.4456 -6.50839,6.2186 -1.00023,2.34966 3.36326,5.9 14.21901,11.56927 37.47719,19.57194 65.18366,54.34388 74.75982,93.82441 8.14825,33.59356 4.58967,66.16683 -10.61903,97.20086 -2.69536,5.5 -5.68836,10.96348 -6.6511,12.14107 l -1.75045,2.14108 -215.63964,0.66828 -215.639655,0.66828 z"
     style="fill:#357cee"
     sodipodi:nodetypes="ssssssssssssssssscssssssssssssssscccs" />
  <path
     style="fill:#2960b6"
     d="m 471.36301,433.56657 c -0.11772,-42.44388 -8.51824,-92.85827 -21.49235,-128.98293 -8.52303,-23.73123 -23.5145,-51.61358 -36.15823,-67.25 -3.65711,-4.52273 -1.47037,-4.18867 8.03325,1.22721 59.93461,34.15521 87.72676,106.0352 65.93205,170.52279 -2.87132,8.49583 -11.33594,26.23607 -14.31428,30 l -1.97821,2.5 -0.0222,-8.01707 z"
     id="path3015"
     inkscape:connector-curvature="0" />
  <path
     style="fill:#2960b6"
     d="m 329.81617,256.75467 c -16.20756,-2.00954 -34.34614,-9.12463 -46.98987,-18.43242 l -6.34914,-4.67397 3.3641,-2.87743 c 1.85025,-1.58259 3.90248,-2.89573 4.56051,-2.91808 0.65804,-0.0223 3.83103,1.50346 7.05109,3.39068 15.67729,9.18821 30.98002,13.08097 51.25249,13.0378 20.2498,-0.0431 33.51022,-3.60762 51.25831,-13.77858 l 6.75831,-3.87301 3.41949,2.84124 c 1.88072,1.56267 3.45198,3.16701 3.49169,3.56518 0.0988,0.99101 -13.39125,10.42846 -18.9278,13.2416 -6.4765,3.29073 -18.43468,7.44402 -25.98443,9.02487 -8.99378,1.8832 -24.06396,2.54827 -32.90475,1.45212 z"
     id="path2993"
     inkscape:connector-curvature="0" />
  <path
     inkscape:connector-curvature="0"
     id="path2991"
     d="m 37.76994,439.71155 c -3.314051,-4.66024 -8.906899,-16.43366 -11.574293,-24.36485 -4.603025,-13.68656 -5.299272,-18.63851 -5.22681,-37.17521 0.06141,-15.70619 0.353635,-18.63782 2.738015,-27.46667 8.680561,-32.14205 30.186145,-58.72026 60.900718,-75.2656 12.326414,-6.63999 12.80207,-7.79663 5.651752,-13.74334 C 80.187104,253.3191 70.935407,239.6991 66.481334,226.69084 53.001963,187.32378 71.160225,144.37429 108.6507,126.94815 c 21.25775,-9.88091 47.98674,-9.88091 69.24449,0 37.51306,17.43664 55.8141,60.81525 42.1557,99.9209 -4.54206,13.00444 -13.00797,25.532 -23.23473,34.38189 -7.38055,6.38689 -6.98769,7.24262 6.65489,14.49551 5.64298,3.00001 10.70903,5.99205 11.25788,6.64896 0.69331,0.82983 -0.44466,3.67872 -3.7283,9.33367 -13.30453,22.91251 -19.0924,44.70107 -19.0924,71.87374 0,26.5781 6.07741,49.87886 18.53121,71.04856 2.16435,3.67909 3.67834,6.94438 3.36442,7.25623 -0.31392,0.31183 -39.60788,0.56696 -87.3199,0.56696 l -86.749144,0 -1.964876,-2.76302 z"
     style="fill:#50b328" />
  <path
     inkscape:connector-curvature="0"
     id="path2989"
     d="m 34.833266,434.66566 c -3.69417,-5.69515 -8.493178,-17.62399 -11.603254,-28.84197 -1.564953,-5.64476 -3.520449,-16.33475 -3.518924,-27.43231 0.0014,-10.1786 1.832797,-20.7919 3.206416,-26.21204 5.693115,-22.46436 15.098119,-38.95631 31.805485,-55.77178 8.94511,-9.00299 26.758935,-22.11909 30.041395,-22.11909 0.679512,0 -2.153422,5.0246 -6.295408,11.16575 -14.490048,21.48389 -26.431119,51.6753 -32.591911,82.40445 -3.816614,19.03672 -5.08361,29.21434 -6.592254,52.95497 l -1.198902,18.86648 z m 158.370494,-39.5789 c 0.0485,-1.17843 0.28766,-1.41812 0.60993,-0.61116 0.29162,0.73022 0.25577,1.60271 -0.0796,1.93885 -0.33547,0.33612 -0.57407,-0.26133 -0.53024,-1.32769 z m -1.00956,-5.05785 c 0.0485,-1.17843 0.28766,-1.41812 0.60993,-0.61116 0.29163,0.73022 0.25578,1.60271 -0.0796,1.93885 -0.33547,0.33613 -0.57407,-0.26133 -0.53023,-1.32769 z m -1.00955,-6.06942 c 0.0485,-1.17843 0.28766,-1.41812 0.60993,-0.61116 0.29162,0.73022 0.25577,1.60271 -0.0796,1.93885 -0.33548,0.33614 -0.57407,-0.26133 -0.53024,-1.32769 z m -0.92987,-8.51404 c 0,-1.39092 0.22915,-1.95993 0.50921,-1.26446 0.28006,0.69545 0.28006,1.83346 0,2.52892 -0.28006,0.69546 -0.50921,0.12645 -0.50921,-1.26446 z m 0.0375,-25.79503 c 0.0206,-1.66909 0.24684,-2.22944 0.50279,-1.24522 0.25597,0.98423 0.23914,2.34985 -0.0375,3.03472 -0.27655,0.68485 -0.48597,-0.12041 -0.4654,-1.7895 z m 0.89245,-8.17686 c 0.0485,-1.17843 0.28766,-1.41811 0.60993,-0.61116 0.29162,0.73023 0.25577,1.60272 -0.0796,1.93885 -0.33547,0.33613 -0.57407,-0.26132 -0.53024,-1.32769 z m 1.00955,-6.06942 c 0.0485,-1.17841 0.28766,-1.41811 0.60993,-0.61116 0.29163,0.73023 0.25578,1.60272 -0.0796,1.93885 -0.33547,0.33614 -0.57407,-0.26132 -0.53023,-1.32769 z m -62.16744,-44.86186 c -7.23173,-1.19045 -13.25636,-2.93602 -20.19112,-5.85013 -6.65762,-2.79766 -19.686333,-10.88251 -19.686333,-12.21617 0,-0.46296 1.308243,-1.8109 2.907208,-2.99542 l 2.907198,-2.15367 8.955087,4.51489 c 12.88582,6.49668 22.39241,8.72503 37.22264,8.72503 14.88983,0 24.29294,-2.22217 37.53592,-8.87061 l 9.26835,-4.65305 3.05907,2.26618 c 1.68249,1.24639 2.82657,2.6431 2.54241,3.10379 -2.25549,3.65673 -20.42406,13.10967 -30.75429,16.00116 -8.40998,2.35401 -25.75345,3.44703 -33.76614,2.128 z m 74.48328,-8.40023 c -2.8994,-4.31947 -4.77604,-7.85358 -4.17028,-7.85358 0.83327,0 11.57499,5.96917 13.83123,7.68601 0.19311,0.14694 -0.7155,2.0118 -2.01911,4.14415 l -2.3702,3.87701 z"
     style="fill:#3d8a1f"
     sodipodi:nodetypes="ssssssssscscsccccsccccscccsssscsccccsccccscccsssscssscsssssssscs" />
  <path
     style="fill:#2960b6"
     d="m 212.76234,433.87244 c 0.11772,-42.44388 8.51824,-92.85827 21.49235,-128.98293 8.52303,-23.73123 23.5145,-51.61358 36.15823,-67.24999 3.65711,-4.52273 1.47037,-4.18867 -8.03325,1.22721 -59.93461,34.1552 -87.72676,106.03519 -65.93205,170.52278 2.87132,8.49583 11.33594,26.23607 14.31428,30 l 1.97821,2.5 0.0222,-8.01707 z"
     id="path3015-0"
     inkscape:connector-curvature="0" />
</svg>
