<?xml version="1.0" encoding="UTF-8" standalone="no"?>
<svg
   xmlns:dc="http://purl.org/dc/elements/1.1/"
   xmlns:cc="http://creativecommons.org/ns#"
   xmlns:rdf="http://www.w3.org/1999/02/22-rdf-syntax-ns#"
   xmlns:svg="http://www.w3.org/2000/svg"
   xmlns="http://www.w3.org/2000/svg"
   xmlns:sodipodi="http://sodipodi.sourceforge.net/DTD/sodipodi-0.dtd"
   xmlns:inkscape="http://www.inkscape.org/namespaces/inkscape"
   viewBox="0 0 128 128"
   id="svg2"
   version="1.1"
   inkscape:version="0.48.5 r10040"
   width="100%"
   height="100%"
   sodipodi:docname="grub-customizer.svg">
  <metadata
     id="metadata126">
    <rdf:RDF>
      <cc:Work
         rdf:about="">
        <dc:format>image/svg+xml</dc:format>
        <dc:type
           rdf:resource="http://purl.org/dc/dcmitype/StillImage" />
        <dc:title />
      </cc:Work>
    </rdf:RDF>
  </metadata>
  <sodipodi:namedview
     pagecolor="#ffffff"
     bordercolor="#666666"
     borderopacity="1"
     objecttolerance="10"
     gridtolerance="10"
     guidetolerance="10"
     inkscape:pageopacity="0"
     inkscape:pageshadow="2"
     inkscape:window-width="1366"
     inkscape:window-height="744"
     id="namedview124"
     showgrid="false"
     inkscape:zoom="3.1979167"
     inkscape:cx="63.262539"
     inkscape:cy="83.990522"
     inkscape:window-x="0"
     inkscape:window-y="24"
     inkscape:window-maximized="1"
     inkscape:current-layer="svg2">
    <inkscape:grid
       type="xygrid"
       id="grid3103"
       empspacing="5"
       visible="true"
       enabled="true"
       snapvisiblegridlinesonly="true" />
  </sodipodi:namedview>
  <defs
     id="defs4">
    <linearGradient
       id="linearGradient3764"
       x1="1"
       x2="47"
       gradientUnits="userSpaceOnUse"
       gradientTransform="matrix(0,-1,1,0,-1.5e-6,47.999998)">
      <stop
         stop-color="#e4e4e4"
         stop-opacity="1"
         id="stop7" />
      <stop
         offset="1"
         stop-color="#eee"
         stop-opacity="1"
         id="stop9" />
    </linearGradient>
    <clipPath
       id="clipPath-417599645">
      <g
         transform="translate(0,-1004.3622)"
         id="g17">
        <path
           d="m -24,13 c 0,1.105 -0.672,2 -1.5,2 -0.828,0 -1.5,-0.895 -1.5,-2 0,-1.105 0.672,-2 1.5,-2 0.828,0 1.5,0.895 1.5,2 z"
           transform="matrix(15.333333,0,0,11.5,414.99999,878.8622)"
           id="path19"
           inkscape:connector-curvature="0"
           style="fill:#1890d0" />
      </g>
    </clipPath>
  </defs>
  <g
     id="g33"
     transform="translate(0,80)" />
  <g
     id="g81"
     transform="matrix(5.3409719,0,0,5.3409719,-69.153579,-61.059397)">
    <g
       clip-path="url(#clipPath-417599645)"
       id="g83">
      <!-- color: #eeeeee -->
      <g
         id="g85">
        <path
           d="m 33.04,27.34 c -0.316,1.219 -1.91,3.762 -2.762,4.883 -0.848,1.125 -0.746,2.137 -2.313,1.742 -1.563,-0.391 -2,-0.32 -3.621,-0.234 -1.602,0.09 -1.258,-0.043 -2.262,0.383 -1,0.422 -4.363,-5.16 -4.637,-6.203 -0.266,-1.039 -0.395,-0.914 0.305,-2.035 0.691,-1.125 0.797,-2.238 1.715,-3.598 0.918,-1.367 1.984,-2.063 1.906,-3.105 -0.305,-3.871 -0.539,-5.809 1.293,-6.703 1.742,-0.852 3.203,-0.344 3.777,-0.055 0.25,0.125 0.758,0.371 1.133,0.797 0.375,0.418 0.715,1.047 0.906,1.844 0.391,1.598 -0.164,1.07 0.281,2.902 0.438,1.828 1.328,2.727 2.414,4.172 1.09,1.445 2.223,3.832 1.863,5.211 m 0,0"
           id="SVGCleanerId_0"
           inkscape:connector-curvature="0"
           style="fill:#000000;fill-opacity:1;fill-rule:nonzero;stroke:none" />
        <path
           d="m 22.695,17.859 c 0.285,-0.105 0.238,-0.121 0.43,-0.512 0.152,-0.301 0.285,-0.43 0.281,-0.887 0,-0.445 -0.148,-0.598 -0.371,-0.891 -0.215,-0.277 -0.555,-0.293 -0.773,-0.258 -0.125,0.02 -0.285,0.168 -0.395,0.387 -0.074,0.148 -0.129,0.336 -0.137,0.531 -0.012,0.531 0.031,0.73 0.164,1.09 0.152,0.422 0.523,0.641 0.801,0.539 m 0,0"
           id="path88"
           inkscape:connector-curvature="0"
           style="fill:#f9f9f9;fill-opacity:1;fill-rule:nonzero;stroke:none" />
        <path
           d="m 22.43,16.03 c 0.141,0 0.32,0.086 0.41,0.207 0.094,0.121 0.156,0.293 0.156,0.488 0,0.285 -0.031,0.602 -0.215,0.699 -0.059,0.023 -0.184,0.059 -0.254,0.059 -0.16,0 -0.176,-0.102 -0.328,-0.25 -0.055,-0.051 -0.211,-0.313 -0.211,-0.527 0,-0.133 -0.031,-0.324 0.094,-0.496 0.086,-0.125 0.195,-0.184 0.348,-0.184 m 0,0.004"
           id="SVGCleanerId_1"
           inkscape:connector-curvature="0"
           style="fill:#000000;fill-opacity:1;fill-rule:nonzero;stroke:none" />
        <path
           d="m 25.652,17.895 c 0.719,-0.07 0.969,-0.332 1.098,-0.785 0.113,-0.402 0.117,-0.848 -0.199,-1.375 -0.301,-0.5 -0.473,-0.578 -0.906,-0.613 -0.668,-0.051 -0.984,0.387 -1.133,0.699 -0.156,0.34 -0.125,0.293 -0.113,0.723 0.012,0.453 0.281,0.578 0.445,0.863 0.168,0.273 0.727,0.496 0.805,0.492 m 0.004,-0.004"
           id="path91"
           inkscape:connector-curvature="0"
           style="fill:#f9f9f9;fill-opacity:1;fill-rule:nonzero;stroke:none" />
        <path
           d="m 25.594,16.01 c 0.359,0 0.566,0.301 0.637,0.684 0.027,0.176 -0.012,0.375 -0.125,0.516 -0.129,0.164 -0.359,0.258 -0.543,0.258 -0.18,0 -0.375,0.027 -0.484,-0.105 -0.105,-0.141 -0.125,-0.445 -0.125,-0.668 0,-0.246 0.078,-0.422 0.207,-0.559 0.102,-0.102 0.281,-0.125 0.434,-0.125 m 0,0"
           id="SVGCleanerId_2"
           inkscape:connector-curvature="0"
           style="fill:#000000;fill-opacity:1;fill-rule:nonzero;stroke:none" />
        <path
           d="m 25.672,16.223 c 0.039,-0.035 0.121,0 0.207,0.09 0.098,0.102 0.102,0.18 0.023,0.234 -0.07,0.059 -0.105,-0.086 -0.152,-0.137 -0.086,-0.082 -0.156,-0.121 -0.082,-0.188 m 0.004,0"
           id="path94"
           inkscape:connector-curvature="0"
           style="fill:#676767;fill-opacity:1;fill-rule:nonzero;stroke:none" />
        <path
           d="m 22.465,16.34 c 0.043,-0.063 0.207,-0.035 0.27,0.09 0.059,0.125 0.051,0.398 0.008,0.41 -0.109,0.035 -0.074,-0.117 -0.172,-0.25 -0.094,-0.129 -0.148,-0.188 -0.105,-0.25 m 0,0"
           id="path96"
           inkscape:connector-curvature="0"
           style="fill:#676767;fill-opacity:1;fill-rule:nonzero;stroke:none" />
        <path
           d="m 23.875,16.445 c 0.086,-0.023 0.168,-0.02 0.313,0.055 0.129,0.07 0.07,0.152 -0.07,0.121 -0.133,-0.027 -0.105,-0.023 -0.207,-0.043 -0.172,-0.027 -0.199,-0.094 -0.035,-0.133 m 0,0"
           id="path98"
           inkscape:connector-curvature="0"
           style="fill:#676767;fill-opacity:1;fill-rule:nonzero;stroke:none" />
        <path
           d="M 23.461,19.977 C 22.84,20 21.859,18.368 21.832,19.047 c -0.016,0.574 0.016,0.563 0.016,1.117 0,0.371 -0.18,0.402 -0.57,0.961 -0.203,0.293 -0.359,0.613 -0.48,0.938 -0.078,0.191 -0.148,0.391 -0.207,0.59 -0.023,0.098 -0.066,0.203 -0.094,0.301 -0.191,0.676 -0.891,1.512 -1.051,2.188 -0.164,0.672 -0.355,1.102 -0.328,2 0.023,0.902 0.031,0.641 0.32,0.867 0.289,0.223 0.582,0.434 1.035,0.809 0.48,0.398 1.469,1.07 1.602,1.285 0.141,0.215 0.141,0.695 0.055,0.852 -0.086,0.152 -0.832,0.238 -0.832,0.238 0,0 0.652,0.855 0.785,0.973 0.125,0.117 0.66,0.684 2.832,0.301 1.227,-0.223 2.172,-0.863 2.859,-1.48 0.887,-0.816 0.438,-1.047 0.551,-1.453 0.168,-0.59 0.711,-0.809 0.832,-1.473 0.016,-0.094 0.047,-0.164 0.141,-0.313 0.137,-0.188 0.105,-0.586 0.105,-0.938 0,-0.938 -0.113,-1.879 -0.344,-2.578 -0.211,-0.656 -0.543,-1.113 -0.828,-1.703 -0.57,-1.176 -0.543,-1.707 -1.055,-2.457 -0.578,-0.867 -0.293,-1.445 -1.066,-1.41 -0.961,0.051 -1.738,1.289 -2.648,1.324 m 0,0"
           id="path100"
           inkscape:connector-curvature="0"
           style="fill:#f9f9f9;fill-opacity:1;fill-rule:nonzero;stroke:none" />
        <path
           d="m 23.789,16.906 c 0.348,-0.039 0.828,0.039 1.047,0.191 0.203,0.141 0.348,0.219 0.535,0.273 0.621,0.191 1.445,0.285 1.406,0.813 -0.043,0.633 -0.238,0.914 -0.797,1.082 -0.449,0.129 -1.25,0.859 -1.867,0.859 -0.277,0 -0.664,0.016 -0.887,-0.063 -0.215,-0.07 -0.516,-0.41 -0.867,-0.684 -0.355,-0.273 -0.68,-0.566 -0.691,-0.941 -0.016,-0.395 0.262,-0.527 0.652,-0.848 0.203,-0.168 0.578,-0.453 0.832,-0.574 0.238,-0.113 0.391,-0.09 0.637,-0.117 m 0,0"
           id="path102"
           inkscape:connector-curvature="0"
           style="fill:#ffcf33;fill-opacity:1;fill-rule:nonzero;stroke:none" />
        <path
           d="m 22.988,17.371 c -0.02,0.047 0.129,0.145 0.207,0.078 0.082,-0.066 0.176,-0.125 0.207,-0.145 0.145,-0.09 0.094,-0.156 -0.152,-0.117 -0.238,0.039 -0.238,0.133 -0.266,0.184 m 0.004,0"
           id="path104"
           inkscape:connector-curvature="0"
           style="fill:#995900;fill-opacity:1;fill-rule:nonzero;stroke:none" />
        <path
           d="m 32.969,28.332 c 0.297,0.402 -0.008,0.93 0.207,1.25 0.355,0.527 1.063,1.063 1.336,1.211 0.195,0.113 0.473,0.219 0.461,0.543 -0.016,0.375 -0.211,0.473 -0.32,0.574 -0.219,0.207 -1.324,0.723 -2.059,1.191 -0.922,0.594 -1.242,0.859 -1.543,1.141 -0.469,0.441 -0.91,0.59 -1.621,0.59 -0.707,0 -1.031,-0.141 -1.246,-0.324 -0.219,-0.18 -0.465,-0.637 -0.441,-1.316 0.02,-0.68 0.25,-1.293 0.359,-2.348 0.047,-0.453 0.043,-1.012 0.043,-1.508 0,-0.629 0.012,-1.16 0.152,-1.242 0.258,-0.152 0.316,-0.16 0.621,-0.16 0.305,0 0.441,0.016 0.543,0.113 0.094,0.086 0.055,0.293 0.023,0.586 -0.027,0.293 0.121,0.387 0.266,0.508 0.148,0.117 0.281,0.266 0.746,0.301 0.469,0.031 0.641,-0.039 0.859,-0.172 0.219,-0.129 0.527,-0.359 0.645,-0.496 0.109,-0.129 0.383,-0.574 0.434,-0.574 0.043,0 0.359,-0.105 0.535,0.137 m 0,-0.004"
           id="path106"
           inkscape:connector-curvature="0"
           style="fill:#ffcf33;fill-opacity:1;fill-rule:nonzero;stroke:none" />
        <path
           d="m 16.34,29.02 c -0.426,0.289 -1.516,0.266 -1.793,0.605 -0.27,0.34 0.012,0.832 0.004,1.746 0,0.391 -0.07,0.684 -0.117,0.922 -0.07,0.301 -0.113,0.512 0.023,0.727 0.246,0.379 0.633,0.477 2.871,0.914 1.195,0.234 2.328,0.836 3.082,0.898 0.758,0.051 0.922,-0.188 1.383,-0.57 0.457,-0.387 0.605,-0.27 0.59,-1.113 -0.016,-0.844 -0.59,-1.094 -1.242,-2.066 -0.652,-0.973 -0.758,-1.152 -1.191,-1.797 -0.434,-0.637 -1.293,-1.793 -1.781,-1.805 -0.391,-0.008 -0.609,0.188 -0.855,0.422 -0.246,0.234 -0.543,0.828 -0.973,1.117 m 0,0"
           id="path108"
           inkscape:connector-curvature="0"
           style="fill:#ffcf33;fill-opacity:1;fill-rule:nonzero;stroke:none" />
        <path
           d="m 29.03,22.656 c -0.082,-0.004 -0.117,0.023 -0.094,0.094 0,0 0.656,0.359 1.25,1.031 0.016,0.035 0.664,0.906 0.531,2.063 -0.023,0.02 -0.066,0.512 -0.125,0.719 -0.156,0.492 -0.355,0.777 -0.191,0.813 0.148,0.035 0.543,-0.953 0.531,-1.344 0.141,-0.367 0.137,-1.301 -0.219,-1.906 -0.121,-0.219 -0.238,-0.484 -0.316,-0.5 -0.508,-0.652 -1.133,-0.965 -1.375,-0.969 m 0.004,0"
           id="path110"
           inkscape:connector-curvature="0"
           style="fill:#676767;fill-opacity:1;fill-rule:nonzero;stroke:none" />
        <path
           d="m 29.465,27.973 c 0.102,0.094 0.188,-0.141 0.289,-0.219 0.098,-0.074 0.262,-0.238 0.582,-0.238 0.324,0 0.305,-0.012 0.289,-0.125 -0.012,-0.113 -0.105,-0.105 -0.391,-0.066 -0.285,0.039 -0.477,0.176 -0.59,0.305 -0.109,0.117 -0.234,0.289 -0.18,0.344 m 0,0"
           id="path112"
           inkscape:connector-curvature="0"
           style="fill:#676767;fill-opacity:1;fill-rule:nonzero;stroke:none" />
        <path
           d="m 30.758,27.383 c 0,0.141 0.305,0.191 0.605,0.234 0.289,0.039 0.523,0.094 0.539,0.379 0.012,0.281 -0.063,0.484 0.07,0.461 0.285,-0.051 0.387,-0.34 0.387,-0.477 0,-0.133 -0.211,-0.375 -0.586,-0.508 -0.277,-0.102 -0.48,-0.145 -0.719,-0.152 -0.328,-0.016 -0.297,0.063 -0.297,0.063 m 0,0"
           id="path114"
           inkscape:connector-curvature="0"
           style="fill:#676767;fill-opacity:1;fill-rule:nonzero;stroke:none" />
        <path
           d="m 21.988,18.797 c 0.133,0.086 0.137,0.098 0.328,0.219 0.309,0.234 0.852,0.289 1.117,0.297 0.613,0.09 1.707,-0.449 2.137,-0.691 0.219,-0.152 0.621,-0.473 0.773,-0.477 0.094,0.094 -0.043,0.109 -0.238,0.234 -0.258,0.176 -0.477,0.324 -0.871,0.531 -0.418,0.207 -1.063,0.547 -1.887,0.5 -0.434,-0.059 -0.438,-0.063 -0.703,-0.191 -0.16,-0.105 -0.523,-0.285 -0.656,-0.422 m 0,0"
           id="path116"
           inkscape:connector-curvature="0"
           style="fill:#995900;fill-opacity:1;fill-rule:nonzero;stroke:none" />
        <path
           d="m 24.691,17.395 c 0.02,0.051 -0.129,0.145 -0.207,0.082 -0.082,-0.066 -0.176,-0.129 -0.211,-0.145 -0.145,-0.094 -0.09,-0.156 0.152,-0.117 0.242,0.039 0.242,0.129 0.266,0.18 m 0,0"
           id="path118"
           inkscape:connector-curvature="0"
           style="fill:#995900;fill-opacity:1;fill-rule:nonzero;stroke:none" />
      </g>
    </g>
  </g>
  <g
     id="g3016"
     transform="matrix(0.14272137,0,0,0.14272137,49.021313,49.194777)">
    <path
       transform="matrix(1.1612903,0,0,1.1612903,-67.184257,-59.106617)"
       d="m 416.54237,273.35593 c 0,74.28697 -61.67846,134.50847 -137.76271,134.50847 -76.08424,0 -137.76271,-60.2215 -137.76271,-134.50847 0,-74.28698 61.67847,-134.50847 137.76271,-134.50847 76.08425,0 137.76271,60.22149 137.76271,134.50847 z"
       sodipodi:ry="134.50847"
       sodipodi:rx="137.76271"
       sodipodi:cy="273.35593"
       sodipodi:cx="278.77966"
       id="path3012"
       style="fill:#ffffff;fill-opacity:1;fill-rule:nonzero;stroke:#4169e1;stroke-width:0;stroke-linecap:round;stroke-linejoin:miter;stroke-miterlimit:4;stroke-opacity:1;stroke-dasharray:none"
       sodipodi:type="arc" />
    <path
       style="fill:#869094"
       d="m 222.26198,503.31514 c -4.30086,-1.91972 -8.8755,-6.83229 -10.9168,-11.72322 -1.05206,-2.5207 -2.10198,-12.21014 -3.0009,-27.69445 -0.76045,-13.09948 -1.76183,-24.86184 -2.22527,-26.13857 -0.61471,-1.69349 -3.61992,-3.29116 -11.11126,-5.90712 -5.64776,-1.97219 -14.15283,-5.53872 -18.90014,-7.92563 -4.74732,-2.38689 -9.66575,-4.33982 -10.92986,-4.33982 -1.4178,0 -9.17289,6.30634 -20.24155,16.46016 -9.86873,9.05309 -19.53853,17.27834 -21.48843,18.27834 -4.01368,2.05841 -13.04408,2.39342 -17.70735,0.65691 -3.70788,-1.38073 -42.93205,-40.0341 -45.446972,-44.7856 -2.494396,-4.71271 -2.227632,-13.52832 0.570993,-18.86902 1.273967,-2.43114 9.570429,-12.28384 18.4366,-21.89489 9.544086,-10.3459 16.120313,-18.37742 16.120313,-19.68764 0,-1.21716 -1.952925,-6.09719 -4.339822,-10.84451 -2.386907,-4.74731 -5.945723,-13.23031 -7.908496,-18.85111 -1.962772,-5.6208 -4.371725,-10.63588 -5.353239,-11.14463 -0.981514,-0.50874 -12.50232,-1.51584 -25.601799,-2.23798 -15.234677,-0.83984 -25.488406,-1.91133 -28.454859,-2.97347 -5.653171,-2.02412 -12.166154,-8.95574 -13.086319,-13.92748 -0.373222,-2.0165 -0.526018,-16.95603 -0.339545,-33.19894 l 0.339035,-29.53257 3.394499,-4.25467 c 5.998764,-7.51887 8.818558,-8.27414 37.470636,-10.03647 16.217077,-0.99749 26.07544,-2.05371 26.894321,-2.88146 0.711017,-0.71871 3.141161,-6.29174 5.40032,-12.38453 2.259159,-6.09278 5.790047,-14.43022 7.846416,-18.52763 2.056369,-4.09742 3.738852,-8.35042 3.738852,-9.45112 0,-1.1007 -6.783104,-9.44161 -15.073562,-18.53535 -8.290458,-9.09373 -16.220512,-18.05098 -17.622339,-19.90501 -3.942738,-5.21453 -5.276016,-11.67174 -3.716142,-17.99765 1.177812,-4.77647 3.335244,-7.36582 21.353613,-25.628507 11.02389,-11.173374 21.892946,-21.268004 24.153466,-22.432512 5.24571,-2.702336 13.58672,-2.739746 18.79521,-0.0843 2.19318,1.118147 11.81505,9.218777 21.38193,18.001398 9.56689,8.782622 18.04255,16.336501 18.83484,16.786421 0.83494,0.47414 5.9883,-1.3363 12.25898,-4.306755 5.95017,-2.818609 14.85312,-6.484546 19.78434,-8.146524 6.68624,-2.253465 9.28056,-3.693366 10.2037,-5.663251 0.68083,-1.452818 1.84845,-13.359253 2.59471,-26.458732 1.43521,-25.192589 2.29758,-29.174902 7.49239,-34.5984 5.77848,-6.032872 9.10175,-6.527787 41.4002,-6.165491 l 29.4183,0.329989 4.60225,3.047626 c 7.91816,5.243453 8.87664,8.503447 10.74144,36.533985 0.90266,13.568235 1.88767,25.726302 2.18892,27.017905 0.42397,1.817753 2.84874,3.151873 10.73157,5.904547 5.60112,1.955893 14.57094,5.759495 19.93294,8.452459 5.36201,2.692962 10.17874,4.896292 10.70384,4.896292 0.5251,0 9.13419,-7.507735 19.13132,-16.68384 9.99711,-9.176115 20.02608,-17.65062 22.2866,-18.832231 5.34357,-2.793175 13.2972,-2.767729 19.14106,0.06126 2.7747,1.343203 12.20097,9.922093 24.03971,21.878622 20.32185,20.524049 21.92338,22.872189 21.93916,32.167089 0.0112,6.57408 -2.91549,10.88667 -20.38644,30.04035 -9.49951,10.41446 -17.27184,19.37698 -17.27184,19.91669 0,0.53971 2.47945,6.14961 5.5099,12.46644 3.03044,6.31683 6.64457,15.16341 8.03139,19.65907 1.72287,5.585 3.22323,8.472 4.73705,9.115 1.21856,0.51759 13.46663,1.64375 27.21794,2.50259 27.2897,1.70436 31.68548,2.82722 36.26096,9.26258 4.3254,6.08362 4.82847,10.64305 4.45389,40.36657 l -0.35831,28.43287 -3.33867,4.74734 c -5.96165,8.47704 -7.4673,8.91135 -37.74248,10.88694 -14.79312,0.96532 -27.15606,2.0146 -27.47321,2.33176 -0.31716,0.31716 -2.15365,5.04527 -4.08109,10.5069 -1.92745,5.46165 -5.71766,14.33754 -8.42269,19.72423 -2.70506,5.38668 -4.76583,10.45844 -4.57953,11.27058 0.18631,0.81214 7.56699,9.357 16.40153,18.98858 8.83453,9.63158 17.18441,19.72394 18.55528,22.42745 2.9119,5.74259 3.18198,11.82324 0.78045,17.57091 -2.11933,5.07227 -38.0926,41.63744 -43.93967,44.66265 -4.88898,2.5295 -13.79465,2.80128 -18.91195,0.57716 -1.96058,-0.85213 -11.78995,-9.07509 -21.84304,-18.27325 -10.05309,-9.19817 -19.0779,-16.72623 -20.05514,-16.72903 -0.97724,-0.003 -6.64017,2.26759 -12.58429,5.04529 -5.94413,2.77771 -14.75197,6.34993 -19.57297,7.93828 -6.66342,2.19535 -8.89443,3.44155 -9.30323,5.19658 -0.29576,1.26977 -1.2763,13.40995 -2.17896,26.9782 -1.98537,29.84285 -3.126,33.07797 -13.51793,38.34024 -3.01332,1.52589 -7.99984,1.78875 -33.23335,1.7519 -22.33262,-0.0326 -30.51147,-0.41089 -33.01142,-1.52676 z m 43.75724,-132.50462 c 26.78112,-2.80677 49.15657,-13.48771 68.20616,-32.55826 14.51901,-14.53499 23.8874,-30.84407 29.52845,-51.40499 3.53643,-12.88981 3.51558,-41.35248 -0.0399,-54.39963 -10.78971,-39.59432 -39.13333,-68.74625 -78.30863,-80.54181 -9.12821,-2.74847 -11.60682,-3.00909 -29.35613,-3.08662 -17.00063,-0.0742 -20.54479,0.23162 -28.80223,2.48586 -41.22993,11.25552 -72.76306,44.38443 -81.37953,85.49784 -7.7414,36.93802 3.5778,74.64033 30.54545,101.7417 14.12004,14.19006 32.44092,24.60186 52.28941,29.71619 5.65987,1.45837 13.69183,2.58238 25.13135,3.51692 0.91392,0.0747 6.39742,-0.36058 12.18556,-0.9672 z m -27.47101,-46.4431 c -28.24696,-7.66077 -48.01557,-31.70052 -49.7659,-60.51815 -1.22382,-20.14894 5.2603,-37.19647 19.56861,-51.44824 26.05766,-25.95469 67.66639,-26.19795 93.39392,-0.546 21.19059,21.12833 26.27511,51.17802 13.12257,77.55487 -11.20256,22.46624 -31.84016,35.72424 -57.15268,36.716 -8.61738,0.33764 -12.87949,-0.0534 -19.16652,-1.75848 z m 31.60201,-27.93457 c 7.80185,-2.91905 17.10779,-11.56877 21.02165,-19.53928 2.76183,-5.62442 3.09528,-7.49672 3.09548,-17.38121 2.1e-4,-10.51503 -0.19264,-11.43349 -3.79628,-18.07997 -7.2743,-13.41658 -18.06759,-20.21506 -33.31407,-20.98387 -12.24764,-0.6176 -19.57845,1.97666 -28.42009,10.05742 -11.2101,10.2454 -15.67052,24.48856 -12.07007,38.54251 3.11639,12.16444 9.71875,20.42413 20.82444,26.05181 10.36058,5.25011 21.02537,5.68526 32.65894,1.33259 z"
       id="path2986"
       inkscape:connector-curvature="0" />
  </g>
</svg>
