<?xml version="1.0" encoding="UTF-8" standalone="no"?>
<!-- Created with Inkscape (http://www.inkscape.org/) -->

<svg
   xmlns:dc="http://purl.org/dc/elements/1.1/"
   xmlns:cc="http://creativecommons.org/ns#"
   xmlns:rdf="http://www.w3.org/1999/02/22-rdf-syntax-ns#"
   xmlns:svg="http://www.w3.org/2000/svg"
   xmlns="http://www.w3.org/2000/svg"
   xmlns:sodipodi="http://sodipodi.sourceforge.net/DTD/sodipodi-0.dtd"
   xmlns:inkscape="http://www.inkscape.org/namespaces/inkscape"
   id="svg2"
   version="1.1"
   inkscape:version="0.48.5 r10040"
   width="512"
   height="512"
   sodipodi:docname="pkgbrowser.svg">
  <metadata
     id="metadata8">
    <rdf:RDF>
      <cc:Work
         rdf:about="">
        <dc:format>image/svg+xml</dc:format>
        <dc:type
           rdf:resource="http://purl.org/dc/dcmitype/StillImage" />
        <dc:title />
      </cc:Work>
    </rdf:RDF>
  </metadata>
  <defs
     id="defs6" />
  <sodipodi:namedview
     pagecolor="#ffffff"
     bordercolor="#666666"
     borderopacity="1"
     objecttolerance="10"
     gridtolerance="10"
     guidetolerance="10"
     inkscape:pageopacity="0"
     inkscape:pageshadow="2"
     inkscape:window-width="1151"
     inkscape:window-height="656"
     id="namedview4"
     showgrid="false"
     inkscape:zoom="0.921875"
     inkscape:cx="163.75693"
     inkscape:cy="283.72732"
     inkscape:window-x="15"
     inkscape:window-y="39"
     inkscape:window-maximized="0"
     inkscape:current-layer="svg2" />
  <path
     sodipodi:type="arc"
     style="fill:#ce9338;fill-opacity:1;fill-rule:evenodd;stroke:#ffffff;stroke-width:0;stroke-linecap:round;stroke-linejoin:miter;stroke-miterlimit:4;stroke-opacity:1;stroke-dasharray:none"
     id="path2996"
     sodipodi:cx="-318.91525"
     sodipodi:cy="86.779663"
     sodipodi:rx="210.44067"
     sodipodi:ry="215.86441"
     d="m -108.47458,86.779663 a 210.44067,215.86441 0 1 1 -420.88135,0 210.44067,215.86441 0 1 1 420.88135,0 z"
     transform="matrix(1.0721649,0,0,1.0502513,600.20094,165.19853)" />
  <path
     inkscape:connector-curvature="0"
     id="path2984"
     d="m 135.00076,387.1481 -8.99076,-8.36532 1.99076,-2.2374 c 1.09492,-1.23058 21.94724,-23.88572 46.33848,-50.34478 39.87546,-43.25599 44.63113,-48.08304 47.15815,-47.86603 2.40643,0.20665 4.2054,-1.26504 12.51407,-10.23751 5.337,-5.76338 9.48361,-11.04698 9.2147,-11.74135 -0.26891,-0.69437 -2.7901,-4.59916 -5.60265,-8.6773 -8.85545,-12.84025 -14.14437,-30.18162 -14.11884,-46.29303 0.0614,-38.77476 26.87306,-72.32968 64.98686,-81.33146 10.45396,-2.46904 27.85843,-2.25664 38.5,0.46983 23.57934,6.04125 43.37048,21.99159 54.06089,43.56947 6.59006,13.3016 8.69264,22.37212 8.69264,37.5 0,14.70643 -2.03863,23.77796 -8.20794,36.52373 -21.08028,43.5518 -74.93166,59.56116 -117.38786,34.89799 l -7.84228,-4.55565 -7.26201,7.81697 c -12.44045,13.39112 -13.0661,14.26642 -11.72839,16.40843 1.04807,1.67822 -3.92391,7.41545 -45.40765,52.39655 -25.62152,27.78158 -46.88447,50.49402 -47.25099,50.47207 -0.36653,-0.0219 -4.71226,-3.80429 -9.65718,-8.40521 z M 325.32774,263.43636 c 10.83547,-3.31471 18.02775,-7.70579 26.76178,-16.33881 13.82302,-13.66315 20.1497,-29.95593 19.17383,-49.37743 -1.33742,-26.61704 -18.94478,-49.62444 -44.19341,-57.74722 -49.06282,-15.78407 -95.35837,27.79599 -82.90308,78.04036 7.15276,28.85404 36.15349,49.88959 66.16088,47.98949 4.58491,-0.29032 11.33491,-1.44519 15,-2.56639 z"
     style="fill:#534a3c" />
  <path
     sodipodi:type="arc"
     style="fill:#ddb577;fill-opacity:1;fill-rule:evenodd;stroke:#ffffff;stroke-width:0;stroke-linecap:round;stroke-linejoin:miter;stroke-miterlimit:4;stroke-opacity:1;stroke-dasharray:none"
     id="path3766"
     sodipodi:cx="-71.05085"
     sodipodi:cy="241.8983"
     sodipodi:rx="12.474576"
     sodipodi:ry="11.932203"
     d="m -58.576274,241.8983 a 12.474576,11.932203 0 1 1 -24.949152,0 12.474576,11.932203 0 1 1 24.949152,0 z"
     transform="translate(360.13559,-75.932203)" />
</svg>
