<?xml version="1.0" encoding="UTF-8" standalone="no"?>
<!-- Created with Inkscape (http://www.inkscape.org/) -->

<svg
   xmlns:dc="http://purl.org/dc/elements/1.1/"
   xmlns:cc="http://creativecommons.org/ns#"
   xmlns:rdf="http://www.w3.org/1999/02/22-rdf-syntax-ns#"
   xmlns:svg="http://www.w3.org/2000/svg"
   xmlns="http://www.w3.org/2000/svg"
   xmlns:sodipodi="http://sodipodi.sourceforge.net/DTD/sodipodi-0.dtd"
   xmlns:inkscape="http://www.inkscape.org/namespaces/inkscape"
   id="svg2987"
   version="1.1"
   inkscape:version="0.48.5 r10040"
   width="1024"
   height="1024"
   sodipodi:docname="rapid-photo-downloader.svg">
  <metadata
     id="metadata2993">
    <rdf:RDF>
      <cc:Work
         rdf:about="">
        <dc:format>image/svg+xml</dc:format>
        <dc:type
           rdf:resource="http://purl.org/dc/dcmitype/StillImage" />
        <dc:title />
      </cc:Work>
    </rdf:RDF>
  </metadata>
  <defs
     id="defs2991" />
  <sodipodi:namedview
     pagecolor="#ffffff"
     bordercolor="#666666"
     borderopacity="1"
     objecttolerance="10"
     gridtolerance="10"
     guidetolerance="10"
     inkscape:pageopacity="0"
     inkscape:pageshadow="2"
     inkscape:window-width="930"
     inkscape:window-height="641"
     id="namedview2989"
     showgrid="false"
     inkscape:zoom="0.32593203"
     inkscape:cx="327.38896"
     inkscape:cy="329.11746"
     inkscape:window-x="257"
     inkscape:window-y="73"
     inkscape:window-maximized="0"
     inkscape:current-layer="svg2987" />
  <path
     style="fill:#dbe3de;fill-opacity:1;fill-rule:nonzero;stroke:none"
     d="m 502.94338,678.39984 c -10.03778,-0.63486 -15.30754,-2.92117 -21.2215,-9.20701 -5.54551,-5.89421 -8.1826,-12.14786 -9.073,-21.51582 -0.86439,-9.09437 -1.0742,-199.22989 -0.23826,-215.92236 l 0.55395,-11.06154 213.26441,0 213.26441,0 0,113.53354 c 0,73.17203 -0.30736,115.18411 -0.86456,118.17641 -1.8615,9.99645 -7.10693,17.1262 -16.89147,22.95934 l -6.48692,3.86724 -181.89413,-0.1455 c -100.04178,-0.0801 -185.72759,-0.38796 -190.41293,-0.6843 z"
     id="path3787-3"
     inkscape:connector-curvature="0" />
  <path
     style="fill:#f3ce44;fill-opacity:1;fill-rule:nonzero;stroke:none"
     d="m 495.26597,237.75751 c -2.3375,-0.37441 -5.29599,-1.74107 -7.22223,-3.33625 l -3.26281,-2.70203 -0.6564,-27.98486 c -0.36104,-15.39167 -0.70924,-48.90042 -0.77382,-74.46392 l -0.1174,-46.4791 2.71394,-4.131946 c 1.85322,-2.821508 3.70172,-4.417281 5.82858,-5.031654 4.89452,-1.413869 49.51395,-1.183412 53.7335,0.277525 7.253,2.511195 6.93833,-1.412717 6.62025,82.554645 l -0.28511,75.25657 -3.35714,2.78157 c -3.07135,2.54478 -4.0814,2.83149 -11.86508,3.36796 -11.11222,0.76588 -36.31027,0.69976 -41.35628,-0.10851 l 0,0 z"
     id="path3777-4"
     inkscape:connector-curvature="0" />
  <path
     style="fill:#f3ce44;fill-opacity:1;fill-rule:nonzero;stroke:none"
     d="m 581.28973,237.81101 c -5.02658,-0.75836 -8.78726,-3.65566 -10.17357,-7.83792 -0.6843,-2.06446 -0.92362,-27.91932 -0.72179,-77.97973 l 0.30194,-74.891282 4.14589,-3.407704 4.1459,-3.407715 23.99921,0 23.99922,0 3.59739,2.385841 c 1.97857,1.312215 3.93271,3.361872 4.34254,4.554777 0.40983,1.192925 0.74516,35.978103 0.74516,77.300373 0,82.93918 0.38066,78.03099 -6.33733,81.71309 -3.29831,1.80779 -4.71063,1.93067 -23.68913,2.06118 -11.09996,0.0762 -22.05989,-0.14459 -24.35543,-0.49091 l 0,0 z"
     id="path3779-1"
     inkscape:connector-curvature="0" />
  <path
     style="fill:#f3ce44;fill-opacity:1;fill-rule:nonzero;stroke:none"
     d="m 666.22831,234.47204 c -4.01384,-1.141 -7.68009,-4.62192 -8.42667,-8.0008 -0.97141,-4.39622 -0.72127,-150.32004 0.26162,-152.624769 0.48003,-1.125636 2.03077,-3.022666 3.44609,-4.215644 2.573,-2.16877 2.57606,-2.169071 25.26342,-2.444581 13.89777,-0.168777 23.99011,0.07509 26.045,0.629369 2.37794,0.641407 4.12251,2.011397 5.99089,4.7046 l 2.63599,3.799679 -0.10344,33.312276 c -0.15279,49.19814 -1.44553,117.18626 -2.27056,119.41337 -0.39575,1.06829 -2.19403,2.76717 -3.99619,3.77531 -3.02215,1.69062 -4.93079,1.85877 -24.57349,2.16504 -12.29382,0.19169 -22.55484,-0.0255 -24.27265,-0.51385 l 0,0 z"
     id="path3781-6"
     inkscape:connector-curvature="0" />
  <path
     style="fill:#f3ce44;fill-opacity:1;fill-rule:nonzero;stroke:none"
     d="m 749.90423,235.38836 c -3.82699,-0.49141 -5.41849,-1.22319 -7.62272,-3.50494 -1.53225,-1.58615 -3.03413,-4.05017 -3.33751,-5.47562 -0.30341,-1.42545 -0.41729,-35.44915 -0.25311,-75.60823 l 0.29851,-73.016496 4.14592,-3.341713 4.14591,-3.341693 23.20497,0 c 26.00707,0 28.65204,0.438211 31.69054,5.250386 1.68917,2.675205 1.78822,6.932371 1.78822,76.850626 0,71.01674 -0.0753,74.126 -1.85628,76.66828 -3.76708,5.37734 -5.84057,5.82617 -27.67806,5.99145 -10.82926,0.0819 -21.86615,-0.13046 -24.52639,-0.47205 z"
     id="path3783-5"
     inkscape:connector-curvature="0" />
  <path
     style="fill:#f3ce44;fill-opacity:1;fill-rule:nonzero;stroke:none"
     d="m 836.52669,234.56542 c -4.5289,-1.614 -5.86581,-3.03474 -6.85071,-7.28036 -0.44438,-1.91563 -0.81164,-26.84758 -0.81613,-55.40434 -0.008,-55.83879 -0.11768,-54.50126 4.73087,-58.10144 2.40972,-1.78929 3.58119,-1.87669 25.1517,-1.87669 24.98048,0 24.01927,-0.20679 27.94478,6.01163 2.11437,3.34937 2.11614,3.37718 2.01686,31.34502 -0.0546,15.39597 -0.35679,39.608 -0.67139,53.80454 l -0.57202,25.81188 -2.86167,2.55534 c -1.57393,1.40545 -4.3938,2.98081 -6.26638,3.50082 -5.20018,1.44404 -37.52063,1.16078 -41.80591,-0.3664 l 0,0 z"
     id="path3785-0"
     inkscape:connector-curvature="0" />
  <path
     inkscape:connector-curvature="0"
     id="path2984-5"
     d="m 439.88287,724.63097 c -5.06434,-1.36649 -9.42086,-4.79073 -12.09666,-9.508 l -2.29263,-4.04179 0,-338.77027 0,-338.770269 1.63116,-2.997966 c 2.41953,-4.44696 5.78503,-7.744776 9.79228,-9.595376 l 3.56639,-1.647 213.5937,-0.19633 213.59371,-0.196329 41.7956,41.790608 41.79561,41.790622 -0.004,302.79718 c -0.003,203.77437 -0.25452,303.69848 -0.76968,305.55328 -1.3192,4.74967 -5.23934,9.65866 -9.71902,12.17065 l -4.12221,2.31155 -246.58278,0.1402 c -199.87863,0.11366 -247.26436,-0.0437 -250.1813,-0.83076 z M 873.4442,670.41068 c 9.08759,-4.4739 15.11648,-11.74533 17.56165,-21.18105 1.16752,-4.50539 1.22009,-17.87604 0.73358,-186.55982 -0.28825,-99.93862 -0.69296,-181.97986 -0.89939,-182.31385 -0.48673,-0.78756 -406.30531,-0.79753 -406.79203,-0.0104 -0.20302,0.32851 -0.60623,81.52656 -0.89602,180.44013 -0.39661,135.36942 -0.31114,181.20871 0.34556,185.36607 1.93347,12.24004 10.09871,21.93116 21.57705,25.60922 4.21224,1.34977 10.52728,1.39258 183.8812,1.24674 l 179.51914,-0.15101 4.96926,-2.44642 z M 538.75478,231.36016 c 1.13735,-0.84991 2.76329,-2.47656 3.6132,-3.61477 1.53212,-2.05183 1.54695,-2.67748 1.73959,-73.40388 0.18203,-66.83049 0.11106,-71.496674 -1.12424,-73.904365 -0.72519,-1.413465 -2.27,-3.268454 -3.43289,-4.122205 -1.99491,-1.464551 -3.24405,-1.564056 -22.11001,-1.761176 -23.03173,-0.240645 -23.89838,-0.05214 -26.92844,5.857001 l -1.68636,3.288695 0,69.3615 c 0,42.8678 0.27944,70.33586 0.7316,71.91241 0.40237,1.40301 1.4985,3.38309 2.43584,4.4002 3.42343,3.71473 4.76055,3.90988 25.4475,3.71406 18.11576,-0.17148 19.36777,-0.27294 21.31421,-1.72747 z m 84.99081,0.20395 c 2.11693,-1.11947 3.7865,-2.74804 4.8022,-4.68433 1.54452,-2.94437 1.55703,-3.53858 1.55703,-73.92746 0,-70.824809 -0.003,-70.963239 -1.5679,-73.075449 -0.86234,-1.163919 -2.68289,-2.875077 -4.04566,-3.802577 -2.41388,-1.642872 -2.98419,-1.686357 -22.11764,-1.686357 -19.13343,0 -19.70374,0.04352 -22.11762,1.686357 -1.36277,0.9275 -3.18332,2.638461 -4.04566,3.80214 -1.56094,2.106374 -1.56881,2.425358 -1.7704,71.814956 -0.13313,45.82111 0.0603,70.6752 0.56465,72.54818 0.42195,1.56695 1.49627,3.77592 2.38741,4.90882 2.97736,3.78508 4.69516,4.07067 24.67638,4.10247 17.79374,0.0284 18.54441,-0.0301 21.67721,-1.68675 z M 710.49912,231.16 c 5.38183,-3.83861 5.02516,1.3897 5.24959,-76.95118 l 0.20182,-70.452229 -1.70081,-3.317266 c -3.04651,-5.941903 -3.89119,-6.126414 -26.94289,-5.885561 -18.86597,0.19712 -20.11511,0.296625 -22.11001,1.761176 -1.16289,0.853751 -2.70406,2.70874 -3.42481,4.122205 -1.22003,2.392642 -1.31052,7.427246 -1.31161,72.972935 -0.001,69.45343 0.0195,70.44578 1.53588,73.57806 1.09024,2.25212 2.45193,3.63517 4.68432,4.75776 2.9943,1.50572 4.07631,1.57236 22.25932,1.3711 18.64473,-0.20637 19.17189,-0.25422 21.5592,-1.957 z m 83.13348,1.32079 c 2.87184,-1.08812 5.47182,-3.59371 6.6867,-6.44399 0.82296,-1.93078 1.02067,-15.49178 1.06349,-72.94482 0.0496,-66.629432 -0.0227,-70.701682 -1.29487,-72.873879 -0.7411,-1.265417 -2.29893,-3.010557 -3.46182,-3.87809 -2.00646,-1.49683 -3.13613,-1.588598 -22.13675,-1.798263 -19.82142,-0.218711 -20.04774,-0.203662 -22.54995,1.49899 -1.39016,0.945955 -3.23312,2.672017 -4.09546,3.835696 -1.56093,2.106374 -1.56879,2.425358 -1.7704,71.814956 -0.13312,45.82111 0.0603,70.6752 0.56467,72.54818 0.98568,3.66055 3.396,6.70232 6.31969,7.97529 2.92779,1.27477 37.41696,1.50025 40.6747,0.26593 z m 87.18862,-0.88695 c 1.97029,-0.99868 3.94527,-2.75607 4.84314,-4.30958 1.47253,-2.54777 1.52203,-4.00278 1.72136,-50.59069 l 0.20524,-47.96747 -1.70422,-3.31726 c -3.05273,-5.94212 -3.89643,-6.1264 -26.94631,-5.88556 -18.98354,0.19835 -20.10266,0.28875 -22.11,1.78625 -1.1629,0.86753 -2.72702,2.62346 -3.47583,3.90207 -1.27982,2.1853 -1.35712,5.23723 -1.28894,50.88498 0.0815,54.62202 -0.17598,52.12134 5.71463,55.48494 2.81288,1.60617 3.67715,1.67452 21.32282,1.68635 17.59963,0.0117 18.53429,-0.0602 21.71811,-1.67403 z"
     style="fill:#313133" />
  <rect
     style="fill:#ff2a2a;fill-rule:evenodd;stroke:none"
     id="rect3005-3"
     width="408.28214"
     height="150.61946"
     x="483.27692"
     y="279.72626" />
  <g
     id="g3789"
     transform="matrix(0.74949173,0,0,0.74949173,-42.843013,275.15372)">
    <path
       inkscape:connector-curvature="0"
       id="path3787"
       d="m 277.85342,918.21738 c -13.39279,-0.84706 -20.42389,-3.89754 -28.31453,-12.28435 -7.39901,-7.86428 -10.91752,-16.20813 -12.10553,-28.70721 -1.15329,-12.13405 -1.43323,-265.82 -0.31789,-288.09172 l 0.7391,-14.75872 284.54538,0 284.54539,0 0,151.48072 c 0,97.62886 -0.4101,153.68295 -1.15354,157.67539 -2.48368,13.33764 -9.48234,22.85042 -22.53723,30.63321 l -8.65509,5.15983 -242.68998,-0.19414 c -133.47949,-0.10678 -247.80472,-0.51763 -254.05608,-0.91301 z"
       style="fill:#dbe3de;fill-opacity:1;fill-rule:nonzero;stroke:none" />
    <path
       inkscape:connector-curvature="0"
       id="path3777"
       d="m 267.60993,330.29584 c -3.11878,-0.49956 -7.0661,-2.323 -9.63617,-4.45135 l -4.35335,-3.60516 -0.87581,-37.33844 c -0.4817,-20.53614 -0.94629,-65.24478 -1.03246,-99.35256 l -0.15663,-62.01414 3.62104,-5.513 c 2.47264,-3.76457 4.93898,-5.89371 7.7767,-6.71343 6.53046,-1.88643 66.06337,-1.57895 71.69327,0.37029 9.67721,3.35053 9.25737,-1.8849 8.83297,110.14749 l -0.3804,100.41014 -4.47922,3.71128 c -4.09792,3.39535 -5.44556,3.77788 -15.83084,4.49366 -14.82635,1.02186 -48.44652,0.93365 -55.1791,-0.14478 l 0,0 z"
       style="fill:#f3ce44;fill-opacity:1;fill-rule:nonzero;stroke:none" />
    <path
       inkscape:connector-curvature="0"
       id="path3779"
       d="m 382.38607,330.36722 c -6.70667,-1.01183 -11.72431,-4.87752 -13.57396,-10.45764 -0.91303,-2.7545 -1.23233,-37.25102 -0.96305,-104.04349 l 0.40287,-99.92274 5.5316,-4.5467 5.53161,-4.5467 32.02065,0 32.02066,0 4.79977,3.18329 c 2.63988,1.7508 5.24717,4.48553 5.79398,6.07715 0.54682,1.59165 0.99422,48.00332 0.99422,103.13705 0,110.66056 0.50789,104.11187 -8.4555,109.02467 -4.40073,2.41201 -6.28511,2.57597 -31.60693,2.75009 -14.80998,0.10175 -29.43313,-0.19291 -32.49592,-0.65498 l 0,0 z"
       style="fill:#f3ce44;fill-opacity:1;fill-rule:nonzero;stroke:none" />
    <path
       inkscape:connector-curvature="0"
       id="path3781"
       d="m 495.7143,325.91224 c -5.35541,-1.52236 -10.24705,-6.16675 -11.24318,-10.67497 -1.29608,-5.8656 -0.96234,-200.56262 0.34906,-203.63768 0.64048,-1.50186 2.70954,-4.03296 4.59791,-5.62467 3.43298,-2.89366 3.43708,-2.89406 33.7074,-3.26165 18.54292,-0.22519 32.00852,0.1002 34.75022,0.83973 3.17274,0.85578 5.50041,2.68368 7.99327,6.27705 l 3.51703,5.06968 -0.13802,44.44646 c -0.20386,65.64201 -1.92868,156.35432 -3.02947,159.32581 -0.52802,1.42535 -2.92736,3.69206 -5.33186,5.03717 -4.03226,2.25568 -6.57884,2.48004 -32.78687,2.88866 -16.40288,0.25577 -30.09351,-0.034 -32.38549,-0.68559 l 0,0 z"
       style="fill:#f3ce44;fill-opacity:1;fill-rule:nonzero;stroke:none" />
    <path
       inkscape:connector-curvature="0"
       id="path3783"
       d="m 607.35785,327.13483 c -5.10611,-0.65565 -7.22954,-1.63202 -10.17052,-4.67643 -2.04438,-2.1163 -4.04824,-5.40389 -4.45303,-7.30578 -0.40481,-1.90189 -0.55676,-47.29758 -0.3377,-100.87932 l 0.39829,-97.42134 5.53163,-4.45864 5.53163,-4.45862 30.96095,0 c 34.69961,0 38.22862,0.58468 42.2827,7.00527 2.25375,3.56936 2.38591,9.24942 2.38591,102.53697 0,94.75321 -0.10039,98.90169 -2.47672,102.29369 -5.02617,7.17465 -7.7927,7.77351 -36.92911,7.99403 -14.4488,0.10932 -29.17463,-0.17406 -32.72403,-0.62983 z"
       style="fill:#f3ce44;fill-opacity:1;fill-rule:nonzero;stroke:none" />
    <path
       inkscape:connector-curvature="0"
       id="path3785"
       d="m 722.9328,326.03684 c -6.04264,-2.15346 -7.82639,-4.04908 -9.14047,-9.71374 -0.59292,-2.5559 -1.08294,-35.82104 -1.08893,-73.92254 -0.0117,-74.50221 -0.15701,-72.71764 6.31212,-77.52113 3.21513,-2.38734 4.77815,-2.50395 33.55834,-2.50395 33.32989,0 32.0474,-0.2759 37.28497,8.02095 2.82107,4.46885 2.82344,4.50595 2.69097,41.82169 -0.0729,20.54188 -0.47604,52.84649 -0.8958,71.78805 l -0.76321,34.43917 -3.81815,3.40943 c -2.09999,1.87521 -5.86236,3.97711 -8.36083,4.67092 -6.93829,1.9267 -50.06143,1.54876 -55.77901,-0.48885 l 0,0 z"
       style="fill:#f3ce44;fill-opacity:1;fill-rule:nonzero;stroke:none" />
    <path
       style="fill:#313133"
       d="m 193.71572,979.90069 c -6.75702,-1.82322 -12.56967,-6.39198 -16.13981,-12.68594 l -3.05892,-5.39271 0,-452 0,-452.000004 2.17635,-4 c 3.22824,-5.9333 7.71861,-10.33337 13.06524,-12.80251 l 4.75841,-2.19749 284.98473,-0.26195 284.98473,-0.26195 55.76527,55.7586 55.76527,55.758604 -0.006,404.00335 c -0.004,271.88343 -0.33958,405.20593 -1.02693,407.68066 -1.76013,6.33719 -6.99052,12.88695 -12.96749,16.23855 l -5.5,3.08414 -329,0.18708 C 260.831,981.16077 197.60718,980.95082 193.7153,979.90069 z m 578.4738,-72.34275 c 12.12501,-5.96925 20.16898,-15.67107 23.43141,-28.26055 1.55775,-6.01127 1.6279,-23.85089 0.97877,-248.91511 -0.38458,-133.34187 -0.92457,-242.80437 -1.19999,-243.25 -0.64942,-1.05078 -542.1078,-1.06409 -542.7572,-0.0133 -0.27088,0.4383 -0.80886,108.7758 -1.19551,240.75 -0.52916,180.61496 -0.41514,241.77545 0.46107,247.32236 2.57971,16.33112 13.47408,29.26137 28.78891,34.16879 5.62013,1.8009 14.04589,1.85802 245.34119,1.66345 l 239.52117,-0.2015 6.63018,-3.2641 z M 325.63433,321.76025 c 1.5175,-1.13398 3.68689,-3.30432 4.82087,-4.82296 2.04422,-2.73764 2.064,-3.57239 2.32103,-97.93821 0.24287,-89.16775 0.14817,-95.39353 -1.5,-98.60596 -0.96758,-1.8859 -3.02872,-4.3609 -4.5803,-5.5 -2.66168,-1.95407 -4.32833,-2.08683 -29.5,-2.34983 -30.7298,-0.32108 -31.88612,-0.0696 -35.92894,7.81463 l -2.25,4.3879 0,92.54471 c 0,57.19582 0.37284,93.84474 0.97612,95.94824 0.53686,1.87194 1.99936,4.51384 3.25,5.8709 4.56766,4.95633 6.3517,5.21671 33.95301,4.95544 24.17072,-0.22879 25.8412,-0.36418 28.43821,-2.30486 z m 113.39793,0.27212 c 2.82449,-1.49363 5.05209,-3.66654 6.40728,-6.25 2.06075,-3.9285 2.07745,-4.72132 2.07745,-98.6368 0,-94.4971 -0.004,-94.68181 -2.09195,-97.5 -1.15057,-1.55294 -3.57962,-3.83603 -5.39788,-5.07353 -3.22069,-2.19198 -3.98161,-2.25 -29.51017,-2.25 -25.52856,0 -26.28948,0.058 -29.51017,2.25 -1.81826,1.2375 -4.24731,3.52033 -5.39788,5.07295 -2.08266,2.8104 -2.09315,3.23601 -2.36213,95.81819 -0.17762,61.13626 0.0805,94.29752 0.75339,96.79651 0.56297,2.09069 1.99638,5.03798 3.18537,6.54953 3.97249,5.0502 6.26445,5.43125 32.92414,5.47368 23.74108,0.0378 24.74265,-0.0402 28.92255,-2.25053 z m 115.74982,-0.53917 c 7.18064,-5.12162 6.70476,1.85417 7.00419,-102.67116 l 0.26928,-94 -2.26928,-4.42601 c -4.06476,-7.92791 -5.19177,-8.1741 -35.94822,-7.85274 -25.17167,0.263 -26.83832,0.39576 -29.5,2.34983 -1.55158,1.1391 -3.60786,3.6141 -4.56951,5.5 -1.62781,3.19235 -1.74855,9.90969 -1.75,97.3632 -0.002,92.66738 0.0261,93.99141 2.04923,98.17062 1.45464,3.00487 3.27146,4.85018 6.25,6.34798 3.9951,2.00899 5.43876,2.09791 29.69922,1.82938 24.87649,-0.27536 25.57984,-0.3392 28.76509,-2.6111 z m 110.91981,1.76223 c 3.83171,-1.4518 7.3007,-4.79486 8.92164,-8.5978 1.09803,-2.57612 1.36182,-20.66971 1.41895,-97.32571 0.0663,-88.8995 -0.0303,-94.33284 -1.72766,-97.23106 -0.9888,-1.68837 -3.06731,-4.0168 -4.61889,-5.17429 -2.6771,-1.99713 -4.18434,-2.11957 -29.53568,-2.39931 -26.44648,-0.29181 -26.74845,-0.27174 -30.08699,2 -1.8548,1.26213 -4.31375,3.56511 -5.46432,5.11773 -2.08266,2.8104 -2.09315,3.23601 -2.36213,95.81819 -0.17762,61.13626 0.0805,94.29752 0.75339,96.79651 1.31514,4.88405 4.53108,8.94249 8.43198,10.64094 3.90637,1.70084 49.92311,2.00168 54.26971,0.3548 z m 116.33033,-1.18339 c 2.62884,-1.33248 5.26392,-3.67726 6.46189,-5.75 1.9647,-3.39934 2.03076,-5.34066 2.29671,-67.5 l 0.27383,-64 -2.27383,-4.42601 c -4.07306,-7.9282 -5.19875,-8.17408 -35.95277,-7.85274 -25.32856,0.26464 -26.82173,0.38527 -29.5,2.38328 -1.55158,1.15749 -3.63849,3.50032 -4.63758,5.20628 -1.70757,2.91572 -1.81071,6.98772 -1.71975,67.89267 0.10884,72.87875 -0.2348,69.54224 7.62468,74.03007 3.75304,2.14302 4.90619,2.23422 28.4497,2.25 23.48209,0.0157 24.72915,-0.0804 28.97712,-2.23355 z"
       id="path2984"
       inkscape:connector-curvature="0" />
    <rect
       y="386.29208"
       x="251.61363"
       height="200.96214"
       width="544.74536"
       id="rect3005"
       style="fill:#2c89a0;fill-rule:evenodd;stroke:none" />
  </g>
</svg>
