<?xml version="1.0" encoding="UTF-8" standalone="no"?>
<!-- Created with Inkscape (http://www.inkscape.org/) -->

<svg
   xmlns:dc="http://purl.org/dc/elements/1.1/"
   xmlns:cc="http://creativecommons.org/ns#"
   xmlns:rdf="http://www.w3.org/1999/02/22-rdf-syntax-ns#"
   xmlns:svg="http://www.w3.org/2000/svg"
   xmlns="http://www.w3.org/2000/svg"
   xmlns:sodipodi="http://sodipodi.sourceforge.net/DTD/sodipodi-0.dtd"
   xmlns:inkscape="http://www.inkscape.org/namespaces/inkscape"
   version="1.0"
   width="128"
   height="128"
   id="svg2408"
   inkscape:version="0.48.5 r10040"
   sodipodi:docname="gmusicbrowser.svg">
  <sodipodi:namedview
     pagecolor="#ffffff"
     bordercolor="#666666"
     borderopacity="1"
     objecttolerance="10"
     gridtolerance="10"
     guidetolerance="10"
     inkscape:pageopacity="0"
     inkscape:pageshadow="2"
     inkscape:window-width="1366"
     inkscape:window-height="744"
     id="namedview128"
     showgrid="false"
     inkscape:zoom="2.8284271"
     inkscape:cx="50.413861"
     inkscape:cy="96.209195"
     inkscape:window-x="0"
     inkscape:window-y="24"
     inkscape:window-maximized="1"
     inkscape:current-layer="svg2408"
     showguides="true"
     inkscape:guide-bbox="true" />
  <defs
     id="defs2410">
    <linearGradient
       x1="45.447727"
       y1="92.539597"
       x2="45.447727"
       y2="7.0165396"
       id="ButtonShadow"
       gradientUnits="userSpaceOnUse"
       gradientTransform="scale(1.0058652,0.994169)">
      <stop
         id="stop3750"
         style="stop-color:#000000;stop-opacity:1"
         offset="0" />
      <stop
         id="stop3752"
         style="stop-color:#000000;stop-opacity:0.58823532"
         offset="1" />
    </linearGradient>
    <filter
       color-interpolation-filters="sRGB"
       id="filter3174">
      <feGaussianBlur
         id="feGaussianBlur3176"
         stdDeviation="1.71" />
    </filter>
    <mask
       maskUnits="userSpaceOnUse"
       x="122.963"
       y="97.149"
       width="576.609"
       height="587.491"
       id="XMLID_23_">
      <g
         id="g31"
         style="filter:url(#Adobe_OpacityMaskFilter)">
        <radialGradient
           id="XMLID_24_"
           cx="88.977501"
           cy="-20.899401"
           r="673.11609"
           fx="88.977501"
           fy="-20.899401"
           gradientUnits="userSpaceOnUse">
          <stop
             offset="0.309"
             style="stop-color: rgb(255, 255, 255);"
             id="stop34" />
          <stop
             offset="1"
             style="stop-color: rgb(0, 0, 0);"
             id="stop36" />
        </radialGradient>
        <ellipse
           cx="295.89499"
           cy="286.172"
           rx="512.93402"
           ry="349.10599"
           id="ellipse38"
           style="fill:url(#XMLID_24_) #000000"
           sodipodi:cx="295.89499"
           sodipodi:cy="286.172"
           sodipodi:rx="512.93402"
           sodipodi:ry="349.10599" />
      </g>
    </mask>
    <mask
       maskUnits="userSpaceOnUse"
       x="243.061"
       y="279.317"
       width="252.506"
       height="187.183"
       id="XMLID_13_">
      <g
         id="g193"
         style="filter:url(#Adobe_OpacityMaskFilter_4_)">
        <linearGradient
           id="XMLID_14_"
           gradientUnits="userSpaceOnUse"
           x1="340.0488"
           y1="266.93359"
           x2="372.38071"
           y2="417.81519">
          <stop
             offset="0"
             style="stop-color: rgb(255, 255, 255);"
             id="stop196" />
          <stop
             offset="0.0867"
             style="stop-color: rgb(248, 248, 248);"
             id="stop198" />
          <stop
             offset="0.2156"
             style="stop-color: rgb(228, 228, 228);"
             id="stop200" />
          <stop
             offset="0.3708"
             style="stop-color: rgb(194, 194, 194);"
             id="stop202" />
          <stop
             offset="0.5465"
             style="stop-color: rgb(148, 148, 148);"
             id="stop204" />
          <stop
             offset="0.7394"
             style="stop-color: rgb(89, 89, 89);"
             id="stop206" />
          <stop
             offset="0.9438"
             style="stop-color: rgb(21, 21, 21);"
             id="stop208" />
          <stop
             offset="0.9944"
             style="stop-color: rgb(0, 0, 0);"
             id="stop210" />
        </linearGradient>
        <ellipse
           cx="363.052"
           cy="374.28201"
           rx="215.32401"
           ry="183.32201"
           id="ellipse212"
           style="fill:url(#XMLID_14_) #000000"
           sodipodi:cx="363.052"
           sodipodi:cy="374.28201"
           sodipodi:rx="215.32401"
           sodipodi:ry="183.32201" />
      </g>
    </mask>
    <mask
       maskUnits="userSpaceOnUse"
       x="191.541"
       y="217.631"
       width="447.197"
       height="527.73"
       id="XMLID_10_">
      <g
         id="g159">
        <radialGradient
           id="XMLID_11_"
           cx="657.2124"
           cy="155.23289"
           r="606.95343"
           fx="657.2124"
           fy="155.23289"
           gradientTransform="matrix(0.931,0,0,0.9299,28.7459,21.6629)"
           gradientUnits="userSpaceOnUse">
          <stop
             offset="0"
             style="stop-color: rgb(201, 201, 200);"
             id="stop162" />
          <stop
             offset="0.0881"
             style="stop-color: rgb(196, 196, 196);"
             id="stop164" />
          <stop
             offset="0.2192"
             style="stop-color: rgb(184, 184, 183);"
             id="stop166" />
          <stop
             offset="0.3769"
             style="stop-color: rgb(161, 160, 160);"
             id="stop168" />
          <stop
             offset="0.5556"
             style="stop-color: rgb(127, 127, 126);"
             id="stop170" />
          <stop
             offset="0.7517"
             style="stop-color: rgb(79, 79, 78);"
             id="stop172" />
          <stop
             offset="0.9595"
             style="stop-color: rgb(18, 18, 18);"
             id="stop174" />
          <stop
             offset="1"
             style="stop-color: rgb(0, 0, 0);"
             id="stop176" />
        </radialGradient>
        <circle
           cx="408.427"
           cy="444.22601"
           r="302.95401"
           id="circle178"
           style="fill:url(#XMLID_11_) #000000"
           sodipodi:cx="408.427"
           sodipodi:cy="444.22601"
           sodipodi:rx="302.95401"
           sodipodi:ry="302.95401" />
      </g>
    </mask>
    <mask
       maskUnits="userSpaceOnUse"
       x="101.57"
       y="425.034"
       width="156.907"
       height="127.553"
       id="XMLID_2_">
      <g
         id="g86">
        <linearGradient
           id="XMLID_3_"
           gradientUnits="userSpaceOnUse"
           x1="206.09081"
           y1="397.62061"
           x2="186.92191"
           y2="563.47321">
          <stop
             offset="0"
             style="stop-color: rgb(255, 255, 255);"
             id="stop89" />
          <stop
             offset="0.1111"
             style="stop-color: rgb(203, 203, 203);"
             id="stop91" />
          <stop
             offset="0.2396"
             style="stop-color: rgb(150, 150, 150);"
             id="stop93" />
          <stop
             offset="0.3698"
             style="stop-color: rgb(104, 104, 104);"
             id="stop95" />
          <stop
             offset="0.4991"
             style="stop-color: rgb(66, 66, 66);"
             id="stop97" />
          <stop
             offset="0.6273"
             style="stop-color: rgb(37, 37, 37);"
             id="stop99" />
          <stop
             offset="0.7542"
             style="stop-color: rgb(17, 17, 17);"
             id="stop101" />
          <stop
             offset="0.8792"
             style="stop-color: rgb(4, 4, 4);"
             id="stop103" />
          <stop
             offset="1"
             style="stop-color: rgb(0, 0, 0);"
             id="stop105" />
        </linearGradient>
        <ellipse
           cx="194.76401"
           cy="495.62299"
           rx="160.94"
           ry="123.604"
           id="ellipse107"
           style="fill:url(#XMLID_3_) #000000"
           sodipodi:cx="194.76401"
           sodipodi:cy="495.62299"
           sodipodi:rx="160.94"
           sodipodi:ry="123.604" />
      </g>
    </mask>
    <mask
       maskUnits="userSpaceOnUse"
       x="155.705"
       y="461.543"
       width="93.126"
       height="44.813"
       id="XMLID_26_">
      <g
         id="g69">
        <linearGradient
           id="XMLID_1_"
           gradientUnits="userSpaceOnUse"
           x1="211.7222"
           y1="562.85791"
           x2="200.0733"
           y2="466.75449">
          <stop
             offset="0"
             style="stop-color: rgb(255, 255, 255);"
             id="stop72" />
          <stop
             offset="1"
             style="stop-color: rgb(0, 0, 0);"
             id="stop74" />
        </linearGradient>
        <ellipse
           cx="203.617"
           cy="495.98801"
           rx="80.542"
           ry="59.682999"
           id="ellipse76"
           style="fill:url(#XMLID_1_) #000000"
           sodipodi:cx="203.617"
           sodipodi:cy="495.98801"
           sodipodi:rx="80.542"
           sodipodi:ry="59.682999" />
      </g>
    </mask>
    <linearGradient
       id="linearGradient3382">
      <stop
         id="stop3384"
         offset="0"
         style="stop-color:#b5b5b5;stop-opacity:1" />
      <stop
         id="stop3386"
         offset="1"
         style="stop-color:#dbdbdb;stop-opacity:1" />
    </linearGradient>
    <linearGradient
       id="linearGradient3992-5">
      <stop
         id="stop3994-3"
         offset="0"
         style="stop-color:#b5b5b5;stop-opacity:1" />
      <stop
         id="stop3996-0"
         offset="1"
         style="stop-color:#dbdbdb;stop-opacity:1" />
    </linearGradient>
    <linearGradient
       id="linearGradient3992">
      <stop
         id="stop3994"
         offset="0"
         style="stop-color:#b5b5b5;stop-opacity:1" />
      <stop
         id="stop3996"
         offset="1"
         style="stop-color:#dbdbdb;stop-opacity:1" />
    </linearGradient>
  </defs>
  <metadata
     id="metadata2413">
    <rdf:RDF>
      <cc:Work
         rdf:about="">
        <dc:format>image/svg+xml</dc:format>
        <dc:type
           rdf:resource="http://purl.org/dc/dcmitype/StillImage" />
        <dc:title></dc:title>
      </cc:Work>
    </rdf:RDF>
  </metadata>
  <g
     id="layer2"
     style="display:none"
     transform="translate(0,32)">
    <path
       d="M 11,7 C 7.676,7 5,9.676 5,13 l 0,33.6875 c 2.2377507,0.124029 4.660506,0.235683 5.875,0.4375 0.66093,0.10983 -0.08406,0.240848 -1.125,0.34375 C 8.7090622,47.571654 7.3545491,47.665119 6.84375,47.75 6.2216014,47.853382 5.6264179,47.903999 5,48 l 0,1.0625 c 0.3803657,0.03607 0.7183843,0.03125 0.9375,0.03125 0.80883,10e-7 1.1599727,0.215701 1.3125,0.5625 0.1525272,0.346797 0.09375,0.839723 0.09375,1.40625 0,0.424828 -0.9420178,0.663014 -1.15625,1.375 C 6.110939,52.691968 5.5510552,52.945524 5,53.1875 l 0,2.21875 c 0.7355867,0.02497 1.4332639,0.05671 1.84375,0.3125 C 7.1254716,55.894306 6.0687957,56.124098 5,56.3125 l 0,7.5625 c 1.1379643,0.180337 3.3100715,0.925679 3.96875,1.0625 1.090152,0.226446 1.224723,0.33476 0.875,0.4375 -0.3497231,0.102744 -1.173581,0.175172 -2,0.3125 C 6.8656638,65.850029 5.90816,66.141998 5,66.34375 L 5,86 c 0,3.324 2.676,6 6,6 l 13,0 c 0.0954,-0.438237 0.150955,-0.931178 0.25,-1.4375 0.140364,-0.717512 0.25498,-1.34159 0.375,-1.59375 0.03001,-0.06304 0.05815,-0.114053 0.09375,-0.125 0.106804,-0.03285 0.238198,0.191956 0.46875,0.78125 0.304338,0.777871 0.540174,1.646782 0.6875,2.375 l 0.75,0 c 0.276152,-0.493694 0.578538,-1.138496 0.8125,-1.4375 0.09907,-0.126629 0.275237,0.131501 0.53125,0.375 0.256014,0.2435 0.588904,0.486378 0.9375,0.375 0.648614,-0.207227 1.602807,-0.726227 2.03125,-1 0.139883,-0.08938 0.300164,-0.157976 0.40625,-0.1875 0.106087,-0.02952 0.174331,-0.01774 0.25,0 0.151339,0.03548 0.232196,0.144559 0.34375,0.28125 0.223098,0.27338 0.466785,0.656251 1.0625,0.65625 0.478344,0 0.657185,-0.0325 0.78125,0.0625 0.124065,0.095 0.197087,0.314551 0.40625,0.875 l 8.875,0 c -0.04778,-0.593879 1.040547,-2.151517 1.21875,-3.0625 0.19092,-0.975995 0.214078,-1.242419 0.28125,-1.0625 0.06717,0.179919 0.192504,0.793906 0.46875,1.5 0.110448,0.282298 0.213887,0.358235 0.3125,0.28125 0.09861,-0.07699 0.168895,-0.293948 0.25,-0.5625 0.162213,-0.537107 0.285649,-1.296709 0.34375,-1.59375 0.131129,-0.670335 0.128655,-1.786501 0.125,-2.28125 -9.11e-4,-0.123687 -0.0059,-0.217815 0,-0.25 0.01779,-0.09656 0.08067,0.312079 0.28125,1.59375 0.163819,1.046767 0.54767,2.687946 0.71875,3.5625 0.169798,0.867992 0.298106,1.322124 0.40625,1.875 l 28.21875,0 c 0.03877,-0.494956 0.03519,-1.098589 0.0625,-1.5 0.02049,-0.301057 0.06649,-0.487005 0.15625,-0.46875 0.02992,0.0061 0.05077,0.03882 0.09375,0.09375 0.233449,0.298339 0.630596,1.164908 0.96875,1.875 L 85,92 c 3.324,0 6,-2.676 6,-6 l 0,-7.21875 c -0.16942,0.0045 -0.290112,-4e-6 -0.5,0 -1.330307,0 -2.638456,-4e-6 -3.96875,0 -1.226564,0 -2.05394,-9.64e-4 -2.25,-0.0625 -0.19606,-0.06154 0.232972,-0.183183 1.46875,-0.5 C 86.405034,78.050819 89.092469,77.290673 91,76.875 L 91,38.46875 C 90.34725,38.202412 89.792969,37.980093 89.25,37.5625 89.107486,37.452886 88.801155,37.170028 88.28125,37 87.761349,36.829972 87.007124,36.743855 86,36.9375 c -1.533473,0.294852 -1.685602,0.283469 -1.25,0.15625 0.4356,-0.127221 1.468635,-0.381012 2.25,-0.53125 1.152717,-0.221645 2.722214,-1.204246 4,-1.84375 l 0,-4.5625 c -0.69831,-0.257978 -1.422206,-0.558272 -1.75,-1.0625 -0.209707,-0.322576 -0.321618,-0.513018 -0.3125,-0.625 0.0091,-0.111981 0.13299,-0.149124 0.25,-0.1875 0.117011,-0.03837 0.261032,-0.05449 0.375,-0.15625 0.11397,-0.101759 0.187497,-0.291619 0.1875,-0.59375 0,-0.32292 0.08246,-0.887065 0.0625,-1.40625 -0.01,-0.259593 -0.03562,-0.49724 -0.125,-0.6875 -0.08939,-0.19026 -0.219089,-0.333004 -0.4375,-0.375 -0.574572,-0.110478 -0.848143,-0.233682 -0.90625,-0.34375 -0.05811,-0.110067 0.07208,-0.18937 0.28125,-0.28125 0.418339,-0.18376 1.132532,-0.339398 1.125,-0.34375 -0.668701,-0.385725 -5.247169,-0.921226 -5,-0.96875 0.332574,-0.06395 0.667437,-0.123553 1,-0.1875 1.047644,-0.201439 2.43278,-0.309227 3.75,-0.5625 0.573261,-0.110227 0.911769,-0.250569 1.125,-0.4375 0.213229,-0.18693 0.294201,-0.423258 0.375,-0.625 L 91,13 C 91,9.676 88.324,7 85,7 L 33.625,7 C 33.72158,8.3975706 33.82658,9.959362 33.53125,9.1875 33.320827,8.6375466 33.210422,8.0499534 33,7.5 32.946762,7.3608606 32.903941,7.1705291 32.84375,7 L 30.8125,7 C 30.571803,7.4923127 30.362863,7.9708281 30.03125,8.1875 29.524321,8.5187294 29.245447,8.6821159 29,8.59375 28.754552,8.5053839 28.523162,8.1669814 28.15625,7.6875 27.992502,7.4735174 27.721718,7.2560338 27.40625,7 l -6.8125,0 -1.3125,5.5625 L 17.53125,7 17.3125,7 15.5625,15.9375 14.15625,7 11,7 z"
       inkscape:connector-curvature="0"
       id="rect3745"
       style="opacity:0.9;fill:url(#ButtonShadow);fill-opacity:1;fill-rule:nonzero;stroke:none;filter:url(#filter3174)" />
  </g>
  <path
     sodipodi:type="arc"
     style="fill:#005c94;fill-opacity:0;fill-rule:nonzero;stroke:#d45500;stroke-width:8.42870425999999995;stroke-linecap:round;stroke-linejoin:miter;stroke-miterlimit:4;stroke-opacity:1;stroke-dasharray:none"
     id="path3858"
     sodipodi:cx="68.412582"
     sodipodi:cy="67.89592"
     sodipodi:rx="65.230598"
     sodipodi:ry="63.286057"
     d="m 133.64318,67.89592 a 65.230598,63.286057 0 1 1 -130.4611961,0 65.230598,63.286057 0 1 1 130.4611961,0 z"
     transform="matrix(0.8764533,0,0,0.9033834,4.1608906,2.1890751)" />
  <g
     id="g3054"
     transform="matrix(0.57684241,0,0,0.57684241,23.010688,23.618729)"
     style="fill:#d45500">
    <path
       id="path3056"
       d="m 140.901,29.936 c -0.343,-0.431 -0.692,-0.944 -1.16,-1.171 -2.174,-1.056 -4.37,-2.076 -6.601,-3.004 -1.046,-0.435 -1.836,-0.989 -2.141,-2.12 -0.066,-0.245 -0.185,-0.511 -0.361,-0.686 -1.101,-1.092 -1.111,-1.09 0.198,-1.925 0.171,-0.109 0.384,-0.153 0.424,-0.168 -0.101,-0.534 -0.156,-0.956 -0.27,-1.362 -0.055,-0.197 -0.185,-0.412 -0.345,-0.534 -0.787,-0.593 -1.721,-1.045 -2.36,-1.763 -0.629,-0.707 -1.271,-0.672 -2.036,-0.6 -0.256,0.024 -0.616,0.032 -0.771,-0.116 -0.9,-0.87 -2.14,-0.446 -3.194,-0.814 -0.919,-0.321 -2.188,0.366 -3.303,0.6 -0.155,0.032 -0.343,0.072 -0.477,0.016 -1.911,-0.805 -3.524,-0.314 -4.826,1.191 -0.064,0.333 -0.153,0.712 -0.391,0.897 -0.906,0.702 -1.925,1.27 -2.776,2.028 -0.594,0.529 -1.221,1.228 -1.399,1.957 -0.179,0.734 -0.532,0.986 -1.108,1.169 -0.62,0.196 -1.191,0.387 -1.213,1.214 -0.006,0.206 -0.383,0.38 -0.462,0.612 -0.167,0.489 -0.269,1.004 -0.361,1.514 -0.051,0.283 0.062,0.626 -0.059,0.859 -0.431,0.837 -0.953,1.627 -1.397,2.457 -0.389,0.725 -1.098,1.551 -0.979,2.207 0.144,0.792 -0.053,1.566 0.13,2.288 0.307,1.216 -0.292,2.071 -0.853,3 -0.458,0.757 -0.914,1.534 -1.226,2.356 -0.275,0.727 -0.84,1.428 -0.396,2.336 0.111,0.227 -0.168,0.662 -0.304,0.986 -0.125,0.298 -0.396,0.564 -0.432,0.864 -0.172,1.434 -0.255,2.879 -0.429,4.313 -0.218,1.799 -0.701,3.486 -2.191,4.709 -1.551,1.273 -3.161,1.273 -4.521,-0.183 -1.034,-1.107 -1.993,-2.302 -2.858,-3.546 -2.436,-3.502 -4.809,-7.049 -7.199,-10.583 -0.106,-0.156 -0.218,-0.37 -0.197,-0.54 0.142,-1.12 -0.538,-1.838 -1.299,-2.402 -0.808,-0.599 -0.963,-1.168 -0.215,-2.008 -0.652,-0.313 -1.258,-0.51 -1.75,-0.865 -0.544,-0.393 -1.151,-0.848 -1.432,-1.423 -0.493,-1.007 -0.439,-2.272 -1.463,-3.041 -0.072,-0.054 -0.007,-0.265 -0.056,-0.383 -0.208,-0.501 -0.422,-1 -0.659,-1.488 -0.155,-0.32 -0.49,-0.611 -0.507,-0.928 -0.058,-1.106 -0.057,-2.22 0.008,-3.325 0.043,-0.728 0.245,-1.446 0.348,-2.173 0.027,-0.186 -0.015,-0.402 -0.087,-0.579 -0.308,-0.758 -0.693,-1.489 -0.941,-2.264 -0.138,-0.434 -0.062,-0.937 -0.083,-1.409 0.209,-0.983 -1.918,-0.791 -0.937,-2.357 -0.254,-0.2 -0.55,-0.372 -0.761,-0.617 -0.226,-0.262 -0.595,-0.69 -0.514,-0.876 0.435,-0.992 -0.24,-1.118 -0.89,-1.347 C 71.056,10.64 70.309,10.324 69.555,10.028 69.585,9.94 69.614,9.852 69.644,9.765 68.47,9.925 67.283,10.381 66.161,9.558 66.012,9.449 65.752,9.351 65.602,9.407 64.408,9.847 63.433,9.294 62.488,8.885 62.04,9.217 61.585,9.432 61.105,9.537 c -1.075,0.237 -2.161,0.42 -3.243,0.626 -0.032,0.006 -0.066,0.02 -0.091,0.041 -0.452,0.394 -0.903,0.789 -1.385,1.212 0.604,1.167 0.288,1.078 -0.746,1.362 -0.313,0.086 -0.613,0.289 -0.868,0.499 -0.221,0.182 -0.402,0.433 -0.548,0.684 -0.52,0.895 -1.019,1.802 -1.517,2.709 -0.017,0.031 0.052,0.119 0.093,0.17 0.701,0.868 0.328,1.764 0.188,2.714 -0.123,0.838 0.002,1.768 0.25,2.588 0.181,0.599 0.738,1.084 1.237,1.771 0.433,-0.061 1.053,0.029 0.985,0.999 -0.03,0.428 -0.028,0.866 -0.121,1.281 -0.333,1.48 -0.685,2.957 -1.072,4.424 -0.053,0.201 -0.312,0.408 -0.523,0.497 -1.307,0.549 -3.59,-0.656 -3.84,-2.216 -0.297,-1.85 -0.276,-3.75 -0.454,-5.622 -0.056,-0.586 -0.327,-1.149 -0.463,-1.731 -0.064,-0.276 -0.167,-0.73 -0.038,-0.832 0.639,-0.507 0.142,-0.892 -0.093,-1.259 -0.542,-0.843 -0.513,-0.951 0.602,-1.263 -0.488,-0.714 -0.959,-1.403 -1.437,-2.102 0.274,-0.235 0.463,-0.396 0.753,-0.643 -0.717,-0.587 -1.413,-1.092 -2.022,-1.685 -0.271,-0.264 -0.368,-0.707 -0.544,-1.068 -0.456,-0.971 -1.944,-0.678 -2.33,-1.942 -0.031,-0.1 -0.291,-0.194 -0.437,-0.185 -0.554,0.036 -1.117,0.068 -1.655,0.192 -0.818,0.188 -1.554,0.448 -2.46,0.096 -1.296,-0.503 -2.685,-0.782 -4.048,-1.094 -0.768,-0.176 -1.428,0.028 -1.83,0.817 -0.103,0.201 -0.397,0.388 -0.629,0.426 -1.33,0.216 -1.784,1.285 -2.309,2.164 0.259,0.444 0.469,0.805 0.786,1.35 -2.141,0.162 -3.623,0.999 -4.35,2.453 0.217,0.52 0.585,1.007 0.47,1.191 -0.882,1.41 -0.533,2.851 -0.286,4.301 0.928,0.089 0.789,0.179 1.305,0.981 0.495,0.769 0.299,2.084 1.917,2.234 -0.597,2.002 -1.089,3.927 -1.753,5.791 -0.567,1.591 -1.472,3.068 -1.973,4.674 -0.517,1.659 -1.39,3.023 -2.538,4.271 -1.323,1.438 -2.743,2.807 -3.911,4.364 -2.448,3.264 -4.357,6.834 -5.508,10.779 -0.302,1.035 -0.516,2.144 -1.052,3.053 -2.535,4.294 -4.598,8.729 -5.422,13.722 -0.373,2.257 -0.203,4.308 0.83,6.283 0.595,1.137 0.601,2.18 -0.013,3.273 -0.257,0.457 -0.794,1.075 -0.659,1.379 0.624,1.409 -0.587,2.291 -0.8,3.436 -0.101,0.542 -0.218,1.081 -0.303,1.496 0.884,-0.442 1.713,-0.838 2.523,-1.271 0.392,-0.209 0.89,-0.401 1.099,-0.746 1.663,-2.752 2.18,-4.359 -0.016,-7.189 -0.786,-1.014 -1.111,-2.107 -1.178,-3.362 -0.106,-2.015 0.287,-3.947 0.914,-5.827 0.413,-1.239 1.001,-2.423 1.562,-3.608 0.1,-0.211 0.451,-0.303 0.686,-0.45 0.084,0.232 0.227,0.46 0.241,0.696 0.086,1.42 0.118,2.843 0.22,4.262 0.054,0.75 0.17,1.501 0.329,2.236 0.581,2.697 1.226,5.385 0.505,8.13 1.727,0.785 -0.098,1.717 0.216,2.536 1.064,0.22 1.082,0.282 0.603,1.257 -0.536,1.09 -1.109,2.17 -1.531,3.304 -0.293,0.787 -0.758,1.672 0.09,2.474 0.092,0.087 0.098,0.385 0.022,0.514 -1.117,1.898 1.206,3.182 0.872,4.933 -0.003,0.018 0.041,0.053 0.069,0.068 0.951,0.528 0.662,1.654 1.165,2.427 0.543,0.833 1.061,1.771 0.698,2.888 -0.042,0.127 0.269,0.352 0.383,0.55 0.207,0.362 0.458,0.719 0.57,1.113 0.693,2.429 0.696,4.805 -0.58,7.087 -0.366,0.656 -0.614,1.377 -0.929,2.062 -0.662,1.441 -0.634,2.859 0.129,4.252 0.443,0.808 0.939,1.588 1.342,2.415 0.22,0.454 0.431,0.984 0.412,1.471 -0.118,2.967 0.468,5.855 1.113,8.702 0.495,2.182 0.528,4.266 -0.022,6.398 -0.425,1.647 0.057,2.584 1.734,2.904 3.115,0.594 6.257,1.302 9.356,-0.053 0.173,-1.781 -0.004,-2.197 -1.431,-3.055 -2.385,-1.435 -4.357,-3.278 -5.304,-5.935 -0.633,-1.775 -1.074,-3.639 -1.395,-5.498 -0.233,-1.355 -0.397,-2.824 -0.119,-4.143 0.566,-2.684 0.768,-5.291 0.01,-7.964 -0.186,-0.655 -0.023,-1.431 0.068,-2.139 0.179,-1.392 1.271,-2.14 2.145,-3.09 1.266,-1.378 2.305,-2.964 3.466,-4.442 0.155,-0.198 0.492,-0.426 0.68,-0.379 0.205,0.051 0.448,0.391 0.479,0.63 0.177,1.407 0.417,2.822 0.406,4.233 -0.014,1.879 -0.246,3.756 -0.368,5.635 -0.163,2.509 0.391,4.917 1.209,7.252 0.816,2.327 1.365,4.649 1.218,7.151 -0.133,2.257 10e-4,4.529 -0.047,6.793 -0.017,0.796 0.364,1.385 0.97,1.59 2.828,0.957 5.638,2.272 8.736,1.053 0.506,-0.199 1.003,-0.544 1.518,-0.57 0.905,-0.046 0.952,-0.578 0.689,-1.125 -0.208,-0.434 -0.64,-0.878 -1.08,-1.065 -3.102,-1.313 -5.195,-3.681 -6.555,-6.618 -0.727,-1.571 -0.94,-3.395 -1.281,-5.125 -0.455,-2.308 -0.472,-4.579 0.235,-6.906 0.394,-1.295 0.523,-2.908 0.109,-4.159 -0.73,-2.205 -0.567,-4.139 0.691,-5.973 0.801,-1.168 1.826,-2.181 2.724,-3.285 1.582,-1.945 3.228,-3.875 3.798,-6.397 0.262,-1.157 0.743,-2.117 1.655,-2.833 1.228,-0.964 1.958,-2.17 2.209,-3.724 0.169,-1.048 0.399,-1.109 1.364,-0.674 0.518,-0.513 1.068,-0.999 1.545,-1.548 0.511,-0.588 0.919,-0.758 1.505,-0.057 0.982,1.176 2.227,1.84 3.827,1.713 0.233,-0.019 0.633,0.167 0.706,0.356 0.306,0.788 0.912,0.828 1.608,0.841 0.685,0.013 1.572,-0.126 2.013,0.237 1.152,0.948 2.536,0.823 3.812,1.099 0.755,0.163 0.85,0.479 0.785,1.062 -0.031,0.283 -0.121,0.56 -0.166,0.762 0.789,0.121 1.229,0.376 0.991,1.225 -0.194,0.691 -0.417,1.384 -0.501,2.092 -0.049,0.415 0.12,0.868 0.242,1.288 0.112,0.384 0.307,0.742 0.441,1.12 0.333,0.941 0.613,1.903 0.993,2.823 0.239,0.578 0.497,1.351 0.969,1.582 0.687,0.337 0.774,0.767 0.855,1.376 0.054,0.404 0.17,1.055 0.411,1.135 0.876,0.291 0.95,1.109 1.367,1.698 0.259,0.365 0.494,0.864 0.858,1.014 0.619,0.255 0.726,0.631 0.759,1.216 0.077,1.347 0.079,2.725 0.38,4.028 1.096,4.744 1.126,9.473 0.219,14.246 -0.374,1.967 -0.664,3.965 -0.773,5.961 -0.074,1.348 -0.209,2.6 -0.864,3.808 -0.379,0.7 -0.354,1.462 0.386,2.038 1.828,1.424 3.735,2.621 6.205,2.348 1.321,-0.146 2.653,-0.224 3.961,-0.448 0.48,-0.082 0.962,-0.429 1.339,-0.77 0.475,-0.43 0.45,-0.926 -0.134,-1.32 -0.519,-0.35 -1.051,-0.69 -1.53,-1.089 -0.933,-0.777 -1.858,-1.568 -2.743,-2.4 -1.361,-1.28 -1.598,-2.981 -1.624,-4.724 -0.038,-2.597 0.114,-5.207 -0.094,-7.788 -0.16,-1.979 0.253,-3.686 1.273,-5.322 0.417,-0.668 0.861,-1.334 1.163,-2.055 0.763,-1.823 1.332,-3.718 1.005,-5.718 -0.264,-1.611 0.697,-2.957 0.798,-4.478 0.012,-0.191 0.235,-0.391 0.399,-0.546 0.903,-0.853 1.829,-1.682 2.723,-2.544 0.35,-0.338 0.64,-0.738 0.957,-1.111 0.25,0.466 0.525,0.92 0.746,1.4 1.094,2.369 1.552,4.862 1.61,7.47 0.034,1.501 0.275,3.005 0.528,4.491 0.252,1.484 0.858,2.937 0.919,4.419 0.204,4.912 0.275,9.832 0.297,14.749 0.006,1.26 -0.39,2.518 -0.54,3.784 -0.067,0.563 -0.599,1.206 0.187,1.701 1.121,0.707 2.258,1.346 3.649,1.29 1.821,-0.073 3.641,-0.171 5.463,-0.187 1.087,-0.009 2.176,0.105 3.261,0.19 0.804,0.063 0.918,-0.383 0.74,-0.994 -0.089,-0.305 -0.245,-0.66 -0.485,-0.838 -0.941,-0.696 -1.873,-1.438 -2.911,-1.959 -1.234,-0.619 -2.356,-1.352 -2.663,-2.718 -0.347,-1.541 -1.306,-2.612 -2.218,-3.785 -0.449,-0.578 -0.791,-1.394 -0.82,-2.117 -0.098,-2.494 -0.052,-4.995 -0.029,-7.493 0.006,-0.659 0.023,-1.347 0.208,-1.97 0.896,-3.02 1.146,-6.125 1.412,-9.241 0.165,-1.935 0.501,-3.883 2.315,-5.119 0.159,-0.109 0.388,-0.287 0.388,-0.433 0.004,-1.578 1.315,-2.072 2.273,-2.895 0.44,-0.378 0.803,-0.968 0.959,-1.529 0.359,-1.285 0.436,-2.659 0.882,-3.905 0.351,-0.982 1.017,-1.879 1.67,-2.714 0.335,-0.428 1.008,-0.576 1.42,-0.965 0.467,-0.441 0.781,-0.211 1.076,0.109 0.186,0.201 0.259,0.506 0.39,0.778 1.069,-0.775 2.392,0.503 3.368,-0.545 0.025,-0.027 0.218,0.128 0.342,0.163 0.156,0.045 0.39,0.137 0.472,0.068 1.129,-0.95 2.235,-1.928 3.352,-2.892 0.312,-0.27 0.659,-0.501 0.96,-0.781 0.505,-0.471 1.107,-0.897 1.441,-1.474 0.283,-0.489 0.459,-0.859 1.084,-0.974 0.291,-0.053 0.543,-0.476 0.751,-0.775 0.183,-0.262 0.24,-0.611 0.42,-0.875 1.467,-2.148 3.428,-3.879 4.656,-6.284 0.76,-1.49 1.343,-2.959 1.694,-4.539 0.145,-0.651 0.259,-1.125 0.896,-1.134 0.147,-0.692 0.126,-1.39 0.433,-1.885 0.972,-1.57 0.855,-3.528 1.899,-5.06 0.156,-0.228 0.144,-0.572 0.202,-0.864 0.302,-1.514 0.984,-2.995 0.407,-4.588 -0.01,-0.029 -0.011,-0.076 0.005,-0.098 0.873,-1.148 0.402,-2.363 0.191,-3.57 -0.09,-0.516 -0.177,-1.039 -0.194,-1.561 -0.031,-0.923 -0.008,-1.848 -0.009,-2.773 -10e-4,-0.896 -0.525,-1.683 0.123,-2.724 0.545,-0.876 0.321,-2.215 0.502,-3.338 0.138,-0.855 0.354,-1.7 0.591,-2.534 0.057,-0.201 0.329,-0.342 0.501,-0.51 0.143,0.19 0.287,0.38 0.339,0.449 0.187,-0.377 0.403,-0.813 0.619,-1.249 0.228,0.224 0.455,0.448 0.673,0.662 1.039,-0.371 1.372,-1.288 1.658,-2.262 0.127,-0.432 0.288,-0.89 0.566,-1.228 0.174,-0.212 0.594,-0.223 1.099,-0.388 1.121,-2.219 1.121,-2.221 3.65,-1.982 0.194,0.018 0.387,0.133 0.576,0.121 1.105,-0.071 2.476,0.21 3.248,-0.342 1.134,-0.81 1.858,-2.207 2.708,-3.389 0.13,-0.181 0.105,-0.619 -0.027,-0.82 -0.536,-0.812 -1.124,-1.6 -1.734,-2.367 z"
       inkscape:connector-curvature="0"
       style="fill:#d45500" />
  </g>
  <g
     id="g3856"
     transform="matrix(0.99999362,-0.00357074,0.00357074,0.99999362,0.92675539,-0.05531292)">
    <rect
       transform="matrix(0.93267969,-0.36070568,0.36070568,0.93267969,0,0)"
       ry="1.875"
       y="60.704613"
       x="67.093674"
       height="6.21875"
       width="3.75"
       id="rect3854"
       style="fill:#ac9393;fill-rule:evenodd;stroke:none" />
    <path
       transform="matrix(1.5701754,0,0,1.5701754,-46.825498,-21.345052)"
       d="m 90.156113,38.904545 c 0,1.757359 -1.503767,3.18198 -3.358757,3.18198 -1.854991,0 -3.358758,-1.424621 -3.358758,-3.18198 0,-1.75736 1.503767,-3.181981 3.358758,-3.181981 1.85499,0 3.358757,1.424621 3.358757,3.181981 z"
       sodipodi:ry="3.1819806"
       sodipodi:rx="3.3587573"
       sodipodi:cy="38.904545"
       sodipodi:cx="86.797356"
       id="path3066-5"
       style="fill:#916f6f;fill-opacity:1;fill-rule:evenodd;stroke:none"
       sodipodi:type="arc" />
    <path
       transform="matrix(0.85645933,0,0,0.85645933,15.128012,6.3279977)"
       d="m 90.156113,38.904545 c 0,1.757359 -1.503767,3.18198 -3.358757,3.18198 -1.854991,0 -3.358758,-1.424621 -3.358758,-3.18198 0,-1.75736 1.503767,-3.181981 3.358758,-3.181981 1.85499,0 3.358757,1.424621 3.358757,3.181981 z"
       sodipodi:ry="3.1819806"
       sodipodi:rx="3.3587573"
       sodipodi:cy="38.904545"
       sodipodi:cx="86.797356"
       id="path3066"
       style="fill:#cccccc;fill-opacity:1;fill-rule:evenodd;stroke:none"
       sodipodi:type="arc" />
  </g>
  <path
     inkscape:connector-curvature="0"
     id="path3882"
     d="m 90.327087,41.542444 c -0.0578,-0.01348 -0.122822,-0.126315 -0.119903,-0.208067 0.002,-0.0557 0.04827,-0.09152 0.09763,-0.07557 0.03033,0.0098 0.03916,0.01997 0.02976,0.03431 -0.0033,0.005 -0.01469,0.0042 -0.0254,-0.0018 -0.04412,-0.02459 -0.06916,-0.0086 -0.07132,0.04543 -0.0017,0.0425 0.04123,0.137132 0.07459,0.164491 0.0299,0.02449 0.0766,0.02254 0.08899,-0.0037 0.01109,-0.02352 -0.01464,-0.07957 -0.03584,-0.07807 -0.02682,0.0019 -0.02537,-0.01556 0.0021,-0.02475 0.02414,-0.0081 0.02766,-0.0055 0.05024,0.03627 0.02077,0.03852 0.02238,0.04833 0.01059,0.06872 -0.01879,0.03263 -0.06369,0.05155 -0.101419,0.04278 z m 0.251475,-0.112723 c -0.0423,-0.01535 -0.02759,-0.04011 0.01591,-0.02676 0.03143,0.0097 0.06014,-0.02337 0.05289,-0.06079 -0.0046,-0.02408 -0.0142,-0.02989 -0.0839,-0.05118 -0.066,-0.02016 -0.0808,-0.02872 -0.09205,-0.05323 -0.02392,-0.05211 0.01426,-0.105289 0.07329,-0.102102 0.01191,6.13e-4 0.02442,0.0071 0.0278,0.01429 0.0078,0.0166 0.0032,0.01858 -0.03153,0.01353 -0.02179,-0.0031 -0.03116,1.2e-4 -0.04193,0.01453 -0.02104,0.02814 4.03e-4,0.06279 0.04662,0.07534 0.09699,0.02635 0.113031,0.03426 0.126105,0.06222 0.0267,0.05711 -0.03663,0.134622 -0.09322,0.114093 z m 0.173232,-0.09016 c -0.0327,-0.0092 -0.03807,-0.01533 -0.07454,-0.08566 -0.04262,-0.08217 -0.05056,-0.125374 -0.02961,-0.161715 0.03402,-0.05909 0.111019,-0.0433 0.158718,0.03249 0.07986,0.126909 0.05008,0.244173 -0.05457,0.214875 z m 0.0679,-0.04436 c 0.01778,-0.04902 -0.0346,-0.175591 -0.08354,-0.201804 -0.03906,-0.02094 -0.0486,-0.01887 -0.0646,0.01402 -0.01241,0.02551 -0.01052,0.03354 0.02635,0.112408 0.03318,0.07096 0.04397,0.08673 0.06558,0.09581 0.03086,0.01297 0.04607,0.0074 0.05618,-0.02042 z m 0.128918,-0.03495 c -0.03392,-0.0073 -0.06055,-0.04229 -0.105725,-0.138905 -0.03946,-0.08439 -0.04659,-0.119714 -0.0223,-0.110926 0.0041,0.0015 0.03252,0.05136 0.06312,0.110741 0.04355,0.08465 0.05978,0.108967 0.07499,0.11255 0.02309,0.0054 0.03495,6.05e-4 0.04775,-0.01935 0.0073,-0.01137 -0.0016,-0.04119 -0.03927,-0.130668 -0.03414,-0.08127 -0.04595,-0.118578 -0.03927,-0.124863 0.0073,-0.0068 0.0223,0.01848 0.06426,0.108235 0.04921,0.105237 0.05383,0.119852 0.04525,0.143466 -0.01085,0.02991 -0.05804,0.05632 -0.08879,0.04968 z m 0.355542,-0.16127 c -0.01132,-0.0018 -0.02901,-0.03377 -0.07088,-0.128225 l -0.05577,-0.125884 0.04097,-0.02247 c 0.02255,-0.01231 0.05162,-0.02193 0.06468,-0.02119 0.06949,0.0038 0.153975,0.173442 0.116485,0.234022 -0.01726,0.02791 -0.07561,0.06686 -0.09549,0.06374 z m 0.07305,-0.08469 c 0.01048,-0.07299 -0.0631,-0.190721 -0.115897,-0.18545 -0.05548,0.0055 -0.05581,0.0176 -0.0036,0.129188 0.02618,0.05598 0.05157,0.103203 0.05636,0.104963 0.02144,0.0078 0.05924,-0.02141 0.06317,-0.0487 z m 0.107119,-0.01179 c -0.0412,-0.01025 -0.02969,-0.0273 0.01666,-0.02467 0.03774,0.0021 0.03901,0.0015 0.04934,-0.02301 0.006,-0.01416 0.0054,-0.03637 -0.0013,-0.0507 -0.0095,-0.02035 -0.02405,-0.02778 -0.07203,-0.03678 -0.09133,-0.01715 -0.119914,-0.04776 -0.09884,-0.105851 0.01404,-0.03871 0.04483,-0.05526 0.08449,-0.04536 0.03889,0.0097 0.03042,0.02867 -0.011,0.02467 -0.03106,-0.003 -0.03341,-0.0018 -0.04566,0.02334 -0.0114,0.02343 -0.01037,0.02868 0.0088,0.04502 0.01194,0.01018 0.0457,0.02279 0.07502,0.02802 0.02932,0.0052 0.06276,0.0192 0.07432,0.03105 0.05599,0.05743 -0.0013,0.153799 -0.07975,0.134269 z m 0.259329,-0.10805 c -0.0097,7.74e-4 -0.02904,-0.03291 -0.07352,-0.128025 l -0.06037,-0.129121 0.04926,-0.02303 c 0.0746,-0.03488 0.121901,-0.0088 0.122651,0.06761 2.27e-4,0.02268 0.0043,0.02932 0.02276,0.03711 0.05244,0.02204 0.06202,0.113044 0.01453,0.13825 -0.01083,0.0057 -0.02925,0.01622 -0.04093,0.02333 -0.01172,0.007 -0.02719,0.01333 -0.03444,0.01389 z m 0.07231,-0.07693 c 0.02184,-0.05197 -0.04206,-0.100348 -0.09064,-0.06865 -0.01631,0.01061 -0.01687,0.01893 -0.0038,0.053 0.0084,0.02226 0.02016,0.04502 0.02607,0.05057 0.01451,0.01404 0.05694,-0.0076 0.06841,-0.03497 z m -0.0649,-0.128894 c 0.0098,-0.01995 -0.0083,-0.05405 -0.03366,-0.06326 -0.01183,-0.0043 -0.0313,-0.0016 -0.0436,0.006 -0.01974,0.01221 -0.02047,0.01829 -0.0066,0.05445 0.01011,0.02634 0.02092,0.04144 0.03086,0.04262 0.01644,0.002 0.04176,-0.01699 0.05305,-0.03979 z m 0.164609,0.111969 c -0.01847,-0.0138 -0.112747,-0.207211 -0.11471,-0.23542 -9.38e-4,-0.01263 0.01177,-0.02277 0.05212,-0.04164 0.03326,-0.01555 0.0528,-0.0206 0.05197,-0.01337 -7.93e-4,0.0063 -0.01744,0.01908 -0.0371,0.02828 l -0.03576,0.01672 0.0247,0.04575 c 0.02407,0.04463 0.02546,0.04548 0.05511,0.03495 0.01673,-0.0059 0.03207,-0.0073 0.03407,-0.003 0.002,0.0043 -0.0089,0.01522 -0.02414,0.02424 -0.02747,0.01626 -0.02757,0.01698 -0.0064,0.06917 l 0.02136,0.05277 0.03575,-0.01671 c 0.04028,-0.01884 0.0621,-0.01309 0.03545,0.0093 -0.03587,0.03016 -0.07455,0.04225 -0.09238,0.02893 z M 92.37606,40.59207 c -0.01188,-0.0056 -0.03297,-0.04426 -0.07039,-0.128832 l -0.05342,-0.120857 0.05551,-0.02927 c 0.03714,-0.01957 0.05506,-0.02522 0.05411,-0.01713 -7.56e-4,0.0066 -0.01686,0.01934 -0.03575,0.02817 -0.03689,0.01725 -0.04068,0.03084 -0.02058,0.07382 0.01392,0.02977 0.03619,0.03894 0.06353,0.02616 0.01133,-0.0053 0.02246,-0.0056 0.02479,-6.63e-4 0.0023,0.0049 -0.0078,0.01459 -0.0225,0.02145 -0.03008,0.01407 -0.03021,0.03826 -4.45e-4,0.08874 0.01599,0.02712 0.01953,0.02807 0.05424,0.01508 0.04793,-0.01799 0.07303,-0.01037 0.03114,0.0094 -0.01697,0.008 -0.03814,0.0207 -0.04707,0.02819 -0.0094,0.0079 -0.02335,0.01028 -0.03315,0.0057 z m -2.423796,1.122236 c -0.0091,-0.01953 -0.05193,-0.224353 -0.05281,-0.252772 -0.0011,-0.03483 0.02144,-0.04025 0.04807,-0.01155 0.02087,0.02243 0.156745,0.192587 0.160843,0.201351 9.31e-4,0.002 -0.0039,0.0063 -0.01085,0.0096 -0.007,0.0033 -0.02596,-0.0087 -0.04243,-0.02655 -0.02744,-0.0298 -0.03232,-0.03128 -0.06038,-0.01815 -0.02787,0.01303 -0.02996,0.01776 -0.02397,0.05399 0.0065,0.03928 -0.0063,0.07 -0.01845,0.04412 z m 0.04857,-0.143503 c -0.0015,-0.02065 -0.05437,-0.08141 -0.06145,-0.07059 -0.0077,0.01179 0.0085,0.07332 0.02301,0.08734 0.01446,0.01393 0.03983,0.0029 0.03844,-0.01676 z m 0.07505,-0.05897 c -0.04698,-0.100488 -0.05804,-0.130991 -0.04814,-0.132163 0.0075,-8.76e-4 0.02309,0.01724 0.03729,0.0435 0.01336,0.0248 0.02809,0.04331 0.0327,0.04116 0.0046,-0.0022 0.0091,-0.02847 0.01007,-0.05851 9.59e-4,-0.03003 0.0048,-0.05936 0.0086,-0.06517 0.01543,-0.02355 0.02458,-8.97e-4 0.02078,0.05152 -0.0022,0.03056 -0.0011,0.06172 0.0024,0.06923 0.0035,0.0075 0.03358,0.03507 0.06683,0.06125 0.06948,0.0547 0.06956,0.0548 0.05067,0.06363 -0.0087,0.0041 -0.03299,-0.0098 -0.06306,-0.036 -0.06888,-0.06008 -0.08814,-0.04425 -0.04872,0.04005 0.01365,0.02921 0.01497,0.04122 0.0051,0.04585 -0.01133,0.0053 -0.02301,-0.0142 -0.0745,-0.124331 z m 0.413043,-0.05033 c -0.0039,-0.0082 -0.002,-0.01551 0.0041,-0.01622 0.0061,-7.35e-4 0.01293,0.0026 0.01511,0.0072 0.0022,0.0047 3.07e-4,0.01199 -0.0041,0.01622 -0.0044,0.0042 -0.01127,9.66e-4 -0.0151,-0.0072 z m 0.614268,-0.284339 c -0.0058,-0.0055 -0.03365,-0.06276 -0.06211,-0.127179 -0.04844,-0.109738 -0.05059,-0.117653 -0.03402,-0.125404 0.0138,-0.0065 0.03009,0.0039 0.07423,0.04715 0.103578,0.10152 0.104015,0.10151 0.06225,-9.44e-4 -0.02496,-0.06117 -0.03396,-0.09387 -0.02759,-0.09988 0.0073,-0.0068 0.02356,0.02118 0.07055,0.121673 0.0564,0.12063 0.0598,0.131206 0.04466,0.138284 -0.01238,0.0058 -0.03439,-0.0093 -0.08986,-0.06168 -0.04041,-0.03814 -0.07712,-0.06763 -0.0816,-0.06554 -0.0044,0.0021 0.0087,0.03985 0.02929,0.08389 0.03403,0.07278 0.04075,0.115217 0.0142,0.08962 z m 0.550218,-0.2513 c -0.0148,-0.0054 -0.01582,-0.01777 -0.002,-0.02425 0.0074,-0.0035 0.01521,-0.0025 0.01737,0.0021 0.0053,0.0113 -0.0049,0.02593 -0.01543,0.02211 z m 0.408714,-0.324773 -0.05489,-0.1174 -0.02931,0.0015 -0.02932,0.0015 0.02495,-0.01939 c 0.04584,-0.03553 0.118063,-0.04571 0.07591,-0.01071 -0.01421,0.01183 -0.01136,0.0222 0.03549,0.128404 0.03638,0.08253 0.04827,0.118102 0.04151,0.124497 -0.0073,0.0068 -0.02231,-0.01851 -0.06436,-0.108443 z m 0.143302,-0.067 -0.05489,-0.1174 -0.0293,0.0015 -0.02931,0.0015 0.02804,-0.02172 c 0.01542,-0.01196 0.04363,-0.02515 0.06269,-0.02933 l 0.03465,-0.0076 -0.01973,0.0213 -0.01973,0.0213 0.05067,0.114971 c 0.03616,0.08207 0.04799,0.117518 0.04123,0.123912 -0.0073,0.0068 -0.02231,-0.01851 -0.06436,-0.108444 z m 0.271467,-0.143034 -0.06107,-0.130613 0.05218,-0.0244 c 0.04296,-0.02009 0.05732,-0.02238 0.08135,-0.01278 0.04188,0.01668 0.06072,0.06262 0.04488,0.109439 l -0.0126,0.03725 0.04528,0.03265 c 0.0249,0.01796 0.04717,0.03668 0.04947,0.0416 0.0101,0.02161 -0.01752,0.01448 -0.0713,-0.01841 -0.07994,-0.04888 -0.09704,-0.04264 -0.06947,0.02542 0.01289,0.03182 0.01754,0.05617 0.01183,0.06155 -0.0073,0.0068 -0.02357,-0.02119 -0.07055,-0.12168 z m 0.09114,-0.08445 c 0.002,-0.0279 -3.75e-4,-0.03289 -0.0231,-0.04923 -0.02,-0.01438 -0.03179,-0.01515 -0.0563,-0.0037 l -0.03101,0.0145 0.02163,0.05334 0.02163,0.05334 0.03246,-0.0186 c 0.02496,-0.01432 0.03295,-0.02578 0.03466,-0.04964 z m -2.048031,0.405022 c -0.145057,0.01861 -0.301726,-0.01645 -0.446955,-0.100038 l -0.08172,-0.04703 -0.132595,0.062 -0.132595,0.062 -0.0064,0.06577 -0.0065,0.06578 -0.09615,0.04805 c -0.05286,0.02648 -0.100749,0.04636 -0.106359,0.04432 -0.01148,-0.0042 0.04363,-0.774336 0.05687,-0.79505 0.0047,-0.0073 0.02103,-0.0191 0.03642,-0.02641 0.03143,-0.01488 0.03203,-0.03256 0.0032,-0.09485 l -0.01679,-0.03624 -0.09454,0.0035 c -0.252086,0.0093 -0.5291,-0.07506 -0.697106,-0.212262 -0.167401,-0.13671 -0.267351,-0.339547 -0.249639,-0.506599 0.01311,-0.123622 0.08267,-0.258092 0.181331,-0.350565 0.02765,-0.02592 0.05239,-0.05227 0.05498,-0.05856 0.0028,-0.0069 -0.01468,-0.03636 -0.04422,-0.07428 -0.03556,-0.04562 -0.05948,-0.08791 -0.08738,-0.154421 -0.03497,-0.08329 -0.03825,-0.09903 -0.03665,-0.173583 0.0044,-0.203281 0.147828,-0.402391 0.384777,-0.534166 0.169666,-0.09435 0.409012,-0.128459 0.648842,-0.09245 0.05629,0.0085 0.108039,0.01617 0.114992,0.01716 0.007,9.44e-4 0.03015,-0.02997 0.05154,-0.0688 0.118934,-0.215917 0.319054,-0.398886 0.533284,-0.487581 0.271237,-0.112293 0.540535,-0.06729 0.692221,0.115687 0.04849,0.05849 0.0974,0.163005 0.114406,0.244447 0.0072,0.03463 0.01661,0.06526 0.02088,0.06803 0.0043,0.0028 0.02917,8.65e-4 0.05539,-0.0043 0.186692,-0.03651 0.383868,0.02633 0.506874,0.161558 0.06387,0.07022 0.132402,0.212842 0.145816,0.303364 0.03752,0.253974 -0.07897,0.600717 -0.276601,0.823321 -0.05065,0.05705 -0.05059,0.06108 0.0022,0.134609 l 0.01931,0.0269 0.10779,-0.04311 c 0.05927,-0.02374 0.122023,-0.04508 0.139411,-0.0475 0.06312,-0.0088 0.144468,0.04252 0.176742,0.111549 0.01472,0.03148 0.01409,0.03721 -0.0058,0.05175 -0.01231,0.009 -0.05108,0.02797 -0.08618,0.04217 -0.05944,0.02404 -0.06643,0.02455 -0.102196,0.0073 l -0.03838,-0.01851 -0.143082,0.06337 c -0.176159,0.07795 -0.21256,0.101262 -0.226466,0.144634 -0.01,0.03111 -0.0076,0.03932 0.0427,0.146866 0.04732,0.101199 0.05656,0.115542 0.08248,0.128638 0.042,0.02117 0.0877,0.0098 0.232122,-0.05763 0.14137,-0.06603 0.178082,-0.09533 0.177625,-0.141756 -5.47e-4,-0.05545 -0.01338,-0.05503 -0.140824,0.0046 l -0.116714,0.05457 -0.0252,-0.0539 -0.0252,-0.0539 0.218293,-0.0992 0.218293,-0.0992 0.05402,0.119791 c 0.0641,0.142042 0.06564,0.168431 0.01385,0.235457 -0.03226,0.04175 -0.04129,0.04728 -0.230475,0.140978 l -0.196918,0.09748 -0.03079,0.08535 c -0.09931,0.275233 -0.328211,0.41932 -0.599548,0.377393 -0.04562,-0.0071 -0.100587,-0.01971 -0.122153,-0.02813 -0.02156,-0.0084 -0.04296,-0.01356 -0.04754,-0.01142 -0.0045,0.0021 -0.02198,0.03744 -0.03868,0.07847 -0.05819,0.142971 -0.14342,0.236292 -0.268154,0.293613 -0.04401,0.02022 -0.09586,0.03654 -0.130096,0.04093 z m 0.248783,-0.225156 c 0.04021,-0.05047 0.06616,-0.09766 0.09361,-0.170195 0.02089,-0.05519 0.04237,-0.102403 0.04772,-0.104906 0.0053,-0.0025 0.04517,0.0068 0.08846,0.02065 0.177679,0.05687 0.307389,0.05242 0.429714,-0.01473 0.07792,-0.04284 0.132534,-0.09493 0.177272,-0.1693 0.03668,-0.06099 0.0581,-0.113645 0.04872,-0.11979 -0.0041,-0.0026 -0.02582,3.28e-4 -0.04835,0.0066 -0.05145,0.01445 -0.07459,0.01376 -0.126893,-0.0036 -0.06994,-0.02321 -0.104668,-0.06858 -0.185861,-0.242772 -0.07763,-0.166503 -0.08564,-0.202526 -0.06142,-0.275153 0.02377,-0.07127 0.04989,-0.0941 0.194924,-0.170323 l 0.133737,-0.07026 -0.02142,-0.03329 c -0.01177,-0.01832 -0.0269,-0.03533 -0.0337,-0.03778 -0.0077,-0.0028 -0.03974,0.01527 -0.08494,0.04777 -0.106942,0.07694 -0.311202,0.162418 -0.441732,0.184845 -0.119767,0.02059 -0.290598,0.01909 -0.395774,-0.0035 -0.04412,-0.0095 -0.08652,-0.01794 -0.09423,-0.01883 -0.0082,-9.3e-4 -0.02254,0.01562 -0.03466,0.03994 -0.07216,0.145214 -0.174588,0.278208 -0.280351,0.364006 -0.09486,0.07695 -0.283342,0.172871 -0.403937,0.205567 -0.102901,0.0279 -0.105871,0.03119 -0.07953,0.08812 l 0.01557,0.03365 0.04308,-0.02014 c 0.02369,-0.01108 0.05169,-0.01799 0.06219,-0.01543 0.02464,0.0061 0.62997,0.440878 0.638159,0.458391 0.0052,0.01104 -0.01063,0.02059 -0.09519,0.05755 l -0.101381,0.04431 -0.05414,-0.03744 c -0.04938,-0.03414 -0.05688,-0.03616 -0.0851,-0.02297 -0.01702,0.008 -0.02934,0.01791 -0.02739,0.02208 0.0074,0.0158 0.0903,0.05471 0.176479,0.08284 0.152827,0.04987 0.262292,0.04434 0.381619,-0.01928 0.05902,-0.03146 0.07725,-0.04705 0.124746,-0.106689 z m -0.213686,-0.07326 c -0.0862,-0.176815 -0.286445,-0.61358 -0.285476,-0.622368 0.0015,-0.0127 0.139592,-0.08111 0.167839,-0.08311 0.01409,-9.58e-4 0.02549,0.01756 0.07236,0.117802 0.06077,0.129984 0.06067,0.129892 0.115779,0.104123 0.0395,-0.01847 0.0492,-0.03533 0.129834,-0.22593 0.04056,-0.09586 0.08185,-0.180861 0.09176,-0.1889 0.0099,-0.0081 0.06287,-0.03414 0.117673,-0.058 0.0803,-0.03501 0.101233,-0.04093 0.107783,-0.03084 0.0046,0.007 -0.03448,0.111334 -0.08849,0.236467 -0.05316,0.123146 -0.09439,0.228741 -0.09162,0.234647 0.0028,0.0059 0.117407,0.03576 0.254758,0.06633 0.137352,0.03057 0.251401,0.05915 0.253439,0.06351 0.002,0.0043 -0.05434,0.03501 -0.12525,0.06817 l -0.128934,0.06028 -0.206014,-0.05102 c -0.191173,-0.04734 -0.208699,-0.04975 -0.243247,-0.03344 -0.02048,0.0097 -0.04068,0.023 -0.0449,0.0296 -0.0051,0.0081 0.0084,0.04853 0.04199,0.124816 l 0.04965,0.112791 -0.09062,0.04546 c -0.08196,0.04108 -0.09136,0.04393 -0.09834,0.02961 z m -0.571726,-0.02502 c -0.0017,-0.01374 -0.198635,-0.147241 -0.209601,-0.142114 -0.01356,0.0063 -0.03651,0.242056 -0.02468,0.253454 0.0085,0.0082 0.03336,-9.84e-4 0.123104,-0.04538 0.06489,-0.03211 0.111902,-0.06005 0.111178,-0.06596 z m 0.117835,-0.709557 c 0.0702,-0.05287 0.149622,-0.135794 0.198582,-0.207351 0.0371,-0.05422 0.103447,-0.1772 0.09981,-0.184989 -0.0012,-0.0025 -0.04312,-0.0256 -0.0932,-0.05128 -0.131475,-0.06743 -0.192711,-0.111955 -0.34255,-0.249073 -0.02199,-0.02012 -0.03039,-0.01367 -0.103958,0.07976 -0.140985,0.179057 -0.22234,0.393935 -0.228263,0.602898 -0.0024,0.08322 0.01007,0.178781 0.02514,0.193306 0.0074,0.007 0.03516,0.0043 0.07721,-0.0076 0.03614,-0.01027 0.07662,-0.02161 0.08992,-0.02526 0.04631,-0.01271 0.21835,-0.106066 0.277318,-0.150439 z m 1.300832,-0.606011 c 0.03971,-0.03179 0.04254,-0.03702 0.0312,-0.05757 -0.01917,-0.03462 -0.131421,-0.125205 -0.228252,-0.184084 -0.119216,-0.07249 -0.255323,-0.123692 -0.375527,-0.141265 -0.106854,-0.01562 -0.245215,-0.0135 -0.262106,0.004 -0.0056,0.0058 -0.0072,0.03051 -0.0036,0.05495 0.01435,0.09726 -0.0018,0.274129 -0.03694,0.404881 -0.0095,0.03543 -0.01463,0.07015 -0.01136,0.07716 0.0087,0.01851 0.14282,0.04352 0.245118,0.04571 0.181587,0.0039 0.326687,-0.02994 0.492084,-0.114704 0.05809,-0.02981 0.125312,-0.06988 0.149334,-0.08912 z m -1.838655,0.722628 c -0.03067,-0.269271 0.05922,-0.550294 0.25387,-0.793666 0.07436,-0.09296 0.07732,-0.09867 0.06166,-0.118533 -0.009,-0.01149 -0.03893,-0.06248 -0.06638,-0.113354 -0.12819,-0.237453 -0.160043,-0.543613 -0.08371,-0.804695 l 0.01798,-0.0615 -0.04522,-0.01278 c -0.108717,-0.03073 -0.301568,-0.03174 -0.45271,-0.0024 -0.07549,0.01467 -0.1045,0.02549 -0.198817,0.07418 -0.123142,0.06354 -0.179886,0.107798 -0.252744,0.196938 -0.152553,0.186641 -0.141269,0.401723 0.03103,0.591402 0.0503,0.05537 0.06693,0.08408 0.05726,0.09884 -0.0035,0.0054 -0.03179,0.03153 -0.06274,0.05802 -0.115875,0.09913 -0.198518,0.243273 -0.202285,0.352805 -0.0038,0.110355 0.02891,0.205685 0.106484,0.310355 0.144508,0.194983 0.421381,0.316866 0.72486,0.319099 0.04934,3.67e-4 0.09654,-0.0037 0.104905,-0.0091 0.01081,-0.0069 0.01271,-0.03173 0.0066,-0.08563 z m 2.024626,-0.905551 c 0.109809,-0.138783 0.195685,-0.337449 0.222255,-0.514166 0.02143,-0.142544 0.01056,-0.22729 -0.04425,-0.344931 -0.101484,-0.217995 -0.305515,-0.313799 -0.551602,-0.25917 -0.09852,0.02187 -0.104229,0.01835 -0.118422,-0.07287 -0.03292,-0.2116 -0.129276,-0.337639 -0.300808,-0.393471 -0.222732,-0.0725 -0.467346,0.0029 -0.698778,0.215464 -0.09937,0.09126 -0.238933,0.28033 -0.236123,0.319878 6.22e-4,0.0087 0.02993,0.02687 0.06978,0.0434 0.182684,0.07573 0.346205,0.210412 0.461201,0.379863 0.02911,0.0429 0.06418,0.112508 0.10386,0.206077 l 0.05989,0.141308 0.03297,-0.0034 c 0.07614,-0.0079 0.249576,0.0042 0.334235,0.02337 0.178728,0.04049 0.428107,0.183252 0.551283,0.315588 0.034,0.03653 0.04487,0.03113 0.114541,-0.05687 z m -1.139827,0.263439 c 0.04858,-0.145468 0.06479,-0.408528 0.02739,-0.444577 -0.01211,-0.01174 -0.08847,0.0066 -0.20458,0.04897 -0.08021,0.02933 -0.235805,0.122529 -0.251155,0.150492 -0.0092,0.01674 -0.0067,0.02114 0.03453,0.06181 0.08618,0.08484 0.2295,0.180985 0.332366,0.222949 0.01886,0.0077 0.03674,0.01284 0.03974,0.01143 0.003,-0.0014 0.01275,-0.02438 0.02166,-0.05106 z M 90.03951,38.796269 c 0.0793,-0.05363 0.230687,-0.121703 0.332785,-0.149636 0.04923,-0.01352 0.09051,-0.02722 0.09172,-0.03052 0.0067,-0.01841 -0.03856,-0.141146 -0.08141,-0.220844 -0.11161,-0.207566 -0.286982,-0.367282 -0.494421,-0.450268 l -0.06209,-0.02484 -0.01773,0.04579 c -0.04457,0.115068 -0.05941,0.332082 -0.03245,0.474553 0.0242,0.127917 0.06677,0.245933 0.118582,0.328743 0.05215,0.08333 0.06028,0.09113 0.07832,0.07497 0.0071,-0.0063 0.03705,-0.02792 0.06672,-0.04793 z m 1.925057,0.203637 c -0.02796,-0.01175 -0.03276,-0.02056 -0.01206,-0.02201 0.01199,-8.61e-4 0.01267,-0.0079 0.0028,-0.02896 -0.01517,-0.03244 -0.03208,-0.02978 -0.03019,0.0047 7.45e-4,0.01316 -0.0014,0.01874 -0.0048,0.0124 -0.0077,-0.01456 -0.0059,-0.05675 0.003,-0.07146 0.0037,-0.0062 0.02165,-0.01818 0.0398,-0.02678 0.03803,-0.01797 0.07221,-0.0045 0.09115,0.03605 0.02448,0.05237 -0.0371,0.11819 -0.08984,0.09602 z m 0.05403,-0.03255 c -0.0035,-0.0074 -0.01235,-0.0106 -0.01972,-0.0072 -0.0074,0.0035 -0.0106,0.01235 -0.0072,0.01972 0.0035,0.0074 0.01235,0.0106 0.01971,0.0072 0.0074,-0.0035 0.0106,-0.01235 0.0072,-0.01972 z m 0.02216,-0.05765 c -0.01294,-0.02768 -0.02884,-0.01652 -0.01911,0.01346 0.0056,0.01749 0.01122,0.02211 0.01817,0.01549 0.0055,-0.0052 0.006,-0.01825 9.66e-4,-0.02893 z"
     style="fill:#666666" />
</svg>
