<?xml version="1.0" encoding="UTF-8" standalone="no"?>
<!-- Created with Inkscape (http://www.inkscape.org/) -->

<svg
   xmlns:dc="http://purl.org/dc/elements/1.1/"
   xmlns:cc="http://creativecommons.org/ns#"
   xmlns:rdf="http://www.w3.org/1999/02/22-rdf-syntax-ns#"
   xmlns:svg="http://www.w3.org/2000/svg"
   xmlns="http://www.w3.org/2000/svg"
   xmlns:sodipodi="http://sodipodi.sourceforge.net/DTD/sodipodi-0.dtd"
   xmlns:inkscape="http://www.inkscape.org/namespaces/inkscape"
   width="48"
   height="48"
   id="svg2"
   version="1.1"
   inkscape:version="0.48.3.1 r9886"
   sodipodi:docname="xfce4-panel.svg"
   inkscape:export-filename="/home/uri/workspace/NitruxforAndroid/res/drawable-xhdpi/downloads.png"
   inkscape:export-xdpi="180"
   inkscape:export-ydpi="180">
  <defs
     id="defs4">
    <linearGradient
       gradientTransform="matrix(1,0,0,-1,234.1235,407.377)"
       y2="388.93799"
       x2="-207.2794"
       y1="374.1348"
       x1="-211.07179"
       gradientUnits="userSpaceOnUse"
       id="XMLID_4_">
      <stop
         id="stop191"
         style="stop-color:#FFFFFF"
         offset="0" />
      <stop
         id="stop192"
         style="stop-color:#FFFF00"
         offset="1" />
    </linearGradient>
    <linearGradient
       gradientTransform="matrix(1,0,0,-1,234.1235,407.377)"
       y2="372.85239"
       x2="-226.5694"
       y1="375.35641"
       x1="-199.4424"
       gradientUnits="userSpaceOnUse"
       id="XMLID_3_">
      <stop
         id="stop183"
         style="stop-color:#FFFFFF"
         offset="0" />
      <stop
         id="stop184"
         style="stop-color:#6A77B8"
         offset="1" />
    </linearGradient>
    <linearGradient
       gradientTransform="matrix(1,0,0,-1,234.1235,407.377)"
       y2="377.73999"
       x2="-203.4805"
       y1="372.75101"
       x1="-215.1216"
       gradientUnits="userSpaceOnUse"
       id="XMLID_2_">
      <stop
         id="stop176"
         style="stop-color:#FFFFFF"
         offset="0" />
      <stop
         id="stop177"
         style="stop-color:#CCCCF5"
         offset="1" />
    </linearGradient>
    <linearGradient
       gradientTransform="matrix(1,0,0,-1,234.1235,407.377)"
       y2="363.81979"
       x2="-193.646"
       y1="383.5264"
       x1="-227.77879"
       gradientUnits="userSpaceOnUse"
       id="XMLID_1_">
      <stop
         id="stop163"
         style="stop-color:#E6E6FA"
         offset="0" />
      <stop
         id="stop164"
         style="stop-color:#FFFFFF"
         offset="0.4246" />
      <stop
         id="stop165"
         style="stop-color:#ADADD2"
         offset="0.4972" />
      <stop
         id="stop166"
         style="stop-color:#EBEBFF"
         offset="0.8492" />
    </linearGradient>
  </defs>
  <sodipodi:namedview
     id="base"
     pagecolor="#ffffff"
     bordercolor="#666666"
     borderopacity="1.0"
     inkscape:pageopacity="0.0"
     inkscape:pageshadow="2"
     inkscape:zoom="4.7354315"
     inkscape:cx="-15.858089"
     inkscape:cy="9.6400159"
     inkscape:document-units="px"
     inkscape:current-layer="g3918"
     showgrid="false"
     inkscape:window-width="1918"
     inkscape:window-height="1186"
     inkscape:window-x="0"
     inkscape:window-y="0"
     inkscape:window-maximized="0"
     showguides="true"
     inkscape:snap-global="false">
    <inkscape:grid
       type="xygrid"
       id="grid3850" />
    <sodipodi:guide
       position="4,44.000017"
       orientation="40,0"
       id="guide4110" />
    <sodipodi:guide
       position="4,4.0000174"
       orientation="0,40"
       id="guide4112" />
    <sodipodi:guide
       position="44,4.0000174"
       orientation="-40,0"
       id="guide4114" />
    <sodipodi:guide
       position="44,44.000017"
       orientation="0,-40"
       id="guide4116" />
    <sodipodi:guide
       position="8.999999,39.000017"
       orientation="30,0"
       id="guide4124" />
    <sodipodi:guide
       position="8.999999,9.0000174"
       orientation="0,30.000001"
       id="guide4126" />
    <sodipodi:guide
       position="39,9.0000174"
       orientation="-30,0"
       id="guide4128" />
    <sodipodi:guide
       position="39,39.000017"
       orientation="0,-30.000001"
       id="guide4130" />
    <sodipodi:guide
       position="14.999999,33.000017"
       orientation="18,0"
       id="guide4134" />
    <sodipodi:guide
       position="14.999999,15.000017"
       orientation="0,18.000001"
       id="guide4136" />
    <sodipodi:guide
       position="33,15.000017"
       orientation="-18,0"
       id="guide4138" />
    <sodipodi:guide
       position="33,33.000017"
       orientation="0,-18.000001"
       id="guide4140" />
  </sodipodi:namedview>
  <metadata
     id="metadata7">
    <rdf:RDF>
      <cc:Work
         rdf:about="">
        <dc:format>image/svg+xml</dc:format>
        <dc:type
           rdf:resource="http://purl.org/dc/dcmitype/StillImage" />
        <dc:title></dc:title>
      </cc:Work>
    </rdf:RDF>
  </metadata>
  <g
     inkscape:label="Capa 1"
     inkscape:groupmode="layer"
     id="layer1"
     transform="translate(0,-1004.3622)">
    <g
       id="g3918"
       transform="translate(-99.810341,989.54677)">
      <g
         transform="matrix(0.07186578,0,0,0.07781006,18.384464,3.474253)"
         id="g1329"
         style="fill:#000000;fill-opacity:1" />
      <g
         transform="translate(99.984397,-989.36038)"
         id="layer1-8"
         inkscape:label="Capa 1">
        <path
           inkscape:connector-curvature="0"
           id="path2997-5"
           d="m 10.455053,1012.0219 0,10.7837 -7.5758604,0 c -0.4754773,1.7839 -0.7507609,3.6626 -0.7507609,5.5966 0,6.5248 2.8690088,12.3782 7.405233,16.3802 l 4.6410683,0 0,2.5594 19.690412,0 0,-2.5594 -0.03413,0 0,-6.5521 6.552096,0 0,-24.1608 -1.945154,0 0,-2.0134 c -0.01212,-0.011 -0.02197,-0.023 -0.03412,-0.034 l -27.948783,0 z"
           style="fill:#ffffff;fill-opacity:1;stroke:none" />
        <path
           sodipodi:nodetypes="csssssscssssssssscsssssssssssssssssssssssssssssssssssssssssssssssssssssssssssssssssscssscsssssccccccsccscccc"
           id="path2831-6"
           d="m 23.994698,1006.548 c -1.508236,0 -2.986833,0.1627 -4.409045,0.4536 -1.422193,0.2909 -2.777969,0.7112 -4.084851,1.2638 -1.306883,0.5525 -2.565961,1.2242 -3.728237,2.009 -1.162275,0.7848 -2.2211313,1.6692 -3.2095253,2.6572 -0.9883828,0.9878 -1.9055888,2.0786 -2.6908138,3.2403 -0.785225,1.1618 -1.4572472,2.4203 -2.010006,3.7265 -0.5190122,1.2265 -0.9104726,2.4949 -1.1995194,3.8237 0.935423,0.1766 1.9009933,0.3348 2.8529112,0.4861 1.5415476,0.2449 3.022384,0.4238 4.182109,0.4212 0.5800333,0 1.1087873,-0.062 1.4912953,-0.162 0.383774,-0.099 0.654468,-0.1483 0.810485,-0.3241 0.601207,-0.6774 1.322745,-1.5344 1.653392,-2.8515 0.02459,-0.098 0.07107,-0.4177 0.06484,-0.5184 -0.01546,-0.1016 -0.04627,-0.2506 -0.09721,-0.4538 -0.120985,-0.4823 -0.301206,-1.1344 -0.421453,-1.8469 -0.120341,-0.714 -0.197234,-1.4598 -0.03237,-2.1712 0.162325,-0.7005 0.589733,-1.372 1.329197,-1.7821 0.28637,-0.1431 0.63097,-0.1976 0.907745,-0.1296 0.286701,0.07 0.536897,0.2417 0.778067,0.4536 0.482546,0.4239 0.894558,1.0723 1.264358,1.7498 0.368431,0.675 0.682572,1.3906 0.940164,1.9767 0.129305,0.2942 0.262416,0.5128 0.356613,0.7129 0.04202,0.09 0.06982,0.1766 0.09721,0.2268 0.02707,0.05 0.03973,0.079 0.03237,0.064 0.02375,0.039 0.05779,0.073 0.09721,0.097 -0.02313,-0.014 0.08154,0.045 0.162097,0.064 0.121908,0.031 0.207029,0.039 0.324195,0.033 0.05882,0 0.116554,-0.027 0.162097,-0.065 0.01152,-0.011 0.02209,-0.021 0.03237,-0.033 0.03766,-0.046 0.06069,-0.1038 0.06484,-0.1621 0.0052,-0.032 0.0052,-0.066 0,-0.097 -0.0498,-0.1745 -0.1791,-0.4782 -0.324194,-1.0045 -0.167721,-0.6085 -0.315646,-1.3661 -0.421454,-2.1387 -0.106111,-0.774 -0.129656,-1.5557 0.03237,-2.2358 0.158362,-0.6645 0.535217,-1.2712 1.19952,-1.523 1.001745,-0.3853 1.88762,-0.1146 2.399039,0.486 0.53751,0.6313 0.806388,1.5511 0.972583,2.5276 0.1655,0.9726 0.216354,1.9965 0.226936,2.7867 0.0052,0.3947 0.001,0.695 0,0.9397 -1.24e-4,0.023 8.3e-5,0.048 0,0.064 4.15e-4,0.045 0.01162,0.09 0.03237,0.1296 0.02375,0.039 0.05778,0.073 0.09721,0.097 0.02998,0.016 0.06328,0.027 0.09721,0.033 0.06079,0.013 0.117758,0.045 0.226936,0.064 0.376729,0.069 0.915224,0.1271 1.556134,0.2268 1.28245,0.1995 2.971883,0.5177 4.700819,0.9721 1.72929,0.4545 3.504642,1.0739 4.895337,1.9767 1.385903,0.8997 2.410969,2.0947 2.625975,3.6616 0.136152,0.972 -0.574627,1.8962 -1.588552,2.7869 -1.012421,0.8893 -2.365386,1.776 -3.793076,2.5599 -1.42714,0.7834 -2.902822,1.4877 -4.08485,2.0414 -0.59129,0.2769 -1.090144,0.5207 -1.491295,0.7128 -0.202931,0.097 -0.383318,0.1877 -0.518711,0.2593 -0.135394,0.072 -0.221542,0.1131 -0.291775,0.162 -0.479124,0.334 -0.694917,0.7179 -0.745648,1.1342 -0.05187,0.4252 0.04357,0.8674 0.226936,1.1989 0.0107,6e-4 0.02158,6e-4 0.03237,0 0.0021,0 -0.0021,0.029 0,0.033 0.0021,0 0.03029,0 0.03237,0 0.0031,0 -10e-4,0.031 0,0.033 0.05602,0.082 0.121098,0.1356 0.226936,0.2592 0.127945,0.1494 0.304255,0.3556 0.486291,0.5509 0.361864,0.3881 0.788234,0.8495 1.19952,1.3286 0.411722,0.4795 0.805829,0.9796 1.069842,1.4581 0.267873,0.4857 0.442005,0.9403 0.291775,1.3935 -0.0052,0.014 -0.02729,-0.014 -0.03237,0 -0.0445,0.1128 -0.1802,0.1989 -0.259356,0.2268 -0.109841,0.038 -0.200004,0.067 -0.324194,0.064 -0.231936,0 -0.493273,-0.056 -0.810486,-0.1296 -0.629156,-0.1475 -1.410833,-0.4198 -2.204523,-0.6805 -0.793762,-0.2607 -1.595358,-0.5191 -2.204522,-0.6805 -0.221137,-0.059 -0.377861,-0.073 -0.518711,-0.097 -0.153031,-0.021 -0.310708,0.1059 -0.324195,0.2592 -0.0052,0.056 0.0062,0.1129 0.03237,0.1621 0.0388,0.073 0.08414,0.1797 0.194516,0.324 0.324236,0.4238 0.834545,0.9136 1.329198,1.4582 0.495794,0.5459 0.952167,1.1382 1.19952,1.7498 0.23675,0.5853 0.207432,1.3067 -0.291776,1.8471 -0.02105,0.018 -0.02209,0.026 -0.03237,0.033 -0.147999,0.096 -0.204549,0.07 -0.356614,0.064 -0.124459,0 -0.264066,10e-4 -0.421453,-0.033 -0.312669,-0.067 -0.690736,-0.2035 -1.134681,-0.3565 -0.886331,-0.3053 -2.000669,-0.7388 -3.079847,-1.1989 -1.079169,-0.46 -2.101372,-0.9412 -2.885331,-1.2961 -0.440428,-0.1854 -0.840385,-0.4697 -1.329198,-0.486 -0.102605,-0.011 -0.244374,0 -0.421452,0.033 -0.354477,0.058 -0.866818,0.1148 -1.491295,0.1945 -1.175669,0.15 -2.810782,0.3241 -4.6684003,0.4212 0.855842,0.8049 1.7461683,1.5761 2.7232333,2.2359 1.162276,0.7848 2.421354,1.4565 3.728236,2.0091 1.306884,0.5524 2.66266,0.9729 4.084851,1.2637 1.422213,0.2909 2.900809,0.4537 4.409046,0.4537 12.066269,0 21.851071,-9.7802 21.851071,-21.8403 0,-12.0602 -9.784802,-21.8403 -21.850709,-21.8403 z m 9.920351,6.6752 c 0.18184,-0.011 0.388691,0.2939 0.421453,0.486 0.138402,2.1289 -0.218938,4.3284 -0.745648,6.3836 -0.02925,0.4349 -0.600283,0.9559 -0.907744,0.4213 -0.358762,-1.2233 0.06733,-2.5255 0.194517,-3.7588 0.265715,-1.1217 0.28416,-2.4074 0.875325,-3.4025 0.05342,-0.088 0.101459,-0.1261 0.162097,-0.1296 z m 4.538722,1.2313 c 0.342496,-0.041 0.472412,0.3001 0.356615,0.5834 -0.864007,2.2021 -1.935394,4.3725 -3.339204,6.2863 -0.246221,0.4766 -0.969471,0.3798 -0.972583,-0.1944 0.09763,-1.5857 1.120593,-2.9316 1.880328,-4.2773 0.633325,-0.8224 1.091514,-1.9579 2.074844,-2.398 z"
           style="fill:#2980b9;fill-opacity:1;stroke:none"
           inkscape:connector-curvature="0" />
      </g>
    </g>
  </g>
</svg>
