<?xml version="1.0" encoding="UTF-8" standalone="no"?>
<!-- Created with Inkscape (http://www.inkscape.org/) -->

<svg
   xmlns:dc="http://purl.org/dc/elements/1.1/"
   xmlns:cc="http://creativecommons.org/ns#"
   xmlns:rdf="http://www.w3.org/1999/02/22-rdf-syntax-ns#"
   xmlns:svg="http://www.w3.org/2000/svg"
   xmlns="http://www.w3.org/2000/svg"
   xmlns:sodipodi="http://sodipodi.sourceforge.net/DTD/sodipodi-0.dtd"
   xmlns:inkscape="http://www.inkscape.org/namespaces/inkscape"
   id="svg2"
   version="1.1"
   inkscape:version="0.48.5 r10040"
   width="512"
   height="512"
   sodipodi:docname="ibus-off.svg">
  <metadata
     id="metadata8">
    <rdf:RDF>
      <cc:Work
         rdf:about="">
        <dc:format>image/svg+xml</dc:format>
        <dc:type
           rdf:resource="http://purl.org/dc/dcmitype/StillImage" />
        <dc:title />
      </cc:Work>
    </rdf:RDF>
  </metadata>
  <defs
     id="defs6" />
  <sodipodi:namedview
     pagecolor="#ffffff"
     bordercolor="#666666"
     borderopacity="1"
     objecttolerance="10"
     gridtolerance="10"
     guidetolerance="10"
     inkscape:pageopacity="0"
     inkscape:pageshadow="2"
     inkscape:window-width="1061"
     inkscape:window-height="660"
     id="namedview4"
     showgrid="false"
     inkscape:zoom="0.65186406"
     inkscape:cx="316.34209"
     inkscape:cy="186.89598"
     inkscape:window-x="195"
     inkscape:window-y="41"
     inkscape:window-maximized="0"
     inkscape:current-layer="svg2" />
  <path
     inkscape:connector-curvature="0"
     id="path2996"
     d="m 63.946211,445.37582 c -1.282684,-1.28268 -1.420791,-20.03978 -1.420791,-192.96904 0,-172.929256 0.138107,-191.686356 1.420791,-192.969039 1.282683,-1.282684 20.039783,-1.420791 192.969039,-1.420791 172.92926,0 191.68636,0.138107 192.96904,1.420791 1.28268,1.282683 1.42079,20.039783 1.42079,192.969039 0,172.92926 -0.13811,191.68636 -1.42079,192.96904 -1.28268,1.28268 -20.03978,1.42079 -192.96904,1.42079 -172.929256,0 -191.686356,-0.13811 -192.969039,-1.42079 z"
     style="fill:#ebeff0" />
  <path
     inkscape:connector-curvature="0"
     id="path2992"
     d="m 48.802089,471.09131 c -0.26175,-0.68878 -0.36053,-95.97733 -0.21951,-211.75233 l 0.2564,-210.499996 211.500001,0 211.5,0 0,211.499996 0,211.5 -211.28049,0.25233 c -168.499421,0.20123 -211.376861,-0.001 -211.756401,-1 z M 442.21926,429.98324 c 0.82646,-0.99583 1.05807,-49.2465 0.87244,-181.75 l -0.25272,-180.394256 -182.5,0 -182.500001,0 -0.25272,180.394256 c -0.18563,132.5035 0.046,180.75417 0.87244,181.75 1.68022,2.02453 362.080341,2.02453 363.760561,0 z M 176.33898,349.55335 c 0,-0.98209 14.11558,-41.36959 31.36796,-89.75 l 31.36796,-87.96437 21.32932,0 21.32931,0 31.29971,88.5 c 17.21484,48.675 31.08645,89.07225 30.8258,89.77167 -0.36577,0.98147 -4.85395,1.20968 -19.66719,1 l -19.19326,-0.27167 -5.4295,-17 c -2.98622,-9.35 -5.88974,-17.5625 -6.45225,-18.25 -0.77916,-0.95229 -8.58591,-1.25 -32.77786,-1.25 -24.21029,0 -31.98994,0.29699 -32.74349,1.25 -0.54361,0.6875 -3.35904,8.45 -6.25651,17.25 -2.89747,8.8 -5.7129,16.5625 -6.25651,17.25 -0.7282,0.92095 -5.95769,1.25 -19.86593,1.25 -17.45544,0 -18.87756,-0.13452 -18.87756,-1.78563 z m 105.99229,-67.96437 c -0.0138,-3.11971 -20.50918,-65.75 -21.51634,-65.75 -1.20682,0 -22.62662,64.51815 -21.99477,66.25 0.34557,0.94718 5.67222,1.25 21.98744,1.25 19.84235,0 21.53078,-0.13728 21.52367,-1.75 z"
     style="fill:#bcc1c5" />
  <path
     style="fill:#94a4a5"
     d="m 77.62712,422.14406 0,-9.5 182.71187,0 182.71186,0 0,9.5 0,9.5 -182.71186,0 -182.71187,0 0,-9.5 z"
     id="path3009"
     inkscape:connector-curvature="0" />
  <path
     style="fill:#999999;fill-opacity:0;fill-rule:nonzero;stroke:none"
     d="m 176.94233,349.7577 c 0,-1.76037 20.12951,-59.15414 55.72102,-158.8732 l 6.77995,-18.99583 21.02039,0.20356 21.02039,0.20357 11.42171,32.2153 c 34.482,97.25758 50.6936,144.38995 50.03226,145.46002 -0.22415,0.36267 -8.78519,0.65941 -19.02455,0.65941 l -18.61701,0 -3.68836,-11.69723 c -6.05183,-19.1927 -7.87854,-23.49724 -10.2545,-24.16396 -2.61939,-0.73503 -59.69489,-0.75336 -62.29715,-0.02 -1.76593,0.49767 -2.55828,2.25699 -7.94524,17.64171 -3.29104,9.39891 -6.37773,17.34251 -6.85932,17.65245 -1.52536,0.98171 -37.30959,0.70758 -37.30959,-0.28579 z m 105.17856,-67.18142 c 0.86661,-0.86662 -1.03268,-7.69152 -9.02405,-32.42683 -8.02294,-24.83307 -11.7726,-34.8317 -12.71068,-33.89361 -1.70613,1.70613 -20.95379,59.40124 -21.47543,64.37288 -0.22125,2.10867 -0.19286,2.12209 5.53034,2.61302 7.81555,0.67043 36.85683,0.15752 37.67982,-0.66546 z"
     id="path3011"
     inkscape:connector-curvature="0" />
  <path
     style="fill:#999999;fill-opacity:0;fill-rule:nonzero;stroke:none"
     d="m 176.94233,349.7577 c 0,-1.76037 20.12951,-59.15414 55.72102,-158.8732 l 6.77995,-18.99583 21.02039,0.20356 21.02039,0.20357 11.42171,32.2153 c 34.482,97.25758 50.6936,144.38995 50.03226,145.46002 -0.22415,0.36267 -8.78519,0.65941 -19.02455,0.65941 l -18.61701,0 -3.68836,-11.69723 c -6.05183,-19.1927 -7.87854,-23.49724 -10.2545,-24.16396 -2.61939,-0.73503 -59.69489,-0.75336 -62.29715,-0.02 -1.76593,0.49767 -2.55828,2.25699 -7.94524,17.64171 -3.29104,9.39891 -6.37773,17.34251 -6.85932,17.65245 -1.52536,0.98171 -37.30959,0.70758 -37.30959,-0.28579 z m 105.17856,-67.18142 c 0.86661,-0.86662 -1.03268,-7.69152 -9.02405,-32.42683 -8.02294,-24.83307 -11.7726,-34.8317 -12.71068,-33.89361 -1.70613,1.70613 -20.95379,59.40124 -21.47543,64.37288 -0.22125,2.10867 -0.19286,2.12209 5.53034,2.61302 7.81555,0.67043 36.85683,0.15752 37.67982,-0.66546 z"
     id="path3013"
     inkscape:connector-curvature="0" />
  <path
     style="fill:#999999;fill-opacity:0;fill-rule:nonzero;stroke:none"
     d="m 176.94233,349.7577 c 0,-1.76037 20.12951,-59.15414 55.72102,-158.8732 l 6.77995,-18.99583 21.02039,0.20356 21.02039,0.20357 11.42171,32.2153 c 34.482,97.25758 50.6936,144.38995 50.03226,145.46002 -0.22415,0.36267 -8.78519,0.65941 -19.02455,0.65941 l -18.61701,0 -3.68836,-11.69723 c -6.05183,-19.1927 -7.87854,-23.49724 -10.2545,-24.16396 -2.61939,-0.73503 -59.69489,-0.75336 -62.29715,-0.02 -1.76593,0.49767 -2.55828,2.25699 -7.94524,17.64171 -3.29104,9.39891 -6.37773,17.34251 -6.85932,17.65245 -1.52536,0.98171 -37.30959,0.70758 -37.30959,-0.28579 z m 105.17856,-67.18142 c 0.86661,-0.86662 -1.03268,-7.69152 -9.02405,-32.42683 -8.02294,-24.83307 -11.7726,-34.8317 -12.71068,-33.89361 -1.70613,1.70613 -20.95379,59.40124 -21.47543,64.37288 -0.22125,2.10867 -0.19286,2.12209 5.53034,2.61302 7.81555,0.67043 36.85683,0.15752 37.67982,-0.66546 z"
     id="path3015"
     inkscape:connector-curvature="0" />
</svg>
