<?xml version="1.0" standalone="no"?>
<!DOCTYPE svg PUBLIC "-//W3C//DTD SVG 1.1//EN"
"http://www.w3.org/Graphics/SVG/1.1/DTD/svg11.dtd">

<svg width="1153" height="713" view_box="0 0 1153 713"
xmlns="http://www.w3.org/2000/svg"
xmlns:link="http://www.w3.org/1999/xlink">\n\n<desc>Généré par Mocodo 2.3.7 le Mon, 01 Jun 2020 20:13:24</desc>

<rect id="frame" x="0" y="0" width="1153" height="713" fill="none" stroke="none" stroke-width="0"/>

<!-- Association playsMainly -->
<line x1="729" y1="241" x2="403" y2="64" stroke="#000000" stroke-width="1"/>
<text x="658" y="226.70785733859117" fill="#000000" font-family="Futura" font-size="11">1,1</text>
<line x1="729" y1="64" x2="403" y2="64" stroke="#000000" stroke-width="1"/>
<text x="644" y="80.0" fill="#000000" font-family="Futura" font-size="11">0,N</text>
<g id="association-playsMainly">
	<path d="M 453 35 a 14 14 90 0 1 14 14 V 63 h -128 V 49 a 14 14 90 0 1 14 -14" fill="#FFFFFF" stroke="#FFFFFF" stroke-width="0"/>
	<path d="M 467 63.0 v 16 a 14 14 90 0 1 -14 14 H 353 a 14 14 90 0 1 -14 -14 V 63.0 H 128" fill="#FFFFFF" stroke="#FFFFFF" stroke-width="0"/>
	<rect x="339" y="35" width="128" height="58" fill="none" rx="14" stroke="#000000" stroke-width="1.5"/>
	<line x1="339" y1="63" x2="467" y2="63" stroke="#000000" stroke-width="1.5"/>
	<text x="346" y="56.3" fill="#000000" font-family="Copperplate" font-size="18">playsMainly</text>
</g>

<!-- Association plays -->
<line x1="729" y1="241" x2="579" y2="64" stroke="#000000" stroke-width="1"/>
<text x="657" y="194.11187988347328" fill="#000000" font-family="Futura" font-size="11">0,N</text>
<line x1="729" y1="64" x2="579" y2="64" stroke="#000000" stroke-width="1"/>
<text x="644" y="80.0" fill="#000000" font-family="Futura" font-size="11">0,N</text>
<g id="association-plays">
	<path d="M 598 35 a 14 14 90 0 1 14 14 V 63 h -66 V 49 a 14 14 90 0 1 14 -14" fill="#FFFFFF" stroke="#FFFFFF" stroke-width="0"/>
	<path d="M 612 63.0 v 16 a 14 14 90 0 1 -14 14 H 560 a 14 14 90 0 1 -14 -14 V 63.0 H 66" fill="#FFFFFF" stroke="#FFFFFF" stroke-width="0"/>
	<rect x="546" y="35" width="66" height="58" fill="none" rx="14" stroke="#000000" stroke-width="1.5"/>
	<line x1="546" y1="63" x2="612" y2="63" stroke="#000000" stroke-width="1.5"/>
	<text x="553" y="56.3" fill="#000000" font-family="Copperplate" font-size="18">plays</text>
</g>

<!-- Association stands -->
<line x1="729" y1="64" x2="858" y2="64" stroke="#000000" stroke-width="1"/>
<text x="795" y="80.0" fill="#000000" font-family="Futura" font-size="11">1,1</text>
<line x1="973" y1="241" x2="858" y2="64" stroke="#000000" stroke-width="1"/>
<text x="953.5144395686498" y="203" fill="#000000" font-family="Futura" font-size="11">0,N</text>
<g id="association-stands">
	<path d="M 883 35 a 14 14 90 0 1 14 14 V 63 h -78 V 49 a 14 14 90 0 1 14 -14" fill="#FFFFFF" stroke="#FFFFFF" stroke-width="0"/>
	<path d="M 897 63.0 v 16 a 14 14 90 0 1 -14 14 H 833 a 14 14 90 0 1 -14 -14 V 63.0 H 78" fill="#FFFFFF" stroke="#FFFFFF" stroke-width="0"/>
	<rect x="819" y="35" width="78" height="58" fill="none" rx="14" stroke="#000000" stroke-width="1.5"/>
	<line x1="819" y1="63" x2="897" y2="63" stroke="#000000" stroke-width="1.5"/>
	<text x="826" y="56.3" fill="#000000" font-family="Copperplate" font-size="18">stands</text>
</g>

<!-- Association picture -->
<line x1="242" y1="241" x2="109" y2="241" stroke="#000000" stroke-width="1"/>
<text x="157" y="257.0" fill="#000000" font-family="Futura" font-size="11">1,1</text>
<line x1="403" y1="241" x2="109" y2="241" stroke="#000000" stroke-width="1"/>
<text x="336" y="257.0" fill="#000000" font-family="Futura" font-size="11">0,1</text>
<g id="association-picture">
	<path d="M 137 212 a 14 14 90 0 1 14 14 V 240 h -84 V 226 a 14 14 90 0 1 14 -14" fill="#FFFFFF" stroke="#FFFFFF" stroke-width="0"/>
	<path d="M 151 240.0 v 16 a 14 14 90 0 1 -14 14 H 81 a 14 14 90 0 1 -14 -14 V 240.0 H 84" fill="#FFFFFF" stroke="#FFFFFF" stroke-width="0"/>
	<rect x="67" y="212" width="84" height="58" fill="none" rx="14" stroke="#000000" stroke-width="1.5"/>
	<line x1="67" y1="240" x2="151" y2="240" stroke="#000000" stroke-width="1.5"/>
	<text x="74" y="233.3" fill="#000000" font-family="Copperplate" font-size="18">picture</text>
</g>

<!-- Association match -->
<line x1="729" y1="241" x2="579" y2="241" stroke="#000000" stroke-width="1"/>
<text x="658" y="257.0" fill="#000000" font-family="Futura" font-size="11">1,1</text>
<line x1="403" y1="241" x2="579" y2="241" stroke="#000000" stroke-width="1"/>
<text x="452" y="257.0" fill="#000000" font-family="Futura" font-size="11">1,1</text>
<g id="association-match">
	<path d="M 600 212 a 14 14 90 0 1 14 14 V 240 h -70 V 226 a 14 14 90 0 1 14 -14" fill="#FFFFFF" stroke="#FFFFFF" stroke-width="0"/>
	<path d="M 614 240.0 v 16 a 14 14 90 0 1 -14 14 H 558 a 14 14 90 0 1 -14 -14 V 240.0 H 70" fill="#FFFFFF" stroke="#FFFFFF" stroke-width="0"/>
	<rect x="544" y="212" width="70" height="58" fill="none" rx="14" stroke="#000000" stroke-width="1.5"/>
	<line x1="544" y1="240" x2="614" y2="240" stroke="#000000" stroke-width="1.5"/>
	<text x="551" y="233.3" fill="#000000" font-family="Copperplate" font-size="18">match</text>
</g>

<!-- Association groups -->
<line x1="729" y1="241" x2="858" y2="241" stroke="#000000" stroke-width="1"/>
<text x="782" y="257.0" fill="#000000" font-family="Futura" font-size="11">0,N</text>
<line x1="973" y1="241" x2="858" y2="241" stroke="#000000" stroke-width="1"/>
<text x="903" y="257.0" fill="#000000" font-family="Futura" font-size="11">0,N</text>
<g id="association-groups">
	<path d="M 884 212 a 14 14 90 0 1 14 14 V 240 h -80 V 226 a 14 14 90 0 1 14 -14" fill="#FFFFFF" stroke="#FFFFFF" stroke-width="0"/>
	<path d="M 898 240.0 v 16 a 14 14 90 0 1 -14 14 H 832 a 14 14 90 0 1 -14 -14 V 240.0 H 80" fill="#FFFFFF" stroke="#FFFFFF" stroke-width="0"/>
	<rect x="818" y="212" width="80" height="58" fill="none" rx="14" stroke="#000000" stroke-width="1.5"/>
	<line x1="818" y1="240" x2="898" y2="240" stroke="#000000" stroke-width="1.5"/>
	<text x="825" y="233.3" fill="#000000" font-family="Copperplate" font-size="18">groups</text>
</g>

<!-- Association contains -->
<path d="M973 241 C 1012.6666666666666 209.0 1053.6666666666667 209.0 1096 241" fill="none" stroke="#000000" stroke-width="1"/>
<text x="1024" y="234.0" fill="#000000" font-family="Futura" font-size="11">0,N</text>
<path d="M973 241 C 1012.0 273.0 1053.0 273.0 1096 241" fill="none" stroke="#000000" stroke-width="1"/>
<text x="1024" y="256.0" fill="#000000" font-family="Futura" font-size="11">1,1</text>
<g id="association-contains">
	<path d="M 1130 212 a 14 14 90 0 1 14 14 V 240 h -96 V 226 a 14 14 90 0 1 14 -14" fill="#FFFFFF" stroke="#FFFFFF" stroke-width="0"/>
	<path d="M 1144 240.0 v 16 a 14 14 90 0 1 -14 14 H 1062 a 14 14 90 0 1 -14 -14 V 240.0 H 96" fill="#FFFFFF" stroke="#FFFFFF" stroke-width="0"/>
	<rect x="1048" y="212" width="96" height="58" fill="none" rx="14" stroke="#000000" stroke-width="1.5"/>
	<line x1="1048" y1="240" x2="1144" y2="240" stroke="#000000" stroke-width="1.5"/>
	<text x="1055" y="233.3" fill="#000000" font-family="Copperplate" font-size="18">contains</text>
</g>

<!-- Association subscribe -->
<line x1="242" y1="375" x2="403" y2="375" stroke="#000000" stroke-width="1"/>
<text x="326" y="391.0" fill="#000000" font-family="Futura" font-size="11">1,1</text>
<line x1="403" y1="241" x2="403" y2="375" stroke="#000000" stroke-width="1"/>
<text x="408.0" y="338" fill="#000000" font-family="Futura" font-size="11">0,1</text>
<g id="association-subscribe">
	<path d="M 442 346 a 14 14 90 0 1 14 14 V 374 h -106 V 360 a 14 14 90 0 1 14 -14" fill="#FFFFFF" stroke="#FFFFFF" stroke-width="0"/>
	<path d="M 456 374.0 v 16 a 14 14 90 0 1 -14 14 H 364 a 14 14 90 0 1 -14 -14 V 374.0 H 106" fill="#FFFFFF" stroke="#FFFFFF" stroke-width="0"/>
	<rect x="350" y="346" width="106" height="58" fill="none" rx="14" stroke="#000000" stroke-width="1.5"/>
	<line x1="350" y1="374" x2="456" y2="374" stroke="#000000" stroke-width="1.5"/>
	<text x="357" y="367.3" fill="#000000" font-family="Copperplate" font-size="18">subscribe</text>
</g>

<!-- Association user_permissions -->
<line x1="579" y1="466" x2="403" y2="466" stroke="#000000" stroke-width="1"/>
<text x="496" y="482.0" fill="#000000" font-family="Futura" font-size="11">0,N</text>
<line x1="729" y1="241" x2="403" y2="466" stroke="#000000" stroke-width="1"/>
<text x="657" y="271.39686080717917" fill="#000000" font-family="Futura" font-size="11">0,N</text>
<g id="association-user_permissions">
	<path d="M 477 437 a 14 14 90 0 1 14 14 V 465 h -176 V 451 a 14 14 90 0 1 14 -14" fill="#FFFFFF" stroke="#FFFFFF" stroke-width="0"/>
	<path d="M 491 465.0 v 16 a 14 14 90 0 1 -14 14 H 329 a 14 14 90 0 1 -14 -14 V 465.0 H 176" fill="#FFFFFF" stroke="#FFFFFF" stroke-width="0"/>
	<rect x="315" y="437" width="176" height="58" fill="none" rx="14" stroke="#000000" stroke-width="1.5"/>
	<line x1="315" y1="465" x2="491" y2="465" stroke="#000000" stroke-width="1.5"/>
	<text x="322" y="458.3" fill="#000000" font-family="Copperplate" font-size="18">user_permissions</text>
</g>

<!-- Association permissions -->
<line x1="579" y1="466" x2="729" y2="466" stroke="#000000" stroke-width="1"/>
<text x="643" y="482.0" fill="#000000" font-family="Futura" font-size="11">0,N</text>
<line x1="973" y1="241" x2="729" y2="466" stroke="#000000" stroke-width="1"/>
<text x="938.8004480249485" y="287" fill="#000000" font-family="Futura" font-size="11">0,N</text>
<g id="association-permissions">
	<path d="M 777 437 a 14 14 90 0 1 14 14 V 465 h -124 V 451 a 14 14 90 0 1 14 -14" fill="#FFFFFF" stroke="#FFFFFF" stroke-width="0"/>
	<path d="M 791 465.0 v 16 a 14 14 90 0 1 -14 14 H 681 a 14 14 90 0 1 -14 -14 V 465.0 H 124" fill="#FFFFFF" stroke="#FFFFFF" stroke-width="0"/>
	<rect x="667" y="437" width="124" height="58" fill="none" rx="14" stroke="#000000" stroke-width="1.5"/>
	<line x1="667" y1="465" x2="791" y2="465" stroke="#000000" stroke-width="1.5"/>
	<text x="674" y="458.3" fill="#000000" font-family="Copperplate" font-size="18">permissions</text>
</g>

<!-- Association content_type -->
<line x1="579" y1="466" x2="579" y2="557" stroke="#000000" stroke-width="1"/>
<text x="584.0" y="520" fill="#000000" font-family="Futura" font-size="11">1,1</text>
<line x1="579" y1="657" x2="579" y2="557" stroke="#000000" stroke-width="1"/>
<text x="584.0" y="602" fill="#000000" font-family="Futura" font-size="11">0,N</text>
<g id="association-content_type">
	<path d="M 633 528 a 14 14 90 0 1 14 14 V 556 h -136 V 542 a 14 14 90 0 1 14 -14" fill="#FFFFFF" stroke="#FFFFFF" stroke-width="0"/>
	<path d="M 647 556.0 v 16 a 14 14 90 0 1 -14 14 H 525 a 14 14 90 0 1 -14 -14 V 556.0 H 136" fill="#FFFFFF" stroke="#FFFFFF" stroke-width="0"/>
	<rect x="511" y="528" width="136" height="58" fill="none" rx="14" stroke="#000000" stroke-width="1.5"/>
	<line x1="511" y1="556" x2="647" y2="556" stroke="#000000" stroke-width="1.5"/>
	<text x="518" y="549.3" fill="#000000" font-family="Copperplate" font-size="18">content_type</text>
</g>

<!-- Entity Instrument -->
<g id="entity-Instrument">
	<g id="frame-Instrument">
		<rect x="668" y="9" width="122" height="30" fill="#FFFFFF" stroke="#FFFFFF" stroke-width="0"/>
		<rect x="668" y="39.0" width="122" height="80" fill="#FFFFFF" stroke="#FFFFFF" stroke-width="0"/>
		<rect x="668" y="9" width="122" height="110" fill="none" stroke="#000000" stroke-width="1.5"/>
		<line x1="668" y1="39" x2="790" y2="39" stroke="#000000" stroke-width="1.5"/>
	</g>
	<text x="676" y="30.299999999999997" fill="#000000" font-family="Copperplate" font-size="18">Instrument</text>
	<text x="676" y="56.1" fill="#000000" font-family="Gill Sans" font-size="15">nameInstrument</text>
	<line x1="676" y1="59" x2="778" y2="59" stroke="#000000" stroke-width="1"/>
	<text x="676" y="73.1" fill="#000000" font-family="Gill Sans" font-size="15">transposition</text>
	<text x="676" y="90.1" fill="#000000" font-family="Gill Sans" font-size="15">key</text>
</g>

<!-- Entity File -->
<g id="entity-File">
	<g id="frame-File">
		<rect x="180" y="177" width="124" height="30" fill="#FFFFFF" stroke="#FFFFFF" stroke-width="0"/>
		<rect x="180" y="207.0" width="124" height="98" fill="#FFFFFF" stroke="#FFFFFF" stroke-width="0"/>
		<rect x="180" y="177" width="124" height="128" fill="none" stroke="#000000" stroke-width="1.5"/>
		<line x1="180" y1="207" x2="304" y2="207" stroke="#000000" stroke-width="1.5"/>
	</g>
	<text x="223" y="198.3" fill="#000000" font-family="Copperplate" font-size="18">File</text>
	<text x="188" y="224.1" fill="#000000" font-family="Gill Sans" font-size="15">fileName</text>
	<line x1="188" y1="227" x2="244" y2="227" stroke="#000000" stroke-width="1"/>
	<text x="188" y="241.1" fill="#000000" font-family="Gill Sans" font-size="15">fileDescription</text>
	<text x="188" y="258.1" fill="#000000" font-family="Gill Sans" font-size="15">fileField</text>
	<text x="188" y="275.0" fill="#000000" font-family="Gill Sans" font-size="15">creationDate</text>
	<text x="188" y="292.0" fill="#000000" font-family="Gill Sans" font-size="15">modificationDate</text>
</g>

<!-- Entity Profile -->
<g id="entity-Profile">
	<g id="frame-Profile">
		<rect x="359" y="160" width="88" height="30" fill="#FFFFFF" stroke="#FFFFFF" stroke-width="0"/>
		<rect x="359" y="190.0" width="88" height="132" fill="#FFFFFF" stroke="#FFFFFF" stroke-width="0"/>
		<rect x="359" y="160" width="88" height="162" fill="none" stroke="#000000" stroke-width="1.5"/>
		<line x1="359" y1="190" x2="447" y2="190" stroke="#000000" stroke-width="1.5"/>
	</g>
	<text x="367" y="181.3" fill="#000000" font-family="Copperplate" font-size="18">Profile</text>
	<text x="367" y="207.0" fill="#000000" font-family="Gill Sans" font-size="15">id</text>
	<line x1="367" y1="210" x2="379" y2="210" stroke="#000000" stroke-width="1"/>
	<text x="367" y="224.1" fill="#000000" font-family="Gill Sans" font-size="15">phone</text>
	<text x="367" y="241.1" fill="#000000" font-family="Gill Sans" font-size="15">address</text>
	<text x="367" y="258.1" fill="#000000" font-family="Gill Sans" font-size="15">postalCode</text>
	<text x="367" y="275.0" fill="#000000" font-family="Gill Sans" font-size="15">city</text>
	<text x="367" y="292.0" fill="#000000" font-family="Gill Sans" font-size="15">country</text>
	<text x="367" y="309.0" fill="#000000" font-family="Gill Sans" font-size="15">job</text>
</g>

<!-- Entity User -->
<g id="entity-User">
	<g id="frame-User">
		<rect x="681" y="143" width="96" height="30" fill="#FFFFFF" stroke="#FFFFFF" stroke-width="0"/>
		<rect x="681" y="173.0" width="96" height="166" fill="#FFFFFF" stroke="#FFFFFF" stroke-width="0"/>
		<rect x="681" y="143" width="96" height="196" fill="none" stroke="#000000" stroke-width="1.5"/>
		<line x1="681" y1="173" x2="777" y2="173" stroke="#000000" stroke-width="1.5"/>
	</g>
	<text x="706" y="164.3" fill="#000000" font-family="Copperplate" font-size="18">User</text>
	<text x="689" y="190.0" fill="#000000" font-family="Gill Sans" font-size="15">id</text>
	<line x1="689" y1="193" x2="701" y2="193" stroke="#000000" stroke-width="1"/>
	<text x="689" y="207.0" fill="#000000" font-family="Gill Sans" font-size="15">email</text>
	<text x="689" y="224.1" fill="#000000" font-family="Gill Sans" font-size="15">password</text>
	<text x="689" y="241.1" fill="#000000" font-family="Gill Sans" font-size="15">first_name</text>
	<text x="689" y="258.1" fill="#000000" font-family="Gill Sans" font-size="15">last_name</text>
	<text x="689" y="275.0" fill="#000000" font-family="Gill Sans" font-size="15">is_active</text>
	<text x="689" y="292.0" fill="#000000" font-family="Gill Sans" font-size="15">is_superuser</text>
	<text x="689" y="309.0" fill="#000000" font-family="Gill Sans" font-size="15">last_login</text>
	<text x="689" y="326.0" fill="#000000" font-family="Gill Sans" font-size="15">date_joined</text>
</g>

<!-- Entity Group -->
<g id="entity-Group">
	<g id="frame-Group">
		<rect x="927" y="211" width="92" height="30" fill="#FFFFFF" stroke="#FFFFFF" stroke-width="0"/>
		<rect x="927" y="241.0" width="92" height="30" fill="#FFFFFF" stroke="#FFFFFF" stroke-width="0"/>
		<rect x="927" y="211" width="92" height="60" fill="none" stroke="#000000" stroke-width="1.5"/>
		<line x1="927" y1="241" x2="1019" y2="241" stroke="#000000" stroke-width="1.5"/>
	</g>
	<text x="944" y="232.3" fill="#000000" font-family="Copperplate" font-size="18">Group</text>
	<text x="935" y="258.1" fill="#000000" font-family="Gill Sans" font-size="15">nameGroup</text>
	<line x1="935" y1="261" x2="1010" y2="261" stroke="#000000" stroke-width="1"/>
</g>

<!-- Entity subscription -->
<g id="entity-subscription">
	<g id="frame-subscription">
		<rect x="163" y="337" width="158" height="30" fill="#FFFFFF" stroke="#FFFFFF" stroke-width="0"/>
		<rect x="163" y="367.0" width="158" height="46" fill="#FFFFFF" stroke="#FFFFFF" stroke-width="0"/>
		<rect x="163" y="337" width="158" height="76" fill="none" stroke="#000000" stroke-width="1.5"/>
		<line x1="163" y1="367" x2="321" y2="367" stroke="#000000" stroke-width="1.5"/>
	</g>
	<text x="182" y="358.3" fill="#000000" font-family="Copperplate" font-size="18">subscription</text>
	<text x="171" y="384.1" fill="#000000" font-family="Gill Sans" font-size="15">id</text>
	<line x1="171" y1="387" x2="183" y2="387" stroke="#000000" stroke-width="1"/>
	<text x="171" y="401.1" fill="#000000" font-family="Gill Sans" font-size="15">last_subscription_date</text>
</g>

<!-- Entity Permission -->
<g id="entity-Permission">
	<g id="frame-Permission">
		<rect x="520" y="428" width="118" height="30" fill="#FFFFFF" stroke="#FFFFFF" stroke-width="0"/>
		<rect x="520" y="458.0" width="118" height="46" fill="#FFFFFF" stroke="#FFFFFF" stroke-width="0"/>
		<rect x="520" y="428" width="118" height="76" fill="none" stroke="#000000" stroke-width="1.5"/>
		<line x1="520" y1="458" x2="638" y2="458" stroke="#000000" stroke-width="1.5"/>
	</g>
	<text x="528" y="449.3" fill="#000000" font-family="Copperplate" font-size="18">Permission</text>
	<text x="528" y="475.1" fill="#000000" font-family="Gill Sans" font-size="15">name</text>
	<line x1="528" y1="478" x2="562" y2="478" stroke="#000000" stroke-width="1"/>
	<text x="528" y="492.1" fill="#000000" font-family="Gill Sans" font-size="15">codename</text>
</g>

<!-- Entity ContentType -->
<g id="entity-ContentType">
	<g id="frame-ContentType">
		<rect x="512" y="610" width="134" height="30" fill="#FFFFFF" stroke="#FFFFFF" stroke-width="0"/>
		<rect x="512" y="640.0" width="134" height="64" fill="#FFFFFF" stroke="#FFFFFF" stroke-width="0"/>
		<rect x="512" y="610" width="134" height="94" fill="none" stroke="#000000" stroke-width="1.5"/>
		<line x1="512" y1="640" x2="646" y2="640" stroke="#000000" stroke-width="1.5"/>
	</g>
	<text x="520" y="631.3" fill="#000000" font-family="Copperplate" font-size="18">ContentType</text>
	<text x="520" y="657.1" fill="#000000" font-family="Gill Sans" font-size="15">app_label</text>
	<line x1="520" y1="660" x2="579" y2="660" stroke="#000000" stroke-width="1"/>
	<text x="520" y="674.1" fill="#000000" font-family="Gill Sans" font-size="15">model</text>
	<text x="520" y="691.0" fill="#000000" font-family="Gill Sans" font-size="15">name</text>
</g>
</svg>