<?xml version="1.0" standalone="no"?>
<!DOCTYPE svg PUBLIC "-//W3C//DTD SVG 1.1//EN" "http://www.w3.org/Graphics/SVG/1.1/DTD/svg11.dtd" >
<svg xmlns="http://www.w3.org/2000/svg">
<metadata>Generated by IcoMoon</metadata>
<defs>
<font id="icomoon" horiz-adv-x="1024">
<font-face units-per-em="1024" ascent="960" descent="-64" />
<missing-glyph horiz-adv-x="1024" />
<glyph unicode="&#x20;" horiz-adv-x="512" d="" />
<glyph unicode="&#xe900;" glyph-name="motorcycle" horiz-adv-x="1333" d="M1314.857 358.857c18.286-160.571-112.571-295.429-272-285.143-122.286 8-224 105.714-236.571 228-9.143 86.857 25.143 165.143 83.429 217.714l-40.571 61.143c-72-60-117.714-149.714-117.714-250.286 0-20.571-16-37.714-36.571-37.714h-185.714c-17.714-124-124-219.429-253.143-219.429-141.143 0-256 114.857-256 256s114.857 256 256 256c30.286 0 59.429-5.714 86.857-15.429l13.714 25.714c-44 39.429-101.714 62.857-173.714 62.857h-36.571c-20 0-36.571 16.571-36.571 36.571s16.571 36.571 36.571 36.571h73.143c128 0 193.143-52.571 219.429-73.143h358.286l-48.571 73.143h-126.857c-22.286 0-40 20-36 42.857 2.857 17.714 20 30.286 37.714 30.286h144.571c12 0 23.429-6.286 30.286-16l40-60 65.143 65.143c6.857 6.857 16.571 10.857 26.286 10.857h57.714c20 0 36.571-16.571 36.571-36.571v-73.143c0-20-16.571-36.571-36.571-36.571h-102.286l65.714-98.286c46.286 22.286 100 31.429 157.143 20.571 109.143-20 194.286-111.429 206.857-221.714zM256 146.286c88.571 0 162.286 62.857 179.429 146.286h-179.429c-12.571 0-24.571 6.857-31.429 17.714-6.286 10.857-6.857 24.571-0.571 36l84 158.286c-16.571 4.571-33.714 7.429-52 7.429-100.571 0-182.857-82.286-182.857-182.857s82.286-182.857 182.857-182.857zM1060.571 146.286c100.571 0 182.857 82.286 182.857 182.857s-82.286 182.857-182.857 182.857c-24.571 0-47.429-5.143-69.143-13.714l99.429-148.571c11.429-17.143 6.857-40-9.714-50.857-6.286-4.571-13.714-6.286-20.571-6.286-12 0-23.429 5.714-30.286 16.571l-99.429 148.571c-32.571-33.143-53.143-78.286-53.143-128.571 0-100.571 82.286-182.857 182.857-182.857z" />
<glyph unicode="&#xe901;" glyph-name="electric-scooter" d="M334 256.667h306v42q0 48 23 86t62 61 85 23h32l-80 360q-8 30-31 49t-53 19h-166v-86h166l60-266q-70-22-119-76t-61-128h-224q-16 44-56 69t-90 15q-38-8-66-36t-34-66q-8-40 8-75t47-56 71-21 73 24 47 62zM214 256.667q-18 0-31 12t-13 30 13 30 31 12q16 0 29-12t13-30-13-30-29-12zM810 426.667q-34 0-63-17t-47-46-18-65 18-65 47-46 63-17q36 0 65 17t46 46 17 65-17 65-46 46-65 17zM810 256.667q-16 0-29 12t-13 30 13 30 29 12q18 0 31-12t13-30-13-30-31-12zM470 84.667h-172l256-128v86h172l-256 128v-86z" />
<glyph unicode="&#xe902;" glyph-name="electric-bike" d="M810 640.667h-34l-72 200q-10 24-32 40t-50 16h-110v-86h110l64-170h-206l-16 42h48v86h-214v-86h76l76-214h-28q-8 48-37 86t-70 60-91 24q-60 4-111-25t-82-78-31-109 28-108 77-77 109-29q52 0 96 22t73 61 39 89h180q8-48 37-86t70-60 91-24q60-4 111 25t82 78 31 109-28 108-77 77-109 29zM334 384.667q-14-38-46-62t-74-24q-36 0-65 17t-46 46-17 65 17 65 46 46 65 17q42 0 74-24t46-62h-120v-84h120zM602 468.667h-60l-32 86h130q-14-18-24-40t-14-46zM810 298.667q-36 0-65 17t-46 46-17 65q0 30 12 55t34 43l40-114 80 30-40 114h2q36 0 65-17t46-46 17-65-17-65-46-46-65-17zM470 84.667h-172l256-128v86h172l-256 128v-86z" />
<glyph unicode="&#xe903;" glyph-name="rer" d="M704 212.667q28 0 46 19t18 45-18 45-46 19-46-19-18-45 18-45 46-19zM554 512.667h214v170h-214v-170zM470 512.667v170h-214v-170h214zM320 212.667q28 0 46 19t18 45-18 45-46 19-46-19-18-45 18-45 46-19zM512 852.667q166 0 254-34t88-136v-406q0-62-44-105t-106-43l64-64v-22h-86l-84 86h-162l-84-86h-96v22l64 64q-62 0-106 43t-44 105v406q0 54 28 90t81 52 106 22 127 6z" />
<glyph unicode="&#xe904;" glyph-name="tram" d="M726 340.667v214h-428v-214h428zM512 148.667q28 0 46 19t18 45-18 45-46 19-46-19-18-45 18-45 46-19zM810 216.667q0-56-29-94t-81-38h4l64-64v-20h-86l-84 84h-162l-84-84h-96v20l68 68q-46 10-78 46t-32 82v360q0 82 68 113t186 35l34 64h-204v64h428v-64h-140l-32-64q126-4 191-34t65-114v-360z" />
<glyph unicode="&#xe905;" glyph-name="subway" d="M768 260.667v294q0 76-66 102t-190 26q-118 0-187-26t-69-102v-294q0-46 33-79t79-33l-48-48v-16h72l64 64h120l64-64h64v16l-48 48q46 0 79 33t33 79zM760 818.667q86-32 132-100t46-158v-560h-852v560q0 90 46 158t132 100q86 34 248 34t248-34zM300 554.667h426v-214h-426v214zM320 256.667q0 18 12 30t30 12 31-12 13-30-13-31-31-13-30 13-12 31zM618 256.667q0 18 13 30t31 12 30-12 12-30-12-31-30-13-31 13-13 31z" />
<glyph unicode="&#xe906;" glyph-name="walk" d="M418 558.667l-120-602h90l78 342 88-86v-256h86v320l-90 86 26 128q92-106 234-106v84q-124 0-182 104l-44 68q-30 42-72 42-6 0-17-2t-17-2l-222-94v-200h86v144l76 30zM576 704.667q-34 0-60 25t-26 59 26 60 60 26 60-26 26-60-26-59-60-25z" />
</font></defs></svg>