{
  "name": "mypadsfont",
  "css_prefix_text": "icon-",
  "css_use_suffix": false,
  "hinting": true,
  "units_per_em": 1000,
  "ascent": 850,
  "glyphs": [
    {
      "uid": "25b34dea4784f72c710454f32ff8fa2b",
      "css": "star",
      "code": 59409,
      "src": "entypo"
    },
    {
      "uid": "0e3f1335f83cca67329b2c4bcb3aaec5",
      "css": "star-empty",
      "code": 59410,
      "src": "entypo"
    },
    {
      "uid": "bbd66ef66bb8fa9edde54d9a90b89150",
      "css": "user",
      "code": 59394,
      "src": "entypo"
    },
    {
      "uid": "14017aae737730faeda4a6fd8fb3a5f0",
      "css": "check",
      "code": 59404,
      "src": "entypo"
    },
    {
      "uid": "c709da589c923ba3c2ad48d9fc563e93",
      "css": "cancel",
      "code": 59403,
      "src": "entypo"
    },
    {
      "uid": "c759418c008e9562944080fee617fc76",
      "css": "cancel-circled",
      "code": 59402,
      "src": "entypo"
    },
    {
      "uid": "9e1c33b6849ceb08db8acfaf02188b7d",
      "css": "plus-squared",
      "code": 59408,
      "src": "entypo"
    },
    {
      "uid": "de9a631a7d18106aea1c89ba51b1990a",
      "css": "help-circled",
      "code": 59413,
      "src": "entypo"
    },
    {
      "uid": "7e4164950ffa4990961958b2d6318658",
      "css": "info-circled",
      "code": 59399,
      "src": "entypo"
    },
    {
      "uid": "815503841e980c848f55e0271deacead",
      "css": "link",
      "code": 59412,
      "src": "entypo"
    },
    {
      "uid": "8538a2249db7f07ae75411886732fb87",
      "css": "bookmarks",
      "code": 59392,
      "src": "entypo"
    },
    {
      "uid": "7ad4d2306ebda8452e5e3eff3cd8241c",
      "css": "thumbs-up",
      "code": 59398,
      "src": "entypo"
    },
    {
      "uid": "c77fd2fd065b5fe16d6f2b41e190b266",
      "css": "pencil",
      "code": 59405,
      "src": "entypo"
    },
    {
      "uid": "97902f87200ce74d181044df02a0458d",
      "css": "attention",
      "code": 59401,
      "src": "entypo"
    },
    {
      "uid": "39a5a0d7ce8342d149373b2ce219503a",
      "css": "alert",
      "code": 59400,
      "src": "entypo"
    },
    {
      "uid": "2626e3a1bbcd90e45849af3b58a1d594",
      "css": "trash",
      "code": 59406,
      "src": "entypo"
    },
    {
      "uid": "1189604bf305b6b03a74685ce60e6632",
      "css": "doc-text",
      "code": 59393,
      "src": "entypo"
    },
    {
      "uid": "51727ca007aa35ceabcaffc28934faee",
      "css": "book-open",
      "code": 59407,
      "src": "entypo"
    },
    {
      "uid": "6a7b9d4863bb7e6c79e9457a72d689b6",
      "css": "tools",
      "code": 59395,
      "src": "entypo"
    },
    {
      "uid": "91426c82d94428a33353e495418435e3",
      "css": "share",
      "code": 59411,
      "src": "entypo"
    },
    {
      "uid": "a204f0fa972408eaae5a363c444991b2",
      "css": "login",
      "code": 59396,
      "src": "entypo"
    },
    {
      "uid": "2d76f2c8d13be40694ecadfea7fb83c3",
      "css": "logout",
      "code": 59397,
      "src": "entypo"
    },
    {
      "uid": "9248ce8062fb4707a6919bfe9ac1af8e",
      "css": "popup",
      "code": 59414,
      "src": "entypo"
    }
  ]
}