<?xml version="1.0" encoding="UTF-8"?>
<svg width="204px" height="204px" viewBox="0 0 204 204" version="1.1" xmlns="http://www.w3.org/2000/svg" xmlns:xlink="http://www.w3.org/1999/xlink">
    <!-- Generator: Sketch 39.1 (31720) - http://www.bohemiancoding.com/sketch -->
    <title>Group</title>
    <desc>Created with Sketch.</desc>
    <defs>
        <rect id="path-1" x="0" y="0" width="204" height="204"></rect>
        <rect id="path-3" x="0" y="0" width="250" height="204"></rect>
        <linearGradient x1="50%" y1="0%" x2="50%" y2="100%" id="linearGradient-5">
            <stop stop-color="#B54D1E" offset="0%"></stop>
            <stop stop-color="#9D280B" offset="100%"></stop>
        </linearGradient>
        <rect id="path-6" x="27.4725275" y="0" width="55.8608059" height="30.2970297" rx="8"></rect>
        <mask id="mask-7" maskContentUnits="userSpaceOnUse" maskUnits="objectBoundingBox" x="0" y="0" width="55.8608059" height="30.2970297" fill="white">
            <use xlink:href="#path-6"></use>
        </mask>
        <rect id="path-8" x="83.3333333" y="0" width="55.8608059" height="30.2970297" rx="8"></rect>
        <mask id="mask-9" maskContentUnits="userSpaceOnUse" maskUnits="objectBoundingBox" x="0" y="0" width="55.8608059" height="30.2970297" fill="white">
            <use xlink:href="#path-8"></use>
        </mask>
        <rect id="path-10" x="139.194139" y="0" width="55.8608059" height="30.2970297" rx="8"></rect>
        <mask id="mask-11" maskContentUnits="userSpaceOnUse" maskUnits="objectBoundingBox" x="0" y="0" width="55.8608059" height="30.2970297" fill="white">
            <use xlink:href="#path-10"></use>
        </mask>
        <rect id="path-12" x="195.054945" y="0" width="55.8608059" height="30.2970297" rx="8"></rect>
        <mask id="mask-13" maskContentUnits="userSpaceOnUse" maskUnits="objectBoundingBox" x="0" y="0" width="55.8608059" height="30.2970297" fill="white">
            <use xlink:href="#path-12"></use>
        </mask>
        <rect id="path-14" x="55.8608059" y="30.2970297" width="55.8608059" height="30.2970297" rx="8"></rect>
        <mask id="mask-15" maskContentUnits="userSpaceOnUse" maskUnits="objectBoundingBox" x="0" y="0" width="55.8608059" height="30.2970297" fill="white">
            <use xlink:href="#path-14"></use>
        </mask>
        <rect id="path-16" x="111.721612" y="30.2970297" width="55.8608059" height="30.2970297" rx="8"></rect>
        <mask id="mask-17" maskContentUnits="userSpaceOnUse" maskUnits="objectBoundingBox" x="0" y="0" width="55.8608059" height="30.2970297" fill="white">
            <use xlink:href="#path-16"></use>
        </mask>
        <rect id="path-18" x="167.582418" y="30.2970297" width="55.8608059" height="30.2970297" rx="8"></rect>
        <mask id="mask-19" maskContentUnits="userSpaceOnUse" maskUnits="objectBoundingBox" x="0" y="0" width="55.8608059" height="30.2970297" fill="white">
            <use xlink:href="#path-18"></use>
        </mask>
        <rect id="path-20" x="223.443223" y="30.2970297" width="55.8608059" height="30.2970297" rx="8"></rect>
        <mask id="mask-21" maskContentUnits="userSpaceOnUse" maskUnits="objectBoundingBox" x="0" y="0" width="55.8608059" height="30.2970297" fill="white">
            <use xlink:href="#path-20"></use>
        </mask>
        <rect id="path-22" x="250.915751" y="0" width="55.8608059" height="30.2970297" rx="8"></rect>
        <mask id="mask-23" maskContentUnits="userSpaceOnUse" maskUnits="objectBoundingBox" x="0" y="0" width="55.8608059" height="30.2970297" fill="white">
            <use xlink:href="#path-22"></use>
        </mask>
        <rect id="path-24" x="28.3882784" y="60.5940594" width="55.8608059" height="30.2970297" rx="8"></rect>
        <mask id="mask-25" maskContentUnits="userSpaceOnUse" maskUnits="objectBoundingBox" x="0" y="0" width="55.8608059" height="30.2970297" fill="white">
            <use xlink:href="#path-24"></use>
        </mask>
        <rect id="path-26" x="84.2490842" y="60.5940594" width="55.8608059" height="30.2970297" rx="8"></rect>
        <mask id="mask-27" maskContentUnits="userSpaceOnUse" maskUnits="objectBoundingBox" x="0" y="0" width="55.8608059" height="30.2970297" fill="white">
            <use xlink:href="#path-26"></use>
        </mask>
        <rect id="path-28" x="140.10989" y="60.5940594" width="55.8608059" height="30.2970297" rx="8"></rect>
        <mask id="mask-29" maskContentUnits="userSpaceOnUse" maskUnits="objectBoundingBox" x="0" y="0" width="55.8608059" height="30.2970297" fill="white">
            <use xlink:href="#path-28"></use>
        </mask>
        <rect id="path-30" x="195.970696" y="60.5940594" width="55.8608059" height="30.2970297" rx="8"></rect>
        <mask id="mask-31" maskContentUnits="userSpaceOnUse" maskUnits="objectBoundingBox" x="0" y="0" width="55.8608059" height="30.2970297" fill="white">
            <use xlink:href="#path-30"></use>
        </mask>
        <rect id="path-32" x="251.831502" y="60.5940594" width="55.8608059" height="30.2970297" rx="8"></rect>
        <mask id="mask-33" maskContentUnits="userSpaceOnUse" maskUnits="objectBoundingBox" x="0" y="0" width="55.8608059" height="30.2970297" fill="white">
            <use xlink:href="#path-32"></use>
        </mask>
        <rect id="path-34" x="56.7765568" y="90.8910891" width="55.8608059" height="30.2970297" rx="8"></rect>
        <mask id="mask-35" maskContentUnits="userSpaceOnUse" maskUnits="objectBoundingBox" x="0" y="0" width="55.8608059" height="30.2970297" fill="white">
            <use xlink:href="#path-34"></use>
        </mask>
        <rect id="path-36" x="111.721612" y="90.8910891" width="55.8608059" height="30.2970297" rx="8"></rect>
        <mask id="mask-37" maskContentUnits="userSpaceOnUse" maskUnits="objectBoundingBox" x="0" y="0" width="55.8608059" height="30.2970297" fill="white">
            <use xlink:href="#path-36"></use>
        </mask>
        <rect id="path-38" x="167.582418" y="90.8910891" width="55.8608059" height="30.2970297" rx="8"></rect>
        <mask id="mask-39" maskContentUnits="userSpaceOnUse" maskUnits="objectBoundingBox" x="0" y="0" width="55.8608059" height="30.2970297" fill="white">
            <use xlink:href="#path-38"></use>
        </mask>
        <rect id="path-40" x="224.358974" y="90.8910891" width="55.8608059" height="30.2970297" rx="8"></rect>
        <mask id="mask-41" maskContentUnits="userSpaceOnUse" maskUnits="objectBoundingBox" x="0" y="0" width="55.8608059" height="30.2970297" fill="white">
            <use xlink:href="#path-40"></use>
        </mask>
        <linearGradient x1="50%" y1="50%" x2="209.033203%" y2="50%" id="linearGradient-42">
            <stop stop-color="#4D72BF" offset="0%"></stop>
            <stop stop-color="#D8D8D8" offset="100%"></stop>
        </linearGradient>
        <rect id="path-43" x="27.3892774" y="4.53502709" width="4.66200466" height="29.8016066"></rect>
        <mask id="mask-44" maskContentUnits="userSpaceOnUse" maskUnits="objectBoundingBox" x="0" y="0" width="4.66200466" height="29.8016066" fill="white">
            <use xlink:href="#path-43"></use>
        </mask>
        <rect id="path-45" x="43.040293" y="7.06930693" width="7.32600733" height="46.4554455"></rect>
        <mask id="mask-46" maskContentUnits="userSpaceOnUse" maskUnits="objectBoundingBox" x="0" y="0" width="7.32600733" height="46.4554455" fill="white">
            <use xlink:href="#path-45"></use>
        </mask>
        <radialGradient cx="48.3894229%" cy="63.1803385%" fx="48.3894229%" fy="63.1803385%" r="109.733105%" id="radialGradient-47">
            <stop stop-color="#9A672B" offset="0%"></stop>
            <stop stop-color="#49280C" offset="100%"></stop>
        </radialGradient>
        <path d="M257.145518,121.188119 L324.175824,121.188119 L324.175824,0 L26.5567766,0 L26.5567766,121.188119 L78.9350679,121.188119 C78.8153471,119.518541 78.7545788,117.834838 78.7545788,116.138614 C78.7545788,72.6338864 118.729155,37.3663366 168.040293,37.3663366 C217.351431,37.3663366 257.326007,72.6338864 257.326007,116.138614 C257.326007,117.834838 257.265239,119.518541 257.145518,121.188119 Z" id="path-48"></path>
    </defs>
    <g id="Page-1" stroke="none" stroke-width="1" fill="none" fill-rule="evenodd">
        <g id="Group">
            <mask id="mask-2" fill="white">
                <use xlink:href="#path-1"></use>
            </mask>
            <use id="Mask" fill="#D8D8D8" xlink:href="#path-1"></use>
            <g mask="url(#mask-2)">
                <g transform="translate(-23.000000, 0.000000)">
                    <mask id="mask-4" fill="white">
                        <use xlink:href="#path-3"></use>
                    </mask>
                    <g id="Mask" stroke="none" fill="none"></g>
                    <g id="bas" stroke="none" stroke-width="1" fill="none" fill-rule="evenodd" mask="url(#mask-4)">
                        <g transform="translate(-43.956044, 102.000000)">
                            <rect id="joint" stroke="none" fill="#DBB4B4" x="28.3882784" y="1.00990099" width="307.692308" height="108.059406"></rect>
                            <use id="Rectangle" stroke="#7B1708" mask="url(#mask-7)" stroke-width="2" fill="url(#linearGradient-5)" xlink:href="#path-6"></use>
                            <use id="Rectangle" stroke="#7B1708" mask="url(#mask-9)" stroke-width="2" fill="url(#linearGradient-5)" xlink:href="#path-8"></use>
                            <use id="Rectangle" stroke="#7B1708" mask="url(#mask-11)" stroke-width="2" fill="url(#linearGradient-5)" xlink:href="#path-10"></use>
                            <use id="Rectangle" stroke="#7B1708" mask="url(#mask-13)" stroke-width="2" fill="url(#linearGradient-5)" xlink:href="#path-12"></use>
                            <use id="Rectangle" stroke="#7B1708" mask="url(#mask-15)" stroke-width="2" fill="url(#linearGradient-5)" xlink:href="#path-14"></use>
                            <use id="Rectangle" stroke="#7B1708" mask="url(#mask-17)" stroke-width="2" fill="url(#linearGradient-5)" xlink:href="#path-16"></use>
                            <use id="Rectangle" stroke="#7B1708" mask="url(#mask-19)" stroke-width="2" fill="url(#linearGradient-5)" xlink:href="#path-18"></use>
                            <use id="Rectangle" stroke="#7B1708" mask="url(#mask-21)" stroke-width="2" fill="url(#linearGradient-5)" xlink:href="#path-20"></use>
                            <use id="Rectangle" stroke="#7B1708" mask="url(#mask-23)" stroke-width="2" fill="url(#linearGradient-5)" xlink:href="#path-22"></use>
                            <use id="Rectangle" stroke="#7B1708" mask="url(#mask-25)" stroke-width="2" fill="url(#linearGradient-5)" xlink:href="#path-24"></use>
                            <use id="Rectangle" stroke="#7B1708" mask="url(#mask-27)" stroke-width="2" fill="url(#linearGradient-5)" xlink:href="#path-26"></use>
                            <use id="Rectangle-Copy" stroke="#7B1708" mask="url(#mask-29)" stroke-width="2" fill="url(#linearGradient-5)" xlink:href="#path-28"></use>
                            <use id="Rectangle-Copy-2" stroke="#7B1708" mask="url(#mask-31)" stroke-width="2" fill="url(#linearGradient-5)" xlink:href="#path-30"></use>
                            <use id="Rectangle-Copy-3" stroke="#7B1708" mask="url(#mask-33)" stroke-width="2" fill="url(#linearGradient-5)" xlink:href="#path-32"></use>
                            <use id="Rectangle-Copy-5" stroke="#7B1708" mask="url(#mask-35)" stroke-width="2" fill="url(#linearGradient-5)" xlink:href="#path-34"></use>
                            <use id="Rectangle-Copy-6" stroke="#7B1708" mask="url(#mask-37)" stroke-width="2" fill="url(#linearGradient-5)" xlink:href="#path-36"></use>
                            <use id="Rectangle-Copy-7" stroke="#7B1708" mask="url(#mask-39)" stroke-width="2" fill="url(#linearGradient-5)" xlink:href="#path-38"></use>
                            <use id="Rectangle-Copy-8" stroke="#7B1708" mask="url(#mask-41)" stroke-width="2" fill="url(#linearGradient-5)" xlink:href="#path-40"></use>
                        </g>
                    </g>
                    <g id="Group-2" stroke="none" stroke-width="1" fill="none" fill-rule="evenodd" mask="url(#mask-4)">
                        <g transform="translate(25.641026, 17.168317)">
                            <g id="chaise" opacity="0.803725091" transform="translate(67.754579, 27.000000) scale(-1, 1) translate(-67.754579, -27.000000) translate(56.754579, 0.000000)">
                                <rect id="Rectangle-2" fill="#4E73BF" x="0" y="0" width="14.3402697" height="36.4265677" rx="7.17013483"></rect>
                                <rect id="Rectangle-2" fill="#3D5FA6" x="0" y="27.5057756" width="21.0622711" height="8.92079208" rx="4.46039604"></rect>
                                <rect id="Rectangle-2" fill="#3D5FA6" x="0" y="30.4793729" width="3.13693399" height="23.0453795" rx="1.56846699"></rect>
                                <rect id="Rectangle-2" fill="#3D5FA6" x="13.4440028" y="30.4793729" width="3.13693399" height="23.0453795" rx="1.56846699"></rect>
                            </g>
                            <g id="chaise">
                                <rect id="Rectangle-2" fill="#4E73BF" x="0" y="0" width="14.3402697" height="36.4265677" rx="7.17013483"></rect>
                                <rect id="Rectangle-2" fill="#3D5FA6" x="0" y="27.5057756" width="21.0622711" height="8.92079208" rx="4.46039604"></rect>
                                <rect id="Rectangle-2" fill="#3D5FA6" x="0" y="30.4793729" width="3.13693399" height="23.0453795" rx="1.56846699"></rect>
                                <rect id="Rectangle-2" fill="#3D5FA6" x="13.4440028" y="30.4793729" width="3.13693399" height="23.0453795" rx="1.56846699"></rect>
                            </g>
                            <g id="table" opacity="0.828691123" transform="translate(10.073260, 20.198020)">
                                <use id="Rectangle-4" stroke="#3E5FA2" mask="url(#mask-44)" stroke-width="2" fill="url(#linearGradient-42)" xlink:href="#path-43"></use>
                                <ellipse id="Oval-3" stroke="#687FAA" fill="#A7C5F6" cx="28.8461538" cy="6.15467962" rx="28.8461538" ry="4.21109658"></ellipse>
                                <ellipse id="Oval-3" stroke="#687FAA" fill="#D5E2F9" cx="28.8461538" cy="4.21109658" rx="28.8461538" ry="4.21109658"></ellipse>
                            </g>
                        </g>
                    </g>
                    <g id="chaise" stroke="none" stroke-width="1" fill="none" fill-rule="evenodd" mask="url(#mask-4)">
                        <g transform="translate(112.637363, 35.346535)" id="Rectangle-2">
                            <rect fill="#4E73BF" x="0" y="0" width="29.3040293" height="49.4851485" rx="8"></rect>
                            <rect fill="#3D5FA6" x="0" y="37.3663366" width="43.040293" height="12.1188119" rx="6.05940594"></rect>
                            <rect fill="#3D5FA6" x="0" y="41.4059406" width="6.41025641" height="31.3069307" rx="3.20512821"></rect>
                            <rect fill="#3D5FA6" x="27.4725275" y="41.4059406" width="6.41025641" height="31.3069307" rx="3.20512821"></rect>
                        </g>
                    </g>
                    <g id="table" stroke="none" stroke-width="1" fill="none" fill-rule="evenodd" mask="url(#mask-4)">
                        <g transform="translate(125.457875, 53.524752)">
                            <use id="Rectangle-4" stroke="#3E5FA2" mask="url(#mask-46)" stroke-width="2" fill="url(#linearGradient-42)" xlink:href="#path-45"></use>
                            <ellipse id="Oval-3" stroke="#687FAA" stroke-width="1" fill="#A7C5F6" cx="45.3296703" cy="9.59405941" rx="45.3296703" ry="6.56435644"></ellipse>
                            <ellipse id="Oval-3" stroke="#687FAA" stroke-width="1" fill="#D5E2F9" cx="45.3296703" cy="6.56435644" rx="45.3296703" ry="6.56435644"></ellipse>
                        </g>
                    </g>
                    <g id="haut" stroke="none" stroke-width="1" fill="none" fill-rule="evenodd" mask="url(#mask-4)">
                        <g transform="translate(-43.040293, -18.178218)">
                            <mask id="mask-49" fill="white">
                                <use xlink:href="#path-48"></use>
                            </mask>
                            <use id="Combined-Shape" stroke="none" fill="url(#radialGradient-47)" fill-rule="evenodd" xlink:href="#path-48"></use>
                            <rect id="table" stroke="none" fill="#45250B" fill-rule="evenodd" x="0" y="111.089109" width="328.754579" height="14.1386139"></rect>
                        </g>
                    </g>
                    <g id="assiette" stroke="none" stroke-width="1" fill="none" fill-rule="evenodd" mask="url(#mask-4)">
                        <g transform="translate(65.018315, 77.762376)" id="Oval-2" fill="#F2F0F0">
                            <ellipse stroke="#878585" cx="60.4395604" cy="12.1188119" rx="60.4395604" ry="12.1188119"></ellipse>
                            <ellipse stroke="#B6B3B3" cx="60.8974359" cy="12.1188119" rx="41.6666667" ry="7.06930693"></ellipse>
                        </g>
                    </g>
                </g>
            </g>
        </g>
    </g>
</svg>