0.749996 0.749996 0.749996 0.749996 0.73333 0.649997 0.283336 0.416668
0.458334 0.516666 0.250004 0.183338 0.216671 0.150005 0.0333402 0.0166738
;
0.633336 0.66667 0.66667 0.650003 0.283331 0.283331 0.283331 0.283331
0.283331 0.299998 0.66667 0.750004 0.816672 0.833338 0.850005 0.866672
;
0.850003 0.666662 0.366649 0.283312 0.283312 0.383317 0.499988 0.433319
0.699996 0.783333 0.816668 0.883337 0.766666 0.333314 0.199975 0.0833039
;
