3 @1 0 0.361905 4 @3 0 data/seq16x3.txt 1 16 @4 10 1 0.538462 0.24359
0.0666667 0.166667 0.0205128 0.538462 0.001 0 0.692308 0.333333 0.36
0 0.564103 6 @2 0 0.542553 0.446809 0.446809 0.606383 3 @5 500 0.261905
;
3 @1 0 0.778571 4 @3 0 data/seq16x3.txt 0 16 @4 10 0.717949 0.692308
0.371795 0.707692 0.141026 0.68718 0.794872 0.36 0.358974 0.692308
0.179487 0.821538 0.128205 0.0769231 6 @2 0 0.87234 0.234043 0.787234
0.670213 3 @5 2000 0.75;
