in-1 0 1 0 0 1 1 1 0.5;
in-2 0 1 0 0 1 1 1 0.5;
in-3 0 1 0 0 1 1 1 0.5;
in-4 0 1 0 0 1 1 1 0.5;
in-5 0 3 0 0.01 0.58 1 1 0.5;
in-6 0 3 0 0.01 0.58 1 1 0.5;
in-7 0 6 0 0 1 1 1 0.5;
in-8 0 2 0 0.1 1 1 1 0.5;
micro-1 0;
micro-2 0;
micro-3 0;
micro-4 0;
out-1 0.6 0.5;
out-2 0.6 0.5;
out-3 0.166667 0.5;
out-4 0.6 0.5;
out-5 0.6 0.5;
out-6 0.6 0.5;
out-7 0.6 0.5;
out-8 0.6 0.5;
out-9 0.6 0.5;
out-10 0.6 0.5;
