<?xml version="1.0" encoding="UTF-8" standalone="no"?>
<svg
   xmlns:dc="http://purl.org/dc/elements/1.1/"
   xmlns:cc="http://creativecommons.org/ns#"
   xmlns:rdf="http://www.w3.org/1999/02/22-rdf-syntax-ns#"
   xmlns:svg="http://www.w3.org/2000/svg"
   xmlns="http://www.w3.org/2000/svg"
   xml:space="preserve"
   style="enable-background:new -177 289.5 256 214.5;"
   viewBox="-177 289.5 256 214.5"
   y="0px"
   x="0px"
   id="svg1410"
   version="1.1"><metadata
     id="metadata32"><rdf:RDF><cc:Work
         rdf:about=""><dc:format>image/svg+xml</dc:format><dc:type
           rdf:resource="http://purl.org/dc/dcmitype/StillImage" /><dc:title></dc:title></cc:Work></rdf:RDF></metadata><defs
     id="defs30" /><g
     style="fill:#ffffff"
     id="g17"><path
       style="fill:#ffffff"
       id="path3"
       d="M-182.9,352.3h1.2v0.3l-0.6,0.5l-0.6-0.5V352.3z M-182.6,375.7l0.5,0.5v0.6l-0.5-0.6V375.7z M-180.1,368.1v0.3h0.6l0.9-0.3   v-0.3h-0.3L-180.1,368.1z M-178.7,372h0.9l0.5,0.6v0.5l-0.9,0.9c-0.7-0.3-1.1-0.6-1.1-0.9v-0.5L-178.7,372z M-176.1,359.6v0.3h1.1   v-0.3H-176.1z M-173.9,329h33.8l1.2,1.4v83l-1.2,1.4h-33.8l-1.2-1.4v-83L-173.9,329z M-173,375.1l-0.3,0.9h0.5v-0.9H-173z    M-169.9,393.6l1.1,1.1v0.3l-1.7-1.1l0.3-0.3H-169.9z M-170.2,344.8v54.1h15.5c5.8,0,9.4-4,10.9-12l0.6-2.9c0-5.3-1.9-9.7-5.8-13.2   v-1.2c2.4,0,3.9-3.4,4.6-10.3c-1-9.6-5.4-14.4-13.2-14.4H-170.2z M-162,396.9h0.6c0,0.4-0.3,0.6-0.9,0.6l-0.3,0.9   c0.5,0,0.8,0.3,0.8,0.8h0.3c0-0.9,0.2-1.4,0.5-1.4l-0.5-1.4L-162,396.9z M-160.5,352.8h2.3c3.6,0,5.5,2.5,5.7,7.5   c-0.7,4.2-2.7,6.4-5.7,6.4h-2.3l-1.1-1.2V354L-160.5,352.8z M-160.5,374.1h1.7c4.6,0,6.9,2.9,6.9,8.6c0,5.3-2.1,8-6.3,8h-2.3   l-1.1-1.1v-14.4L-160.5,374.1z M-160.3,393.6l-0.3,1.1h0.5v-1.1H-160.3z M-160.3,399.7v0.5l22.9,0.3l0.3-0.3V400l-0.3-0.3H-160.3z    M-155.5,399.7c0,0.9,7,1.4,21,1.4l-2.3-0.9v0.6c0.7,0-3.2,1.4-11.9,4.2h0.3v-0.9c-2.8-0.8-4.3-1.4-4.3-2l-0.8,0.3v-1.1h-0.3   c0,0.6-0.2,0.9-0.5,0.9c0-0.7-0.3-1.1-0.9-1.1v-1.4H-155.5z M-155.3,351.7v0.9h0.5v-0.9H-155.3z M-153.8,396.9v0.9h0.6v-0.9H-153.8   z M-151.8,400.9l-0.5,1.1h1.1l0.5-0.6L-151.8,400.9z M-151.1,357.7v0.3h1.1v-0.6h-0.3L-151.1,357.7z M-150.2,358.2l-0.3,0.9   l1.2,0.3l0.3-0.3v-0.3l-0.9-0.6H-150.2z M-150.4,385.6v0.3h0.3c0-0.6,0.3-0.9,0.9-0.9l0.3-1.1   C-149.7,384.2-150.2,384.8-150.4,385.6z M-149.9,356.8v0.3c0.7,0,1.1,0.4,1.1,1.1h0.9l-0.3-2.5c-0.7,0-1.1,0.4-1.1,1.1H-149.9z    M-148.5,359.3l0.6,0.6l0.3-0.3v-0.3H-148.5z M-148.1,357.1l-0.3,0.9h0.3l0.5-0.6l-0.3-0.3H-148.1z M-148.1,404.8   c0,0.4,0.7,0.8,2.2,1.1v-0.6L-148.1,404.8z M-147.4,363.6l-0.3,0.3v0.3h0.9L-147.4,363.6z M-147.4,356.2v0.3l0.9-0.3v-0.5h-0.3   L-147.4,356.2z M-147.4,358.5v0.9l1.4-0.3v-0.3L-147.4,358.5z M-145.3,406.2v0.3l1.4,0.3c0-0.4-0.3-0.6-0.9-0.6H-145.3z    M-143.9,402.3l-0.3,0.3v0.6h0.9v-0.3L-143.9,402.3z M-143.3,407.3v0.3l1.1,0.5h0.3c0-0.5-0.4-0.7-1.1-0.9H-143.3z M-135.7,397.2   l0.6,1.7l-0.9,0.9h1.1l0.3-1.4c-0.4,0-0.6-0.5-0.6-1.4l-0.3,0.3H-135.7z" /><path
       style="fill:#ffffff"
       id="path5"
       d="M-154.8,361.6h1.2v0.9l-1.1,0L-154.8,361.6z M-153.3,406.7l0.8-0.9l-0.8-0.9h-0.4l0,1.8H-153.3z M-149.6,349v-0.5h0.7   l0.4,1.4h-0.4L-149.6,349z M-148,353c-1,0-1.5-0.6-1.5-1.8l3.4-0.5v1.4c-1,0-1.5,0.6-1.5,1.8h-0.4V353z M-147.7,350.6l0.3-0.5   l0.8,0.9v0.4l-1.1-0.4V350.6z M-147.3,354.4v-0.5h0.8v1.8l-0.4,0L-147.3,354.4z M-146.1,353.9l0.7-1.4h0.4l0.3,0.4l-0.3,1.8   l-1.1-0.5V353.9z M-145.4,347.6l0.4,0l0.4,2.3h-1.2L-145.4,347.6z M-144.7,350.3h0.4l0.3,0.5l-0.7,0.9V350.3z M-143.9,394h0.4v1.8   h-0.4V394z M-139.2,331.1v82.1l1.2,1.2h40.7l1.2-1.2v-18.8c-4.1-3.8-6.1-8.5-6.1-14c4.1-0.3,6.1-0.9,6.1-1.8v-12.8   c-3.7-4-5.5-7.7-5.5-11v-4.3c0-3.2,1.8-6.7,5.5-10.3v-9.1l-1.2-1.2H-138L-139.2,331.1z M-138.3,348.8v1.4h-0.3l-0.4-0.4   L-138.3,348.8z M-119.1,344.7c7.3,0,10.9,4.4,10.9,13.2v8c0,3.4-1.3,6.2-4,8.6c0,2.1,1.9,10.2,5.7,24.1h-8.6   c-3.1-13.8-5.2-20.6-6.3-20.6h-2.9l-1.2,1.2v19.5h-8v-53.9H-119.1z M-132.9,400.2v-0.5h0.3l0.4,1.4l0,0.9h-0.4L-132.9,400.2z    M-131,396.7h1.1v0.5l-1.1-0.3V396.7z M-130.9,406.9l0.3,0.3l1.1-1.7h-0.3l-1.1,1.1V406.9z M-128.2,398.1l1.4-0.6   c0,0.4,0.5,0.5,1.4,0.5v0.3c-0.6,0-0.9,0.3-0.9,0.9l-0.9-0.3c0-0.6-0.2-0.9-0.6-0.9l0,0.6L-128.2,398.1z M-127.6,372.1l-0.3-0.3   c0.9,0,1.4-0.2,1.4-0.6l1.4,0.3v1.1l-0.9-0.8l-1.7,0.6V372.1z M-127.7,389.9h0.9v0.6h-0.9V389.9z M-126.5,400.5h0.7   c0.4,0,0.8-0.6,1.1-1.8l-1.1-1.4h-0.8l-0.7,0.9v1.3L-126.5,400.5z M-125.5,353.9v14.9l1.2,1.2h2.9c3.4,0,5.2-3.3,5.2-9.8   c0-5-1.5-7.4-4.6-7.4h-3.4L-125.5,353.9z M-125,374l0.3-0.3h0.3l0.3,0.3l-0.1,22.9h-0.5L-125,374z M-124.8,391.9l1.4,0   c0-0.6,0.4-0.9,1.1-0.9c0-0.4-0.3-0.5-0.9-0.5v-0.3h1.1l-0.3-0.9c0.5,0,1.2-1.4,1.9-4.2h0.9v0.3c-2.9-8.7-4.3-12.6-4.3-11.9h-0.5   l0.8-2.2c0.1,14-0.3,21-1.2,21V391.9z M-123.2,387.4l0.6,0.5v1.1l-1.1-0.5L-123.2,387.4z M-123.5,367.8l1.5,0.4   c0,0.9,0.4,1.3,1.2,1.3v0.5h-0.4C-122.2,369.6-123,368.8-123.5,367.8z M-123.2,390.1h1.2v0.9l-1.2-0.4V390.1z M-121.8,380h0.3v0.9   h-0.5l-0.3-0.3L-121.8,380z M-121.5,405.9l0.7-0.9h-0.8l-0.7,0.9H-121.5z M-119.3,382.5h0.5c-0.3,1.5-0.7,2.2-1.1,2.2L-119.3,382.5   z M-118.5,381.4c0-0.6,0.2-0.9,0.6-0.9l-0.3,1.4h-0.3L-118.5,381.4z M-117.4,379.7c0.1-0.8,0.4-1.2,0.9-1.2v0.3l-0.5,1.1h-0.3   V379.7z" /><path
       style="fill:#ffffff"
       id="path7"
       d="M-98.5,349.1l-0.7,0.4c0-1.2-0.4-1.9-1.3-1.9l0.7-1.8h2.7l-2,1.1l1.3,2.2L-98.5,349.1z M-51.4,346.4l0-1.9   c-1.3,0-2-0.5-2-1.5c-0.9,0-1.3,0.4-1.4,1.1l-0.7,0l0-1.5l-2,0.3c0-0.7-3.3-1.7-10-2.7v-1.1h0.7c-20.8,3.4-30.2,5.2-28.4,5.2l0,0.7   l-5.3-1.2c33.2,0.5,49.8,1.3,49.8,2.6L-51.4,346.4z M-60.9,413.9l1.1-82.8l-1.2-1.4l-35.4-0.5l-1.3,1.4l-1.1,82.8l1.2,1.4l35.5,0.5   L-60.9,413.9z M-93.8,345.9l-0.7-0.4v-0.4l0.7-0.3l54.5,1.1v0.8L-93.8,345.9z M-84.5,344.1V386c0.3,3.1,1.8,4.7,4.5,4.7   c3.3,0,5.2-1.8,5.8-5.3v-41.3h9v39.6c-0.8,10.1-5.3,15.1-13.5,15.1H-80c-9-1.7-13.5-5.4-13.5-11.1v-43.6H-84.5z M-91.8,381.5   l0.3-1.1c0.6,0,0.9-0.3,0.9-0.9h0.3v0.3C-90.6,380.5-91.1,381.1-91.8,381.5z M-88.9,399.2v-0.3l1.4-0.2l0,0.8L-88.9,399.2z    M-88,402.3l-0.3,0v-0.5l0.9-0.3v0.3L-88,402.3z M-87.9,393.9h0.9v0.3l-0.3,0.3L-87.9,393.9z M-87,401l-0.3-0.3l0.6-0.5h0.3   l-0.3,0.9H-87z M-87.1,398.7v-0.3l0.3-0.3l0.6,0.6H-87.1z M-85.5,401.2c0,0.7-0.4,1.1-1.2,1.1l-0.2-2.6l0.9,0   c0,0.7,0.3,1.1,1.1,1.1v0.3L-85.5,401.2z M-84.9,399.8l-0.9-0.6V399l0.3-0.3l1.1,0.3l-0.3,0.8H-84.9z M-84.6,400.7h-0.3l0-0.6   l1.1,0v0.3L-84.6,400.7z M-80.1,336c-1.8-0.1-2.7-0.5-2.7-1.1h0.7l2.7,0.8v0.4L-80.1,336z M-80.2,406.4l0-0.9l0.5,0v0.8H-80.2z    M-79.4,342v-0.3h2l0,0.7l-0.7,0.4L-79.4,342z M-76,337.6c-1.3,0-2-0.3-2-0.8l3.3,0.4v0.4L-76,337.6z M-73.4,338.7V338   c3.6,0.5,5.3,1,5.3,1.5L-73.4,338.7z M-70.5,372.1l0.3-0.3l-1.7-1.2l0,0.3l1.1,1.2H-70.5z M-62.1,344.1l1.4-0.7l2.7,0l-1.4,1.5   L-62.1,344.1z M-61.9,383.3l0-0.9h0.5l-0.3,0.9H-61.9z M-59.8,398.8v-0.3h1.2l0,0.3H-59.8z M-58.3,389.5l-0.5-0.6v0.6l0.5,0.5   V389.5z M-55.4,385.9v-0.6c0-0.3-0.4-0.6-1.1-0.9l-0.9,0.8v0.6l0.5,0.6h0.9L-55.4,385.9z M-56.1,350.1V349h1.4l0,1.1H-56.1z    M-55.7,390.6H-56v-0.3l0.9-0.3h0.5v0.3L-55.7,390.6z M-52,405.9l-0.6-0.5l-0.5,0.5l0,0.3l1.2,0V405.9z M-40.1,354.7v-1.5l1.4,0   l-0.7,1.5L-40.1,354.7z M-36.7,351.1l-1.3-1.9c0.9,0,1.3-0.6,1.4-1.8h0.7c0,0.7,0.7,1.1,2,1.2l-0.7,1.1c-1.3,0-2,0.2-2,0.7h1.3   L-36.7,351.1z" /><path
       style="fill:#ffffff"
       id="path9"
       d="M-62.6,347l-0.3,0.3c0-1-0.2-1.4-0.5-1.4l0.3-1.4l1.1,0l-0.9,0.8l0.5,1.7H-62.6z M-42.7,345.3l0-1.4   c-0.6,0-0.8-0.4-0.8-1.2c-0.4,0-0.6,0.2-0.6,0.8h-0.3l0-1.2l-0.9,0.3c0-0.6-1.4-1.3-4.1-2.1l0-0.9h0.3c-8.8,2.5-12.8,3.7-12.1,3.8   l0,0.5l-2.2-0.9c13.9,0.6,20.9,1.3,20.9,2.2H-42.7z M-27.2,401.8L-61,402c-0.4,0-0.7,0.9-0.9,2.8h0.2l0.2,0.2v0.2l-0.2,0.2v4.3   l0.2,2.2h1.3l1.5,0.2l0.2-0.2l0.2,0.2h0.7l0.2-0.2v0.2l1.3-0.2l1.3,0.2l-0.2-1.5l0-0.4c2-0.6,3-1.8,3-3.7l0.7,0.4l-0.2,0.9   c0,2,0.3,3.1,0.9,3.1v0.2l-0.2,0.2v0.2h0.2l1.7-0.4l1.3,0.4h0.4l0.2-0.2l-0.4-0.4l0.2-1.5l-0.2-1.3l0.2-1v-0.2l-0.2-0.2h0.2   l0.2-0.2l-0.2-1.5v-0.2l10.6,0.6v0.2h-0.7l-0.9-0.2l-0.9,0.2l-1.7,0l-0.2,0.2v-0.2l-0.2-0.2l-0.6,0.2l-1.5-0.2   c-1.7,0.2-2.6,0.4-2.6,0.7v2.6l0.2,0.2l-0.2,0.2v0.6l0.2,2.2c1.8,0.3,3.3,0.8,4.3,1.3h0.4c0.3,0,0.6-0.4,0.7-1.1h0.2l1.1,0.2   l0.2-0.2l0.2,0.7l1.1-0.2h0.7l0.4,0.4h0.2l0.2-0.2h0.4c0,0.6,0.1,0.9,0.4,0.9h0.2l0.4-0.5l0.4,0.5c1.3-0.5,1.9-0.9,1.9-1.1l1.7,0.2   l0.9-0.2l0.9,0.2h1l0.7-0.6l0-6.3c0-0.3-0.7-0.5-2.2-0.6l-0.2,0.2l-9.5-1l-0.2,0.2l-5.4-0.4l0-0.2l1.3-0.2h0.2l0.2,0.2l1.3-0.2h3.7   l0.9,0.2l0.9-0.2l5,0l2.6-0.2l0.7,0.2h0.2l0.2-0.2v0.2l0.4-0.5v-0.6L-27.2,401.8z M-60.9,329.9v70.2l1,1.1h30.1l1-1.1v-19.6l-1-6   v-39.7l1-1.6v-3.3l-1-1.1h-30.1L-60.9,329.9z M-60.6,344.5l-0.3-0.3l0-0.3l0.3-0.2l22.9,1.2v0.5L-60.6,344.5z M-32.9,344.9v8h-7.4   l-1.2,1.2v44.6h-8V354l-1.2-1.2H-58v-8H-32.9z M-54.5,337.2c-0.7-0.1-1.1-0.4-1.1-0.9h0.3l1.1,0.6v0.3H-54.5z M-54.5,341.7l0-0.3   l0.8,0v0.6l-0.3,0.3L-54.5,341.7z M-52.9,338.4c-0.6,0-0.8-0.2-0.8-0.6l1.4,0.3v0.3H-52.9z M-53.6,385.8v-0.3l1.4-0.2l0,0.9   L-53.6,385.8z M-52.9,389l-0.3,0l0-0.5l0.9-0.2v0.3L-52.9,389z M-52.6,380.5h0.9v0.3l-0.3,0.3L-52.6,380.5z M-51.8,387.6l-0.3-0.3   l0.6-0.5h0.3l-0.3,0.9L-51.8,387.6z M-51.9,385.3v-0.3l0.3-0.3l0.5,0.6L-51.9,385.3z M-51.8,339.3l0-0.6c1.5,0.4,2.2,0.8,2.2,1.2   L-51.8,339.3z M-50.3,387.9c0,0.7-0.4,1.1-1.2,1.1l-0.2-2.6l0.9,0c0,0.7,0.3,1.1,1.1,1.2v0.3L-50.3,387.9z M-49.7,386.6l-0.8-0.6   v-0.3l0.3-0.3l1.1,0.3l-0.3,0.9H-49.7z M-49.4,387.4l-0.3,0l0-0.5l1.1,0v0.3L-49.4,387.4z M-49.6,360.9l0.3-1.1   c0.6,0,0.9-0.2,0.9-0.8h0.3l0,0.3C-48.4,360-48.9,360.6-49.6,360.9z M-47.2,343.4l0.6-0.5l1.1,0l-0.6,1.1L-47.2,343.4z    M-45.2,393.3l0-0.9l0.6,0l0,0.8H-45.2z M-44.8,348l0-0.9h0.5l0,0.9H-44.8z M-38.2,351.6l0-1.1l0.6,0l-0.3,1.1H-38.2z M-36.7,348.9   l-0.5-1.4c0.4,0,0.6-0.5,0.6-1.4h0.3c0,0.6,0.2,0.9,0.8,0.9l-0.3,0.9c-0.6,0-0.9,0.1-0.9,0.5l0.5,0L-36.7,348.9z M-33.1,405.4   l-2.4,0.2v-0.2l-0.2-0.2l0.9-0.2l1.7,0.2V405.4z M-28.1,352.1l0.3-0.3l-1.6-1.2v0.3l1,1.2L-28.1,352.1z M-26.2,370.6l0-0.9l0.6,0   l-0.3,0.8H-26.2z M-24.6,386.2l0-0.3l1.1,0l0,0.3L-24.6,386.2z M-19.8,373.4l0-0.5c0-0.3-0.4-0.6-1.1-0.9l-0.9,0.8l0,0.5l0.5,0.6   l0.9,0L-19.8,373.4z M-20.3,378.2l-0.3,0l0-0.3l0.9-0.2h0.5v0.3L-20.3,378.2z M-16.9,393.6l-0.5-0.6l-0.6,0.5v0.3l1.1,0   L-16.9,393.6z M-16.3,369.9l-0.5-0.6v0.6l0.5,0.6V369.9z" /><path
       style="fill:#ffffff"
       id="path11"
       d="M-35.5,352.3h1.2v0.3l-0.6,0.5l-0.6-0.5V352.3z M-35.2,375.7l0.5,0.5v0.6l-0.5-0.6V375.7z M-32.7,368.1v0.3h0.6l0.9-0.3   v-0.3h-0.3L-32.7,368.1z M-31.3,372h0.9l0.5,0.6v0.5l-0.9,0.9c-0.7-0.3-1.1-0.6-1.1-0.9v-0.5L-31.3,372z M-28.7,359.6v0.3h1.1v-0.3   H-28.7z M-26.5,329H7.3l1.2,1.4v83l-1.2,1.4h-33.8l-1.2-1.4v-83L-26.5,329z M-25.6,375.1l-0.3,0.9h0.5v-0.9H-25.6z M-22.5,393.6   l1.1,1.1v0.3l-1.7-1.1l0.3-0.3H-22.5z M-22.8,344.8v54.1h15.5c5.8,0,9.4-4,10.9-12l0.6-2.9c0-5.3-1.9-9.7-5.8-13.2v-1.2   c2.4,0,3.9-3.4,4.6-10.3c-1-9.6-5.4-14.4-13.2-14.4H-22.8z M-14.6,396.9h0.6c0,0.4-0.3,0.6-0.9,0.6l-0.3,0.9c0.5,0,0.8,0.3,0.8,0.8   h0.3c0-0.9,0.2-1.4,0.5-1.4l-0.5-1.4L-14.6,396.9z M-13.1,352.8h2.3c3.6,0,5.5,2.5,5.7,7.5c-0.7,4.2-2.7,6.4-5.7,6.4h-2.3l-1.1-1.2   V354L-13.1,352.8z M-13.1,374.1h1.7c4.6,0,6.9,2.9,6.9,8.6c0,5.3-2.1,8-6.3,8h-2.3l-1.1-1.1v-14.4L-13.1,374.1z M-12.9,393.6   l-0.3,1.1h0.5v-1.1H-12.9z M-12.9,399.7v0.5l22.9,0.3l0.3-0.3V400l-0.3-0.3H-12.9z M-8.1,399.7c0,0.9,7,1.4,21,1.4l-2.3-0.9v0.6   c0.7,0-3.2,1.4-11.9,4.2H-1v-0.9c-2.8-0.8-4.3-1.4-4.3-2l-0.8,0.3v-1.1h-0.3c0,0.6-0.2,0.9-0.5,0.9c0-0.7-0.3-1.1-0.9-1.1v-1.4   H-8.1z M-7.9,351.7v0.9h0.5v-0.9H-7.9z M-6.4,396.9v0.9h0.6v-0.9H-6.4z M-4.4,400.9L-5,402h1.1l0.5-0.6L-4.4,400.9z M-3.6,357.7   v0.3h1.1v-0.6h-0.3L-3.6,357.7z M-2.8,358.2l-0.3,0.9l1.2,0.3l0.3-0.3v-0.3l-0.9-0.6H-2.8z M-3,385.6v0.3h0.3   c0-0.6,0.3-0.9,0.9-0.9l0.3-1.1C-2.3,384.2-2.8,384.8-3,385.6z M-2.5,356.8v0.3c0.7,0,1.1,0.4,1.1,1.1h0.9l-0.3-2.5   c-0.7,0-1.1,0.4-1.1,1.1H-2.5z M-1.1,359.3l0.6,0.6l0.3-0.3v-0.3H-1.1z M-0.7,357.1l-0.3,0.9h0.3l0.5-0.6l-0.3-0.3H-0.7z    M-0.7,404.8c0,0.4,0.7,0.8,2.2,1.1v-0.6L-0.7,404.8z M0,363.6l-0.3,0.3v0.3h0.9L0,363.6z M0,356.2v0.3l0.9-0.3v-0.5H0.6L0,356.2z    M0,358.5v0.9l1.4-0.3v-0.3L0,358.5z M2.1,406.2v0.3l1.4,0.3c0-0.4-0.3-0.6-0.9-0.6H2.1z M3.5,402.3l-0.3,0.3v0.6h0.9v-0.3   L3.5,402.3z M4.1,407.3v0.3l1.1,0.5h0.3c0-0.5-0.4-0.7-1.1-0.9H4.1z M11.7,397.2l0.6,1.7l-0.9,0.9h1.1l0.3-1.4   c-0.4,0-0.6-0.5-0.6-1.4l-0.3,0.3H11.7z" /><path
       style="fill:#ffffff"
       id="path13"
       d="M6.3,338.4c2.1,0.7,3.2,1.4,3.2,1.9v1.3H7.9v0.6c0,0.4,0.3,0.7,1,0.7v0.7H7.3v0.6l0.3,0.3c-0.9,0.2-1.3,0.9-1.3,1.9H6   l-2.6-3.6C4.9,339.9,5.9,338.4,6.3,338.4z M5.6,341.6v0.6h1l0.7-0.6L6.6,341H6.3L5.6,341.6z M42.3,329.3h-1.7l-4.6,0.3l-0.9-0.3   h-0.3l-0.3,0.3l-2.6-0.3h-1.4l-0.3,0.3l-0.3-0.3h-2.6l-4.1,0.3l-3.8-0.3l-2.6,0.3l-1.1-0.3l-0.9,0.3l-1.2-0.3h-1.2l-1.4,0.3   l-0.3-0.3l-1.1,0.3H6.8l-0.6,0.6v23.2l0.3,1.3l-0.3,1.3v57.4l0.6,0.7h36.7l0.6-0.7v-54.8h-0.6v-1H44v-1l-1.5-3.9   c0.1-1.4,0.6-2.6,1.5-3.5v-20l-0.3-0.3L42.3,329.3z M22.1,333.9v0.7l-1.9,2.6h-0.3l-0.3-0.3h-4.2c-1.5,0-2.3-0.3-2.3-1h-0.6l-1,0.6   h-0.7c-3-0.4-4.5-0.9-4.5-1.6l2.6-0.3l1.6,1h1.9v-1.3l4.5,1l0.3-0.3c0-0.4-0.8-0.7-2.3-0.7v-0.3H22.1z M10.1,347.6l1.6,0.3v0.3   l-0.3,0.3v0.6c2.3,1.8,3.5,3.8,3.5,6.1c-1,0-1.8,1-2.2,2.9l-2.2-0.3H8.9v1l1.9,1c0.6,0,1-0.2,1-0.7h0.3l0.3,0.3   c0,0.4-0.6,0.7-1.9,1l-1.9-0.7l0.3,2.2c0.9,0.1,1.3,0.4,1.3,1l0.3,0.3v0.3l-0.3,0.3l0.7,0.7l2.6-1.9v-0.3l-0.3-0.3l1-1l-0.3,2.3v1   l-2.2,1.3L9.5,365c-1.1-2.6-2.1-6-2.9-10.3l0.7-2.6l-0.3-1.9v-0.6l3.2-1.6V347.6z M7.3,353.1c0.2,0.6,0.8,1,1.9,1l0.7-0.7l-0.7-0.9   L7.3,353.1z M9.8,356l-0.3,0.3l0.6,0.7h0.7l0.3-0.3l-0.6-0.7H9.8z M10.8,353.7v0.3l0.3,0.3l1-0.3l1.3,0.3h0.3L14,354   c0-0.6-0.7-1-2.2-1.3L10.8,353.7z M17.3,337.4v0.3l0.3,0.3h-0.3c-1.5,1.5-2.7,2.2-3.6,2.2h-0.3v-0.6l-1.9-0.7l0.6-0.7h1l0.3,1   L15,339h1v-0.7l-0.3-0.3L17.3,337.4z M13.4,341.3l-0.7,1.9l-1.3-0.3v-0.3l0.6-1.6L13.4,341.3z M26.1,349.4   c7.1,0,11.1,4.6,12.1,13.9v26.6c-1,9.2-5,13.9-12.1,13.9c-8.9-0.9-13.3-4.7-13.3-11.5V361C12.7,354.2,17.2,350.3,26.1,349.4z    M16.3,331.9v0.3h-1.6v-0.3H16.3z M17.6,345.7l1.6,0.6v0.7l-1,1c-1.6,0-2.5-0.4-2.6-1.3C16.3,346,16.9,345.7,17.6,345.7z    M18.2,331.9h7.1c0,0.3-0.9,0.7-2.6,1.3l-1.9-0.3h-2.9l-0.3-0.3L18.2,331.9z M20.2,337.7l-0.3,1v0.3l0.3,0.3v0.7   c-1-1.3-1.7-1.9-2.3-1.9v-0.3H20.2z M20.8,362.1v28.9c0.3,3.1,1.6,4.6,4.1,4.6c3,0,4.7-1.7,5.2-5.2v-27.8c-0.6-3.5-2.1-5.2-4.6-5.2   C22.4,357.5,20.8,359.1,20.8,362.1z M21.8,339.3h0.3l-0.3,1.6h-0.6v-1L21.8,339.3z M24,339.7h1c1.4,0,2.5,1.1,3.3,3.2l-1.3,1.6   l0.7,0.6l-1.3,1.3h-1c-0.5,0-0.9-0.8-1.3-2.3l-0.9,0.7h-0.7c-0.6-0.1-1-1-1-2.6v-0.6h0.3l0.3,0.3c0,0.6,0.2,1,0.6,1h1.9v-1h-1   l-0.3,0.3v-0.3l-0.3-0.3v-1L24,339.7z M27.3,334.8l1,0.3h0.6l1-0.3l1,1.9c0,0.4-0.5,0.6-1.6,0.6h-1.6l-0.7-0.6l-1.6,0.3h-0.7v-0.3   c1.6-0.6,2.5-1.1,2.6-1.6V334.8z M28.5,338.4l0.7,0.7h-0.3l-0.6-0.7H28.5z M33.1,340.3h1l1,1l-0.7,1v0.3l0.3,0.3l1-0.3l1,0.3   l-1.3,1.9h-1.9l-1.6-1.9v-0.7h0.3l1.6,0.3l0.3-0.3c0-0.4-0.6-0.6-1.9-0.6v-0.3L33.1,340.3z M37.3,348.2h1.3v0.3   c1.5,0.9,2.2,2.3,2.2,4.5l-0.3,2.2h-0.3l-1.3-2.6h1v-0.7l-0.3-0.3l-1.6,0.3l-2.6-0.6C35.3,349.8,36,348.7,37.3,348.2z M40.1,356.2   v0.4c-0.4,0-0.7,0.1-0.7,0.4c0.4,0.5,0.9,0.7,1.3,0.7v0.2l-0.7,0.2l-0.9-0.5V357l0.4-0.8H40.1z M42,359.4h0.6   c0.9,0.4,1.3,1,1.3,1.7v0.2l-1.1-0.2h-0.4l-0.2,0.2c0,0.2,0.7,0.4,2.2,0.7v0.2c0,2.1-0.9,3.1-2.6,3.1c-0.9,0-1.6-1-2.1-2.9h0.2   c0-0.6,0.2-1,0.6-1h0.2l0.2,0.2l0.4-0.3v-0.2l-0.2-0.2l-1.1,0.4C40.3,360.1,40.9,359.4,42,359.4z M40.5,355.4   c0.7,0.2,1.1,0.3,1.1,0.6v0.4h-1.1v-0.2l0.2-0.2v-0.4h-0.4v-0.2H40.5z M41.8,362.9l-0.2,0.2l0.4,0.4h0.2l0.4-0.4v-0.2H41.8z    M45.8,355l-0.2,0.2v0.2l0.2,0.2h0.2l0.2-0.2v-0.2l-0.2-0.2H45.8z" /><path
       style="fill:#ffffff"
       id="path15"
       d="M44,329h34.1l0.9,1.2v9.4l-0.9,1.3h-2.9l3.8,16.4v55.4l-0.9,1.3H44l-0.9-1.3v-82.5L44,329z M44.8,345.6l9.9,26.1l-9.9,26.1   h7.7l5.5-16.7h1.1l5.5,16.7H73v-0.5l-10-25.6l10-26.1h-7.7c-0.5,0-2.5,5-6.1,15h-0.5c-3-9.2-5.1-14.2-6.1-15H44.8z" /></g><g
     transform="translate(-371.06084,-34.266675)"
     id="layer1"><g
       style="fill:#ffffff"
       transform="matrix(4.1296317,0,0,4.1296317,-1615.7504,-223.12088)"
       id="g25"><g
         style="fill:#ffffff"
         id="g27"><path
           style="fill:#ffffff"
           d="M476.1,169.7l0,8.3l-6.1,3.6l0-8.3L476.1,169.7"
           id="path29" /></g></g><g
       transform="matrix(4.1296317,0,0,4.1296317,-1615.7504,-223.12088)"
       id="g31"><g
         id="g33"><path
           style="fill:#ffffff"
           d="M462.2,169.7l6.2,3.6l0,8.3l-6.2-3.6L462.2,169.7"
           id="path35" /></g></g><g
       style="fill:#ffffff"
       transform="matrix(4.1296317,0,0,4.1296317,-1615.7504,-223.12088)"
       id="g37"><g
         style="fill:#ffffff"
         id="g39"><path
           style="fill:#ffffff"
           d="M469.1,164.9l6.2,3.6l-6.1,3.6l-6.2-3.6L469.1,164.9"
           id="path41" /></g></g></g></svg>