<?xml version="1.0" encoding="UTF-8" standalone="no"?>
<!-- Generator: Adobe Illustrator 16.0.0, SVG Export Plug-In . SVG Version: 6.00 Build 0)  -->

<svg
   xmlns:dc="http://purl.org/dc/elements/1.1/"
   xmlns:cc="http://creativecommons.org/ns#"
   xmlns:rdf="http://www.w3.org/1999/02/22-rdf-syntax-ns#"
   xmlns:svg="http://www.w3.org/2000/svg"
   xmlns="http://www.w3.org/2000/svg"
   xmlns:sodipodi="http://sodipodi.sourceforge.net/DTD/sodipodi-0.dtd"
   xmlns:inkscape="http://www.inkscape.org/namespaces/inkscape"
   version="1.1"
   id="Layer_1"
   x="0px"
   y="0px"
   width="107.35686"
   height="124"
   viewBox="0 0 107.35686 124"
   enable-background="new 0 0 40 40"
   xml:space="preserve"
   sodipodi:docname="malinette-logo.svg"
   inkscape:version="0.92.3 (2405546, 2018-03-11)"
   inkscape:export-filename="/media/data/code/malinette/malinette-ide/preferences/malinette-logo.png"
   inkscape:export-xdpi="90"
   inkscape:export-ydpi="90"><metadata
   id="metadata19"><rdf:RDF><cc:Work
       rdf:about=""><dc:format>image/svg+xml</dc:format><dc:type
         rdf:resource="http://purl.org/dc/dcmitype/StillImage" /><dc:title></dc:title></cc:Work></rdf:RDF></metadata><defs
   id="defs17">
	
	
	
</defs><sodipodi:namedview
   pagecolor="#ffffff"
   bordercolor="#666666"
   borderopacity="1"
   objecttolerance="10"
   gridtolerance="10"
   guidetolerance="10"
   inkscape:pageopacity="0"
   inkscape:pageshadow="2"
   inkscape:window-width="1366"
   inkscape:window-height="719"
   id="namedview15"
   showgrid="false"
   inkscape:zoom="1.2559247"
   inkscape:cx="-66.190037"
   inkscape:cy="45.762997"
   inkscape:window-x="0"
   inkscape:window-y="25"
   inkscape:window-maximized="1"
   inkscape:current-layer="Layer_1"
   fit-margin-top="0"
   fit-margin-left="0"
   fit-margin-right="0"
   fit-margin-bottom="0"
   inkscape:showpageshadow="false" />
<g
   id="g4"
   style="fill:#000000"
   transform="matrix(3.1798133,0,0,3.1798133,-9.9178377,-1.5962663)">
	<polygon
   points="20.011,0.517 20.011,0.502 19.998,0.51 16.622,2.459 13.253,4.404 13.247,4.408 9.884,6.349 9.871,6.357 6.515,8.294 6.495,8.306 3.146,10.239 3.119,10.255 3.146,10.271 3.146,14.137 3.119,14.153 3.146,14.168 3.146,18.035 3.119,18.051 3.146,18.066 3.146,21.934 3.119,21.949 3.146,21.965 3.146,25.832 3.119,25.848 3.146,25.863 3.146,29.729 3.119,29.744 3.146,29.76 6.495,31.693 6.515,31.705 9.871,33.643 9.884,33.65 13.247,35.592 13.253,35.596 16.622,37.541 19.998,39.49 20.011,39.498 20.011,39.482 23.373,37.541 23.385,37.547 23.385,37.535 26.75,35.592 26.758,35.598 26.758,35.586 30.125,33.643 30.133,33.648 30.133,33.639 33.502,31.693 33.508,31.697 33.508,31.691 36.877,29.744 36.881,29.748 36.881,29.742 36.881,25.85 36.881,25.844 36.881,21.951 36.881,21.946 36.881,18.053 36.881,18.048 36.881,14.155 36.881,14.15 36.881,10.257 36.881,10.252 36.877,10.255 33.508,8.31 33.508,8.302 33.502,8.306 30.133,6.361 30.133,6.353 30.125,6.357 26.758,4.413 26.758,4.402 26.75,4.408 23.385,2.465 23.385,2.453 23.373,2.459 "
   id="polygon2"
   style="fill:#000000" />
</g>
<polygon
   style="opacity:0.07099998;fill:#000000;stroke:none;stroke-width:1;stroke-miterlimit:4;stroke-dasharray:none;stroke-opacity:1"
   id="polygon6"
   points="6.509,27.779 6.509,27.803 9.865,29.738 9.878,29.732 9.878,29.748 13.242,31.688 13.248,31.684 13.248,31.691 16.617,33.637 19.993,35.586 20.005,35.578 23.369,33.637 23.379,33.631 26.744,31.688 26.754,31.684 30.121,29.738 30.129,29.734 33.496,27.791 30.129,25.846 30.121,25.842 26.754,23.897 26.744,23.892 23.379,21.949 23.369,21.943 20.005,20.001 19.993,19.994 16.617,21.943 13.248,23.888 13.248,23.896 13.242,23.892 9.878,25.834 9.878,25.85 9.865,25.842 "
   transform="matrix(3.1798133,0,0,3.1798133,-9.9178377,-1.5962663)" /><polygon
   style="fill:#a7a9ac"
   id="polygon8"
   points="6.494,27.779 6.514,27.791 9.869,25.854 9.87,25.838 9.883,25.846 13.246,23.902 13.246,23.896 13.251,23.899 16.621,21.954 19.998,20.005 19.997,19.99 19.998,16.107 19.996,16.095 19.997,12.209 19.998,12.199 19.997,8.311 19.998,8.302 19.998,4.414 16.629,6.357 16.622,6.362 13.255,8.306 13.246,8.312 9.88,10.255 9.871,10.26 6.506,12.202 6.494,12.209 6.494,16.107 6.494,19.998 6.5,20.001 6.494,20.004 6.494,23.888 6.507,23.896 6.494,23.904 "
   transform="matrix(3.1798133,0,0,3.1798133,-9.9178377,-1.5962663)" /><polygon
   style="fill:#f1f2f2"
   id="polygon10"
   points="30.132,25.854 33.486,27.791 33.507,27.779 33.507,23.904 33.493,23.896 33.507,23.888 33.507,20.004 33.5,20.001 33.507,19.998 33.507,16.107 33.507,12.209 33.494,12.202 30.13,10.26 30.12,10.255 26.755,8.312 26.745,8.306 23.379,6.362 23.371,6.357 20.003,4.414 20.003,8.302 20.004,8.311 20.003,12.199 20.004,12.209 20.005,16.095 20.003,16.107 20.004,19.99 20.003,20.005 23.38,21.954 26.749,23.899 26.755,23.896 26.755,23.902 30.117,25.846 30.131,25.838 "
   transform="matrix(3.1798133,0,0,3.1798133,-9.9178377,-1.5962663)" />
</svg>