<?xml version="1.0" encoding="UTF-8" standalone="no"?>
<svg
   xmlns:dc="http://purl.org/dc/elements/1.1/"
   xmlns:cc="http://creativecommons.org/ns#"
   xmlns:rdf="http://www.w3.org/1999/02/22-rdf-syntax-ns#"
   xmlns:svg="http://www.w3.org/2000/svg"
   xmlns="http://www.w3.org/2000/svg"
   xmlns:sodipodi="http://sodipodi.sourceforge.net/DTD/sodipodi-0.dtd"
   xmlns:inkscape="http://www.inkscape.org/namespaces/inkscape"
   viewBox="0 0 200 200"
   version="1.1"
   id="svg132"
   sodipodi:docname="gsper-logo.svg"
   width="200"
   height="200"
   inkscape:version="0.92.2 (5c3e80d, 2017-08-06)">
  <metadata
     id="metadata136">
    <rdf:RDF>
      <cc:Work
         rdf:about="">
        <dc:format>image/svg+xml</dc:format>
        <dc:type
           rdf:resource="http://purl.org/dc/dcmitype/StillImage" />
        <dc:title></dc:title>
      </cc:Work>
    </rdf:RDF>
  </metadata>
  <sodipodi:namedview
     pagecolor="#ffffff"
     bordercolor="#666666"
     borderopacity="1"
     objecttolerance="10"
     gridtolerance="10"
     guidetolerance="10"
     inkscape:pageopacity="0"
     inkscape:pageshadow="2"
     inkscape:window-width="1920"
     inkscape:window-height="1017"
     id="namedview134"
     showgrid="true"
     inkscape:snap-bbox="true"
     inkscape:bbox-paths="true"
     inkscape:snap-bbox-edge-midpoints="true"
     inkscape:bbox-nodes="true"
     inkscape:snap-bbox-midpoints="true"
     inkscape:object-paths="true"
     inkscape:snap-intersection-paths="true"
     inkscape:snap-smooth-nodes="true"
     inkscape:snap-midpoints="true"
     inkscape:snap-object-midpoints="true"
     inkscape:snap-center="true"
     inkscape:snap-text-baseline="true"
     inkscape:snap-page="true"
     showguides="true"
     inkscape:guide-bbox="true"
     fit-margin-top="0"
     fit-margin-left="0"
     fit-margin-right="0"
     fit-margin-bottom="0"
     inkscape:zoom="0.6675088"
     inkscape:cx="-97.372846"
     inkscape:cy="247.21196"
     inkscape:window-x="1072"
     inkscape:window-y="612"
     inkscape:window-maximized="1"
     inkscape:current-layer="glibre">
    <inkscape:grid
       type="xygrid"
       id="grid4632"
       originx="439.99998"
       originy="99.999998" />
  </sodipodi:namedview>
  <defs
     id="defs123" />
  <g
     id="glibre"
     transform="translate(440,-400)">
    <path
       style="opacity:1;fill:#000000;fill-opacity:1;stroke:none;stroke-width:20;stroke-linejoin:bevel;stroke-miterlimit:4;stroke-dasharray:none;stroke-opacity:1"
       d="m -331.53125,440.29297 a 10,10 0 0 1 -6.5,4.51172 10,10 0 0 1 -10.44336,-4.50781 l -8.46484,5.29101 a 20,20 0 0 0 20.87695,9.02149 20,20 0 0 0 13.01367,-9.01563 z"
       id="path4722"
       inkscape:connector-curvature="0" />
    <path
       inkscape:connector-curvature="0"
       id="path4670"
       d="m -339.78516,460 a 40,40 0 0 0 -22.62304,6.86523 40,40 0 0 0 -14.49024,48.57813 40,40 0 0 0 44.77539,23.77344 40,40 0 0 0 20.39258,-10.94727 L -300,540 v -40 h -20 -20 l 14.13477,14.13477 a 19.999999,19.999999 0 0 1 -10.19727,5.47461 19.999999,19.999999 0 0 1 -22.38672,-11.88672 19.999999,19.999999 0 0 1 7.2461,-24.28907 19.999999,19.999999 0 0 1 25.24023,2.32032 l 14.03711,-14.24805 A 40,40 0 0 0 -339.78516,460 Z"
       style="opacity:1;fill:#000000;fill-opacity:1;stroke:none;stroke-width:20;stroke-linejoin:bevel;stroke-miterlimit:4;stroke-dasharray:none;stroke-opacity:1" />
    <path
       style="opacity:1;fill:#000000;fill-opacity:1;stroke:none;stroke-width:20;stroke-linejoin:bevel;stroke-miterlimit:4;stroke-dasharray:none;stroke-opacity:1"
       d="m -330,535 v 45 h -30 v -10 h 10 v -10 h -10 v -10 h 10 v -15 z"
       id="rect4733"
       inkscape:connector-curvature="0"
       sodipodi:nodetypes="ccccccccccc"
       inkscape:transform-center-x="5"
       inkscape:transform-center-y="57.5" />
  </g>
</svg>
