{
    "letterN": "",
    "letterF": "",
    "name": "",
    "surname": {
        "fr": "",
        "en": ""
    },
    "img": "/data/medias/illustrations/digital/",
    "imgalt": {
        "fr": "",
        "en": ""
    },
    "media": {
        "sound": {
            "theme": {
                "type": "bandcamp/none",
                "urlsound": "https://bandcamp.com/EmbeddedPlayer/album=1741468648/size=small/bgcol=ffffff/linkcol=0687f5/track=592362215/transparent=true/",
                "urlalbum": "https://sergelongoulet.bandcamp.com/album/ema-s-guhetjanna",
                "title": "þema söguhetjanna by Serge Longoulet"                
            },
            "urls":[{
                "url":""
            }]
        },
        "video": {
            "theme":"",
            "urls":[{
                "url":""
            }]
        }
    },
    "desc": {
        "fr": "",
        "en": ""
    },
    "people": {
        "fr": "",
        "en": ""
    },
    "birthdate": {
        "day": "",
        "month": "",
        "year": ""
    },
    "deathdate": {
        "day": "",
        "month": "",
        "year": ""
    },
    "agewhendied": "",
    "planetorigin": {
        "name": {
            "fr": "",
            "en": ""
        },
        "link": "plan-"
    },
    "novels": [{
        "name": {
            "fr": "",
            "en": ""
        },
        "link": ""
    }],
    "interviews": [{
        "name": "",
        "link": ""
    }]
}