{
    "period": {
        "id": "0",
        "name": {
            "fr": "",
            "en": ""
        },
        "desc": {
            "fr": "",
            "en": ""
        },
        "novels": [{
            "id": "0",
            "name": {
                "fr": "",
                "en": ""
            },
            "dateperiod": "",
            "refpage": "",
            "freeread": "",
            "translate": "1"
        }]
    }
}