<?xml version="1.0" encoding="UTF-8"?>
<!DOCTYPE svg PUBLIC "-//W3C//DTD SVG 1.1//EN" "http://www.w3.org/Graphics/SVG/1.1/DTD/svg11.dtd">
<svg version="1.2" width="159.01mm" height="34.66mm" viewBox="0 0 15901 3466" preserveAspectRatio="xMidYMid" fill-rule="evenodd" stroke-width="28.222" stroke-linejoin="round" xmlns="http://www.w3.org/2000/svg" xmlns:ooo="http://xml.openoffice.org/svg/export" xmlns:xlink="http://www.w3.org/1999/xlink" xmlns:presentation="http://sun.com/xmlns/staroffice/presentation" xmlns:smil="http://www.w3.org/2001/SMIL20/" xmlns:anim="urn:oasis:names:tc:opendocument:xmlns:animation:1.0" xmlns:svg="urn:oasis:names:tc:opendocument:xmlns:svg-compatible:1.0" xml:space="preserve">
 <defs class="ClipPathGroup">
  <clipPath id="presentation_clip_path" clipPathUnits="userSpaceOnUse">
   <rect x="0" y="0" width="15901" height="3466"/>
  </clipPath>
  <clipPath id="presentation_clip_path_shrink" clipPathUnits="userSpaceOnUse">
   <rect x="15" y="3" width="15870" height="3460"/>
  </clipPath>
 </defs>
 <defs>
  <font id="EmbeddedFont_1" horiz-adv-x="2048">
   <font-face font-family="Arial embedded" units-per-em="2048" font-weight="bold" font-style="normal" ascent="1852" descent="441"/>
   <missing-glyph horiz-adv-x="2048" d="M 0,0 L 2047,0 2047,2047 0,2047 0,0 Z"/>
   <glyph unicode="z" horiz-adv-x="950" d="M 34,0 L 34,219 432,676 C 497,751 546,804 577,835 544,833 501,832 448,831 L 73,829 73,1062 951,1062 951,863 545,395 402,240 C 480,245 528,247 547,247 L 982,247 982,0 34,0 Z"/>
   <glyph unicode="u" horiz-adv-x="967" d="M 846,0 L 846,159 C 807,102 757,58 694,25 631,-8 564,-24 494,-24 423,-24 359,-8 302,23 245,54 204,98 179,155 154,212 141,290 141,390 L 141,1062 422,1062 422,574 C 422,425 427,333 438,300 448,266 467,239 494,220 521,200 556,190 598,190 646,190 689,203 727,230 765,256 791,289 805,328 819,367 826,462 826,614 L 826,1062 1107,1062 1107,0 846,0 Z"/>
   <glyph unicode="t" horiz-adv-x="628" d="M 634,1062 L 634,838 442,838 442,410 C 442,323 444,273 448,259 451,244 460,232 473,223 486,214 501,209 520,209 546,209 584,218 633,236 L 657,18 C 592,-10 518,-24 435,-24 384,-24 339,-15 298,2 257,19 228,41 209,68 190,95 176,131 169,177 163,210 160,276 160,375 L 160,838 31,838 31,1062 160,1062 160,1273 442,1437 442,1062 634,1062 Z"/>
   <glyph unicode="s" horiz-adv-x="994" d="M 48,303 L 330,346 C 342,291 366,250 403,222 440,193 491,179 557,179 630,179 684,192 721,219 746,238 758,263 758,294 758,315 751,333 738,347 724,360 693,373 644,384 417,434 274,480 213,521 129,578 87,658 87,760 87,852 123,929 196,992 269,1055 381,1086 534,1086 679,1086 787,1062 858,1015 929,968 977,898 1004,805 L 739,756 C 728,797 706,829 675,851 643,873 598,884 539,884 465,884 412,874 380,853 359,838 348,819 348,796 348,776 357,759 376,745 401,726 489,700 639,666 788,632 893,590 952,541 1011,491 1040,421 1040,332 1040,235 999,151 918,81 837,11 716,-24 557,-24 412,-24 298,5 214,64 129,123 74,202 48,303 Z"/>
   <glyph unicode="r" horiz-adv-x="690" d="M 416,0 L 135,0 135,1062 396,1062 396,911 C 441,982 481,1029 517,1052 552,1075 593,1086 638,1086 702,1086 764,1068 823,1033 L 736,788 C 689,819 645,834 604,834 565,834 531,823 504,802 477,780 455,741 440,684 424,627 416,509 416,328 L 416,0 Z"/>
   <glyph unicode="i" horiz-adv-x="283" d="M 147,1206 L 147,1466 428,1466 428,1206 147,1206 Z M 147,0 L 147,1062 428,1062 428,0 147,0 Z"/>
   <glyph unicode="f" horiz-adv-x="720" d="M 24,1062 L 180,1062 180,1142 C 180,1231 190,1298 209,1342 228,1386 263,1422 314,1450 365,1477 429,1491 507,1491 587,1491 665,1479 742,1455 L 704,1259 C 659,1270 616,1275 575,1275 534,1275 505,1266 488,1247 470,1228 461,1191 461,1137 L 461,1062 671,1062 671,841 461,841 461,0 180,0 180,841 24,841 24,1062 Z"/>
   <glyph unicode="e" horiz-adv-x="1000" d="M 762,338 L 1042,291 C 1006,188 949,110 872,57 794,3 697,-24 580,-24 395,-24 259,36 170,157 100,254 65,376 65,523 65,699 111,837 203,937 295,1036 411,1086 552,1086 710,1086 835,1034 926,930 1017,825 1061,665 1057,450 L 353,450 C 355,367 378,302 421,256 464,209 518,186 583,186 627,186 664,198 694,222 724,246 747,285 762,338 Z M 778,622 C 776,703 755,765 715,808 675,850 626,871 569,871 508,871 457,849 417,804 377,759 357,699 358,622 L 778,622 Z"/>
   <glyph unicode="a" horiz-adv-x="999" d="M 357,738 L 102,784 C 131,887 180,963 250,1012 320,1061 424,1086 562,1086 687,1086 781,1071 842,1042 903,1012 947,974 972,929 997,883 1009,799 1009,677 L 1006,349 C 1006,256 1011,187 1020,143 1029,98 1045,51 1070,0 L 792,0 C 785,19 776,46 765,83 760,100 757,111 755,116 707,69 656,34 601,11 546,-12 488,-24 426,-24 317,-24 231,6 168,65 105,124 73,199 73,290 73,350 87,404 116,451 145,498 185,534 237,559 288,584 363,605 460,624 591,649 682,672 733,693 L 733,721 C 733,775 720,814 693,837 666,860 616,871 542,871 492,871 453,861 425,842 397,822 374,787 357,738 Z M 733,510 C 697,498 640,484 562,467 484,450 433,434 409,418 372,392 354,359 354,319 354,280 369,246 398,217 427,188 465,174 510,174 561,174 609,191 655,224 689,249 711,280 722,317 729,341 733,387 733,454 L 733,510 Z"/>
   <glyph unicode="V" horiz-adv-x="1365" d="M 523,0 L -1,1466 320,1466 691,381 1050,1466 1364,1466 839,0 523,0 Z"/>
   <glyph unicode="S" horiz-adv-x="1193" d="M 74,477 L 362,505 C 379,408 415,337 468,292 521,247 592,224 682,224 777,224 849,244 898,285 946,325 970,372 970,426 970,461 960,490 940,515 919,539 884,560 833,578 798,590 719,611 596,642 437,681 326,730 262,787 172,868 127,966 127,1082 127,1157 148,1227 191,1292 233,1357 294,1406 374,1440 453,1474 549,1491 662,1491 846,1491 985,1451 1078,1370 1171,1289 1219,1182 1224,1047 L 928,1034 C 915,1109 888,1164 847,1197 805,1230 742,1246 659,1246 573,1246 506,1228 457,1193 426,1170 410,1140 410,1102 410,1067 425,1038 454,1013 491,982 582,949 726,915 870,881 977,846 1046,810 1115,773 1169,724 1208,661 1247,598 1266,520 1266,427 1266,343 1243,264 1196,191 1149,118 1083,63 998,28 913,-8 806,-26 679,-26 494,-26 351,17 252,103 153,188 93,313 74,477 Z"/>
   <glyph unicode="L" horiz-adv-x="1033" d="M 157,0 L 157,1454 453,1454 453,247 1189,247 1189,0 157,0 Z"/>
   <glyph unicode="." horiz-adv-x="283" d="M 147,0 L 147,281 428,281 428,0 147,0 Z"/>
   <glyph unicode=" " horiz-adv-x="564"/>
  </font>
 </defs>
 <defs>
  <font id="EmbeddedFont_2" horiz-adv-x="2048">
   <font-face font-family="CenturyGothic-Bold embedded" units-per-em="2048" font-weight="bold" font-style="normal" ascent="1817" descent="441"/>
   <missing-glyph horiz-adv-x="2048" d="M 0,0 L 2047,0 2047,2047 0,2047 0,0 Z"/>
   <glyph unicode="L" horiz-adv-x="1256" d="M 1293,476 L 1242,0 38,0 38,37 83,37 C 122,37 154,44 178,58 195,67 209,83 218,106 225,122 229,164 229,232 L 229,1124 C 229,1193 225,1237 218,1254 211,1271 196,1287 174,1300 151,1313 121,1319 83,1319 L 38,1319 38,1356 761,1356 761,1319 702,1319 C 663,1319 631,1312 607,1298 590,1289 576,1273 566,1250 559,1234 555,1192 555,1124 L 555,260 C 555,191 559,147 567,128 575,109 591,94 614,85 631,79 671,76 735,76 L 848,76 C 920,76 980,89 1028,114 1076,139 1118,179 1153,234 1188,289 1221,369 1252,476 L 1293,476 Z"/>
  </font>
 </defs>
 <defs class="TextShapeIndex">
  <g ooo:slide="id1" ooo:id-list="id3 id4"/>
 </defs>
 <defs class="EmbeddedBulletChars">
  <g id="bullet-char-template-57356" transform="scale(0.00048828125,-0.00048828125)">
   <path d="M 580,1141 L 1163,571 580,0 -4,571 580,1141 Z"/>
  </g>
  <g id="bullet-char-template-57354" transform="scale(0.00048828125,-0.00048828125)">
   <path d="M 8,1128 L 1137,1128 1137,0 8,0 8,1128 Z"/>
  </g>
  <g id="bullet-char-template-10146" transform="scale(0.00048828125,-0.00048828125)">
   <path d="M 174,0 L 602,739 174,1481 1456,739 174,0 Z M 1358,739 L 309,1346 659,739 1358,739 Z"/>
  </g>
  <g id="bullet-char-template-10132" transform="scale(0.00048828125,-0.00048828125)">
   <path d="M 2015,739 L 1276,0 717,0 1260,543 174,543 174,936 1260,936 717,1481 1274,1481 2015,739 Z"/>
  </g>
  <g id="bullet-char-template-10007" transform="scale(0.00048828125,-0.00048828125)">
   <path d="M 0,-2 C -7,14 -16,27 -25,37 L 356,567 C 262,823 215,952 215,954 215,979 228,992 255,992 264,992 276,990 289,987 310,991 331,999 354,1012 L 381,999 492,748 772,1049 836,1024 860,1049 C 881,1039 901,1025 922,1006 886,937 835,863 770,784 769,783 710,716 594,584 L 774,223 C 774,196 753,168 711,139 L 727,119 C 717,90 699,76 672,76 641,76 570,178 457,381 L 164,-76 C 142,-110 111,-127 72,-127 30,-127 9,-110 8,-76 1,-67 -2,-52 -2,-32 -2,-23 -1,-13 0,-2 Z"/>
  </g>
  <g id="bullet-char-template-10004" transform="scale(0.00048828125,-0.00048828125)">
   <path d="M 285,-33 C 182,-33 111,30 74,156 52,228 41,333 41,471 41,549 55,616 82,672 116,743 169,778 240,778 293,778 328,747 346,684 L 369,508 C 377,444 397,411 428,410 L 1163,1116 C 1174,1127 1196,1133 1229,1133 1271,1133 1292,1118 1292,1087 L 1292,965 C 1292,929 1282,901 1262,881 L 442,47 C 390,-6 338,-33 285,-33 Z"/>
  </g>
  <g id="bullet-char-template-9679" transform="scale(0.00048828125,-0.00048828125)">
   <path d="M 813,0 C 632,0 489,54 383,161 276,268 223,411 223,592 223,773 276,916 383,1023 489,1130 632,1184 813,1184 992,1184 1136,1130 1245,1023 1353,916 1407,772 1407,592 1407,412 1353,268 1245,161 1136,54 992,0 813,0 Z"/>
  </g>
  <g id="bullet-char-template-8226" transform="scale(0.00048828125,-0.00048828125)">
   <path d="M 346,457 C 273,457 209,483 155,535 101,586 74,649 74,723 74,796 101,859 155,911 209,963 273,989 346,989 419,989 480,963 531,910 582,859 608,796 608,723 608,648 583,586 532,535 482,483 420,457 346,457 Z"/>
  </g>
  <g id="bullet-char-template-8211" transform="scale(0.00048828125,-0.00048828125)">
   <path d="M -4,459 L 1135,459 1135,606 -4,606 -4,459 Z"/>
  </g>
  <g id="bullet-char-template-61548" transform="scale(0.00048828125,-0.00048828125)">
   <path d="M 173,740 C 173,903 231,1043 346,1159 462,1274 601,1332 765,1332 928,1332 1067,1274 1183,1159 1299,1043 1357,903 1357,740 1357,577 1299,437 1183,322 1067,206 928,148 765,148 601,148 462,206 346,322 231,437 173,577 173,740 Z"/>
  </g>
 </defs>
 <g>
  <g id="id2" class="Master_Slide">
   <g id="bg-id2" class="Background"/>
   <g id="bo-id2" class="BackgroundObjects"/>
  </g>
 </g>
 <g class="SlideGroup">
  <g>
   <g id="container-id1">
    <g id="id1" class="Slide" clip-path="url(#presentation_clip_path)">
     <g class="Page">
      <g class="Graphic">
       <g id="id3">
        <rect class="BoundingBox" stroke="none" fill="none" x="250" y="0" width="3422" height="3458"/>
        <text class="SVGTextShape" transform="rotate(-70.9 0 0)"><tspan class="TextParagraph"><tspan class="TextPosition" x="1882" y="1177"><tspan font-family="CenturyGothic-Bold, sans-serif" font-size="159px" font-weight="700" fill="rgb(38,46,42)" stroke="none" style="white-space: pre">L</tspan></tspan></tspan></text>
        <path fill="rgb(237,165,63)" stroke="none" d="M 2550,513 L 2550,513 C 2368,431 2171,388 1971,388 1772,388 1574,431 1392,513 L 2550,513 2550,513 Z"/>
        <path fill="rgb(232,150,77)" stroke="none" d="M 978,799 L 2965,799 2965,799 C 2878,712 2780,638 2674,576 2670,574 2665,571 2660,569 L 1282,569 1282,569 C 1277,572 1272,574 1268,577 1162,638 1065,712 978,799 L 978,799 Z"/>
        <path fill="rgb(223,108,64)" stroke="none" d="M 751,1095 L 3191,1095 3191,1095 C 3191,1095 3191,1094 3191,1094 3144,1012 3088,936 3026,865 L 916,865 916,865 C 853,935 799,1012 751,1093 751,1094 751,1094 751,1095 L 751,1095 Z"/>
        <path fill="rgb(213,88,60)" stroke="none" d="M 620,1398 L 3322,1398 3322,1398 C 3299,1319 3268,1242 3231,1168 L 711,1168 711,1168 C 674,1242 644,1319 620,1398 L 620,1398 Z"/>
        <path fill="rgb(197,61,71)" stroke="none" d="M 567,1697 L 3375,1697 3375,1697 C 3370,1619 3358,1542 3340,1467 L 602,1467 602,1467 C 584,1542 572,1619 567,1697 L 567,1697 Z"/>
        <path fill="rgb(160,184,158)" stroke="none" d="M 2164,2528 L 2164,2528 C 2202,2519 2241,2515 2280,2514 2331,2514 2381,2514 2432,2513 L 2903,2513 3183,2513 3183,2513 C 3186,2509 3188,2504 3191,2500 3223,2444 3252,2385 3276,2325 3230,2325 3184,2325 3137,2325 3049,2325 2960,2325 2872,2325 L 2872,2325 C 2870,2325 2867,2325 2865,2325 2853,2325 2841,2326 2829,2329 2821,2322 2813,2325 2804,2326 L 2457,2326 C 2452,2326 2448,2326 2443,2326 L 1785,2326 C 1680,2326 1575,2326 1469,2326 L 1469,2326 1466,2326 1451,2326 1058,2326 C 928,2326 797,2325 666,2325 L 666,2325 C 690,2385 719,2444 751,2501 757,2510 762,2519 767,2527 L 791,2527 C 923,2527 1054,2529 1186,2524 L 1197,2524 1203,2524 C 1258,2524 1313,2525 1368,2525 L 1368,2525 C 1400,2527 1431,2532 1463,2538 1500,2542 1538,2541 1575,2542 1583,2548 1579,2549 1573,2549 1551,2550 1530,2551 1508,2551 1382,2548 1255,2546 1129,2553 L 1112,2553 1112,2553 C 1107,2553 1103,2553 1098,2553 1084,2553 1069,2554 1055,2555 L 1055,2555 C 1050,2555 1045,2554 1039,2554 1034,2554 1029,2555 1023,2555 976,2551 930,2545 882,2545 849,2545 816,2548 783,2551 L 783,2551 C 816,2604 854,2655 895,2704 L 895,2704 C 911,2701 927,2699 943,2699 1027,2694 1110,2690 1195,2690 L 1195,2690 C 1224,2691 1254,2694 1284,2700 L 1284,2700 C 1291,2701 1299,2701 1307,2701 L 1328,2704 1335,2704 1346,2704 1359,2706 1359,2706 C 1359,2703 1360,2700 1361,2696 L 1361,2696 C 1360,2700 1359,2703 1359,2706 L 1375,2712 1375,2712 C 1340,2717 1304,2719 1269,2719 1259,2719 1250,2719 1241,2719 1185,2719 1128,2718 1072,2719 1015,2720 960,2713 904,2710 L 901,2710 C 913,2725 926,2739 939,2753 L 941,2753 948,2753 948,2753 C 955,2754 962,2754 969,2754 984,2754 1000,2753 1015,2751 L 1015,2751 C 1017,2752 1020,2753 1022,2753 1024,2753 1027,2752 1029,2751 L 1029,2751 C 1034,2752 1039,2752 1045,2752 1052,2752 1061,2752 1068,2751 L 1068,2751 C 1072,2752 1075,2753 1078,2753 1080,2753 1081,2753 1082,2752 L 1093,2752 1100,2752 C 1116,2754 1117,2754 1119,2745 1119,2749 1121,2750 1124,2750 L 1124,2750 C 1145,2753 1166,2754 1186,2754 1192,2754 1197,2754 1203,2754 L 1242,2754 1257,2754 1292,2754 1313,2754 1331,2754 1338,2754 1383,2754 1385,2754 1386,2754 1387,2754 C 1479,2755 1570,2768 1661,2767 L 1661,2767 C 1718,2768 1775,2774 1831,2787 1784,2788 1737,2788 1690,2788 1584,2788 1477,2788 1371,2796 L 1360,2797 1349,2797 C 1333,2797 1316,2797 1300,2798 L 1300,2798 C 1275,2800 1250,2801 1225,2801 1181,2801 1136,2798 1092,2791 L 1092,2791 C 1049,2784 1006,2780 963,2779 L 963,2779 C 1007,2824 1053,2866 1103,2904 1148,2902 1193,2899 1238,2900 1292,2901 1346,2903 1399,2900 L 1399,2900 C 1402,2901 1405,2901 1408,2901 1411,2901 1414,2901 1417,2900 L 1424,2900 1427,2900 1429,2900 1431,2900 1441,2900 1451,2900 1487,2903 1526,2904 1572,2904 1576,2904 1621,2905 1635,2905 C 1639,2905 1643,2905 1645,2901 L 1645,2902 1646,2902 C 1655,2911 1666,2907 1677,2908 L 1677,2908 C 1677,2908 1677,2908 1678,2909 1680,2910 1683,2911 1686,2911 1687,2911 1688,2911 1689,2910 L 1706,2914 1706,2914 C 1707,2914 1707,2914 1708,2914 1708,2914 1709,2914 1710,2914 1693,2921 1677,2915 1660,2918 L 1660,2918 C 1660,2917 1659,2917 1658,2917 1658,2917 1657,2917 1657,2918 L 1643,2918 1643,2918 C 1617,2917 1592,2916 1567,2916 1529,2916 1491,2917 1454,2920 L 1454,2920 C 1384,2928 1315,2932 1246,2932 1231,2932 1216,2932 1201,2931 1179,2930 1156,2928 1134,2926 L 1134,2926 C 1177,2958 1222,2987 1269,3014 1283,3022 1296,3029 1310,3037 L 1315,3037 C 1398,3031 1480,3015 1563,3015 1646,3015 1732,3015 1816,3014 1929,3012 2041,3020 2153,3014 L 2153,3014 C 2172,3011 2192,3009 2211,3009 2250,3011 2289,3009 2327,3010 2404,3011 2480,3007 2556,3017 2579,3021 2602,3026 2625,3030 L 2625,3030 2626,3030 2626,3029 C 2626,3031 2629,3032 2631,3032 L 2626,3029 2626,3029 2631,3032 C 2627,3039 2621,3035 2616,3035 L 2370,3035 2370,3035 C 2369,3035 2369,3035 2369,3035 2290,3035 2213,3041 2135,3051 L 2135,3051 C 2123,3053 2112,3053 2100,3053 2081,3053 2062,3052 2044,3049 L 2044,3049 C 2014,3047 1985,3046 1955,3046 1906,3046 1856,3049 1807,3054 L 1807,3054 C 1763,3059 1718,3062 1673,3062 1656,3062 1640,3061 1623,3061 1601,3059 1581,3048 1558,3049 L 1558,3049 C 1535,3044 1512,3042 1488,3042 1486,3042 1484,3042 1482,3042 L 1326,3046 1326,3046 C 1525,3149 1747,3202 1971,3202 2218,3202 2461,3138 2675,3014 2706,2996 2736,2977 2766,2956 L 2762,2956 2754,2956 2754,2956 C 2754,2956 2754,2956 2754,2956 2754,2959 2754,2961 2753,2963 2752,2965 2751,2966 2748,2967 2748,2968 2748,2968 2747,2968 2747,2968 2747,2968 2747,2968 L 2747,2968 C 2735,2968 2723,2964 2711,2963 L 2711,2963 C 2723,2965 2736,2966 2748,2967 L 2748,2967 C 2748,2967 2749,2967 2749,2966 2751,2965 2752,2964 2753,2962 2754,2961 2755,2959 2755,2957 2755,2956 2755,2956 2755,2956 L 2755,2956 C 2727,2953 2700,2951 2672,2951 2650,2951 2627,2952 2605,2954 L 2605,2954 C 2579,2957 2552,2959 2525,2959 2519,2959 2512,2959 2506,2959 L 2506,2959 C 2553,2945 2603,2938 2652,2935 L 2797,2934 2797,2934 C 2873,2879 2943,2816 3007,2748 L 2801,2748 2801,2748 C 2800,2747 2799,2747 2799,2747 2798,2747 2798,2747 2797,2748 L 2793,2748 2793,2748 C 2793,2747 2792,2747 2792,2747 2791,2747 2790,2747 2790,2748 L 2790,2748 C 2787,2747 2785,2746 2783,2746 2780,2746 2778,2747 2776,2748 L 2776,2748 C 2775,2747 2775,2747 2774,2747 2774,2747 2773,2747 2772,2748 L 2769,2748 2769,2748 C 2769,2747 2768,2747 2768,2747 2767,2747 2767,2747 2766,2748 L 2762,2748 2762,2748 C 2762,2747 2761,2747 2760,2747 2760,2747 2759,2747 2759,2748 L 2754,2748 C 2754,2748 2753,2747 2752,2748 L 2744,2748 2744,2748 C 2744,2747 2744,2747 2743,2747 2743,2747 2743,2747 2743,2747 2742,2747 2742,2747 2742,2747 2742,2747 2742,2747 2742,2748 L 2737,2748 C 2737,2748 2736,2748 2735,2748 L 2735,2748 C 2727,2747 2719,2746 2711,2746 2703,2746 2695,2747 2687,2748 L 2687,2748 2687,2747 C 2686,2747 2686,2747 2686,2747 2686,2747 2685,2747 2685,2747 L 2685,2748 2680,2748 2680,2748 C 2680,2747 2680,2747 2680,2747 L 2679,2747 C 2679,2747 2679,2747 2679,2747 2679,2747 2679,2747 2678,2748 L 2631,2748 C 2624,2748 2618,2748 2612,2748 L 1969,2749 C 1963,2749 1955,2751 1949,2747 1950,2746 1951,2745 1951,2744 L 1962,2741 1962,2741 C 2036,2722 2113,2712 2190,2712 2195,2712 2199,2712 2203,2712 2291,2714 2377,2712 2465,2712 L 2465,2712 C 2473,2713 2480,2713 2488,2713 2496,2713 2503,2713 2511,2712 L 2518,2712 2518,2712 C 2521,2713 2525,2713 2529,2713 2532,2713 2536,2713 2539,2712 L 2546,2712 2546,2712 C 2556,2713 2565,2713 2575,2713 2584,2713 2593,2713 2603,2712 L 2603,2712 C 2609,2713 2616,2713 2622,2713 2629,2713 2635,2713 2642,2712 2672,2712 2702,2712 2732,2712 L 3041,2712 3041,2712 C 3089,2656 3132,2597 3171,2534 3139,2534 3107,2534 3075,2534 L 3075,2534 C 3071,2534 3067,2534 3063,2534 3051,2534 3040,2535 3028,2537 L 3000,2537 3000,2537 2992,2537 2964,2537 2940,2537 2922,2537 2892,2537 2881,2537 2867,2537 2818,2537 2811,2537 C 2730,2533 2650,2530 2570,2533 L 2452,2533 2452,2533 C 2452,2533 2452,2533 2452,2533 2452,2533 2452,2533 2451,2533 2451,2533 2451,2533 2450,2533 2450,2533 2450,2533 2450,2533 L 2445,2533 2429,2533 2153,2533 2153,2533 C 2154,2532 2156,2530 2157,2530 2159,2529 2161,2528 2163,2528 2163,2528 2164,2528 2164,2528 L 2164,2528 Z M 1377,2748 L 1377,2748 1377,2748 Z M 1569,2826 L 1569,2824 1566,2823 1569,2824 1569,2826 1569,2826 Z M 2602,2783 L 2602,2783 C 2602,2782 2601,2781 2601,2781 L 2601,2781 C 2601,2781 2602,2782 2602,2783 L 2602,2783 Z M 2595,2779 L 2595,2779 2595,2779 C 2596,2779 2598,2780 2599,2780 2599,2781 2599,2780 2599,2781 L 2599,2781 2599,2780 C 2598,2780 2597,2779 2595,2779 2595,2779 2595,2779 2595,2779 L 2595,2779 C 2591,2776 2585,2775 2583,2770 2585,2775 2591,2776 2595,2779 L 2595,2779 2595,2779 Z M 2256,2832 L 2256,2832 C 2256,2829 2255,2827 2253,2827 2255,2827 2256,2829 2256,2832 L 2256,2832 Z M 1154,2447 L 1154,2447 1157,2443 1154,2447 1154,2447 Z M 1859,2847 L 1859,2847 1861,2850 1859,2847 1859,2847 Z M 1953,2919 L 1953,2919 1953,2919 C 1953,2919 1953,2918 1953,2918 1953,2918 1953,2918 1953,2917 L 1953,2917 C 1953,2918 1953,2918 1953,2918 1953,2919 1953,2919 1953,2919 L 1953,2919 1953,2919 Z M 1954,2914 C 1958,2913 1961,2913 1963,2917 1961,2913 1958,2913 1954,2917 L 1954,2917 C 1954,2916 1954,2916 1954,2916 1954,2915 1954,2915 1954,2915 L 1954,2915 C 1952,2892 1952,2892 1935,2900 1952,2892 1952,2892 1954,2914 L 1954,2914 Z M 1677,2580 C 1632,2580 1587,2576 1542,2573 L 1542,2569 1600,2569 1618,2567 1618,2567 1678,2566 1685,2566 C 1752,2564 1818,2566 1885,2566 1938,2565 1990,2569 2043,2570 2079,2571 2116,2570 2152,2570 L 2152,2575 C 1994,2585 1836,2581 1677,2581 L 1677,2580 1677,2580 Z M 1732,2419 C 1627,2419 1520,2420 1414,2420 1383,2420 1351,2417 1320,2415 1274,2410 1228,2417 1181,2418 1100,2420 1019,2415 938,2410 932,2410 926,2410 920,2410 914,2401 924,2405 926,2405 953,2405 980,2405 1007,2405 L 1133,2402 C 1269,2407 1404,2401 1540,2401 L 1853,2401 2362,2401 C 2367,2401 2373,2401 2379,2401 L 2397,2401 2716,2401 2747,2401 2758,2401 2789,2404 2789,2404 C 2818,2407 2847,2409 2876,2409 2882,2409 2888,2408 2895,2408 L 3004,2408 3004,2413 2843,2416 2722,2416 2697,2416 2697,2416 2696,2416 2696,2416 C 2696,2416 2696,2417 2695,2417 2695,2417 2694,2417 2693,2418 L 2693,2418 C 2694,2417 2695,2417 2695,2417 2696,2417 2696,2416 2696,2416 L 2691,2416 2691,2417 2691,2417 2691,2417 C 2691,2417 2691,2417 2690,2417 2688,2416 2685,2415 2683,2415 2681,2415 2680,2415 2678,2416 L 2650,2416 2607,2416 2572,2416 2539,2416 2538,2416 2537,2416 2537,2416 C 2536,2418 2535,2420 2535,2422 L 2535,2422 C 2535,2420 2536,2418 2537,2416 2478,2416 2419,2414 2360,2416 2149,2422 1941,2419 1732,2419 L 1732,2419 1732,2419 Z"/>
        <path fill="rgb(237,165,63)" stroke="none" d="M 1972,1001 L 1972,1001 C 1832,1002 1695,1039 1573,1109 1451,1180 1349,1281 1279,1404 1250,1453 1227,1504 1210,1558 L 1210,1558 C 1211,1558 1211,1558 1212,1558 1213,1558 1213,1558 1214,1558 L 1214,1558 C 1213,1558 1213,1558 1212,1558 1211,1558 1211,1558 1210,1558 L 1210,1558 C 1183,1640 1169,1727 1169,1813 1169,1814 1169,1814 1169,1815 1169,1835 1170,1856 1172,1876 L 1172,1876 1172,1876 C 1175,1915 1182,1954 1193,1991 L 1193,1991 C 1195,1998 1196,2004 1198,2011 L 1198,2011 C 1198,2021 1200,2031 1205,2040 1211,2049 1218,2056 1228,2062 1236,2066 1245,2069 1254,2070 1296,2076 1332,2100 1373,2105 1414,2110 1458,2122 1499,2095 1507,2090 1515,2093 1524,2097 L 1524,2097 C 1524,2098 1525,2098 1525,2098 1555,2115 1582,2135 1606,2158 L 1606,2158 C 1608,2161 1611,2163 1613,2164 1617,2167 1622,2168 1626,2168 L 1626,2168 C 1631,2167 1636,2166 1641,2166 1653,2166 1665,2170 1676,2176 1680,2178 1684,2181 1687,2184 1705,2200 1730,2204 1753,2212 L 1757,2214 1757,2214 1758,2214 C 1765,2220 1773,2226 1780,2232 L 1780,2232 C 1789,2239 1798,2246 1808,2251 1824,2260 1842,2267 1860,2271 L 1860,2271 C 1911,2277 1962,2286 2011,2299 L 2011,2299 C 2018,2300 2025,2301 2033,2301 2045,2301 2057,2299 2068,2294 2103,2279 2138,2265 2174,2250 L 2174,2250 C 2179,2248 2184,2246 2189,2243 2202,2236 2213,2226 2223,2214 L 2223,2214 C 2256,2200 2291,2187 2326,2178 L 2326,2178 C 2332,2176 2339,2174 2344,2170 2350,2167 2355,2162 2360,2158 2397,2118 2442,2087 2483,2052 L 2483,2052 C 2485,2050 2488,2048 2491,2046 2497,2043 2503,2041 2508,2041 2514,2041 2520,2043 2525,2046 2526,2046 2527,2046 2527,2047 2579,2090 2641,2101 2705,2109 2713,2110 2719,2109 2722,2103 L 2722,2103 C 2757,2011 2775,1913 2775,1815 2775,1814 2775,1813 2775,1813 2776,1366 2416,1001 1972,1001 L 1972,1001 Z"/>
        <path fill="rgb(163,54,57)" stroke="none" d="M 3378,1757 L 2774,1757 C 2775,1776 2776,1795 2776,1815 L 2776,1815 C 2776,1880 2768,1946 2752,2010 2787,2010 2823,2008 2859,2010 L 2859,2010 C 2865,2010 2870,2010 2876,2010 2915,2010 2953,2003 2990,1990 L 2990,1990 C 3018,1979 3045,1965 3072,1950 3080,1945 3088,1940 3096,1935 3121,1921 3144,1905 3176,1909 L 3176,1909 C 3178,1910 3180,1910 3183,1910 3193,1910 3204,1908 3214,1906 L 3214,1906 C 3217,1906 3220,1905 3222,1905 3228,1905 3234,1906 3239,1908 3282,1924 3326,1932 3371,1948 L 3371,1948 C 3376,1898 3379,1848 3379,1797 3379,1784 3379,1770 3378,1757 L 3378,1757 Z"/>
        <path fill="rgb(163,54,57)" stroke="none" d="M 1171,1876 L 1171,1876 C 1170,1856 1169,1835 1169,1815 1169,1794 1170,1779 1171,1761 L 1171,1758 564,1758 C 564,1771 563,1784 563,1797 563,1842 565,1887 569,1932 L 569,1932 C 579,1931 588,1928 596,1923 597,1923 597,1923 597,1923 643,1895 691,1873 747,1891 L 747,1891 C 751,1892 755,1893 759,1893 767,1893 775,1891 782,1887 783,1886 783,1886 784,1885 L 784,1885 C 800,1877 816,1870 833,1864 L 833,1864 C 837,1862 841,1862 845,1862 851,1862 856,1864 861,1866 864,1868 866,1869 868,1871 918,1915 982,1933 1037,1968 1037,1968 1038,1968 1039,1968 L 1039,1968 C 1051,1972 1064,1977 1075,1984 1084,1989 1091,1994 1099,2000 L 1099,2000 C 1101,2002 1102,2003 1104,2004 1110,2008 1117,2009 1123,2009 1124,2009 1124,2009 1125,2009 1148,2009 1172,2010 1195,2011 L 1195,2011 C 1189,1989 1184,1966 1180,1943 L 1180,1943 C 1175,1921 1172,1899 1171,1876 L 1171,1876 Z"/>
        <path fill="rgb(38,46,42)" stroke="none" d="M 1008,1796 L 1008,1796 C 1031,1788 1053,1779 1074,1768 L 1074,1768 C 1075,1768 1076,1767 1077,1766 1080,1765 1083,1764 1087,1764 1090,1764 1094,1765 1097,1766 1098,1767 1098,1767 1099,1767 1103,1770 1107,1767 1111,1764 L 1111,1764 C 1120,1755 1128,1744 1135,1733 1135,1732 1136,1732 1136,1731 L 1136,1731 C 1163,1681 1182,1626 1193,1570 L 1193,1570 C 1194,1566 1194,1562 1194,1559 1194,1552 1192,1544 1189,1538 1183,1525 1176,1512 1169,1499 L 1169,1499 C 1168,1498 1168,1497 1167,1497 1164,1491 1158,1485 1152,1482 1146,1478 1139,1476 1132,1476 1132,1476 1132,1476 1131,1476 1117,1476 1103,1476 1089,1476 L 1089,1476 C 1069,1476 1049,1481 1031,1491 939,1538 847,1586 756,1637 L 756,1637 C 743,1644 729,1651 716,1659 696,1670 677,1683 660,1696 619,1730 577,1764 536,1799 L 536,1799 C 519,1811 504,1825 491,1841 466,1878 442,1915 417,1952 L 417,1952 C 415,1954 413,1957 412,1959 409,1965 407,1971 405,1977 397,2005 389,2033 382,2061 L 382,2061 C 380,2065 379,2069 379,2074 379,2078 380,2083 382,2087 389,2103 396,2120 404,2136 L 404,2136 C 405,2139 406,2141 408,2144 413,2152 419,2160 428,2166 436,2172 444,2169 445,2159 L 445,2159 C 446,2154 447,2148 450,2143 453,2138 456,2134 461,2131 473,2121 485,2111 496,2101 565,2043 646,2031 730,2040 771,2044 811,2053 851,2059 L 851,2059 C 851,2059 851,2059 851,2059 858,2059 864,2060 870,2063 884,2074 885,2074 893,2057 898,2046 902,2035 915,2030 L 915,2030 915,2030 C 917,2029 919,2027 920,2024 922,2022 923,2019 923,2017 923,2015 922,2013 922,2012 920,2005 918,1998 916,1992 913,1980 918,1972 931,1975 935,1975 940,1977 944,1971 944,1979 942,1983 947,1988 963,2003 978,2020 996,2035 998,2037 1007,2035 1004,2044 L 1004,2044 C 1003,2046 1002,2048 1001,2050 1000,2053 998,2055 996,2056 989,2061 983,2066 976,2070 L 976,2070 C 975,2071 974,2072 972,2073 952,2085 933,2098 915,2113 900,2126 884,2139 868,2151 L 868,2151 C 861,2155 855,2161 851,2168 850,2170 849,2172 848,2174 L 848,2174 C 844,2189 842,2204 841,2220 840,2241 834,2260 833,2281 830,2311 824,2340 798,2356 798,2355 798,2352 798,2351 786,2347 775,2342 762,2338 L 762,2338 C 762,2338 762,2338 761,2338 760,2338 760,2338 759,2338 758,2339 758,2339 757,2340 757,2340 757,2341 757,2341 L 757,2341 C 757,2342 757,2342 757,2342 757,2344 757,2345 757,2346 758,2347 759,2347 760,2348 L 760,2348 C 764,2351 769,2350 774,2351 768,2353 762,2359 756,2353 L 756,2353 C 754,2352 753,2351 752,2349 750,2347 750,2344 750,2342 750,2340 750,2339 750,2337 742,2340 741,2348 736,2351 722,2360 732,2363 739,2366 L 837,2406 C 841,2408 845,2410 848,2405 853,2398 857,2400 864,2403 902,2419 940,2435 978,2451 981,2453 987,2453 986,2459 984,2465 980,2463 976,2463 L 976,2463 C 976,2463 975,2463 975,2463 956,2463 936,2461 917,2457 L 917,2457 C 865,2444 814,2428 763,2408 665,2373 573,2323 481,2275 L 481,2275 C 480,2274 480,2274 479,2274 477,2273 475,2271 474,2268 473,2267 473,2266 472,2264 470,2255 465,2258 460,2262 L 460,2262 C 459,2263 458,2264 458,2265 457,2267 456,2270 456,2272 456,2274 457,2277 458,2279 458,2279 458,2280 459,2280 L 459,2280 C 464,2288 471,2296 479,2302 L 479,2302 C 489,2309 499,2316 510,2322 518,2326 526,2330 534,2335 L 534,2335 C 538,2337 542,2340 546,2342 615,2382 687,2416 761,2445 792,2456 824,2465 856,2475 866,2478 869,2482 864,2493 L 864,2493 C 850,2520 839,2548 829,2578 824,2595 814,2596 801,2598 794,2598 787,2598 780,2598 758,2598 736,2598 713,2596 L 713,2596 C 719,2600 725,2602 731,2604 L 731,2604 C 746,2609 761,2613 776,2615 L 776,2615 C 794,2617 812,2619 830,2619 836,2619 842,2618 848,2618 906,2618 915,2617 926,2609 L 926,2609 C 933,2604 939,2598 944,2591 930,2593 916,2595 902,2595 888,2595 876,2593 863,2592 856,2592 854,2589 857,2581 868,2557 878,2532 888,2507 892,2500 895,2497 902,2503 L 902,2503 C 903,2503 904,2504 906,2505 912,2509 920,2511 928,2511 932,2511 937,2510 941,2509 965,2503 984,2487 1007,2480 1018,2477 1018,2466 1009,2456 1003,2450 994,2448 988,2442 L 988,2442 C 984,2438 980,2435 975,2431 969,2428 963,2426 956,2424 946,2422 936,2417 934,2407 L 934,2407 C 932,2389 931,2371 931,2352 931,2352 931,2351 931,2350 931,2318 935,2286 917,2257 L 917,2257 C 916,2256 915,2253 915,2251 L 915,2251 C 915,2251 915,2250 915,2249 915,2248 915,2247 915,2246 916,2245 917,2244 917,2244 L 917,2244 C 931,2231 946,2220 961,2210 L 961,2210 C 990,2194 1020,2181 1050,2169 L 1050,2169 C 1054,2168 1057,2167 1061,2165 1067,2162 1072,2156 1076,2150 1079,2145 1081,2139 1081,2132 L 1081,2132 C 1083,2123 1087,2114 1091,2106 1092,2104 1094,2102 1095,2100 1109,2076 1131,2059 1144,2034 1162,2004 1169,1970 1183,1939 L 1183,1939 C 1186,1931 1187,1924 1187,1916 1187,1905 1185,1894 1179,1885 1174,1876 1166,1868 1157,1863 1156,1862 1155,1861 1154,1861 1147,1858 1145,1854 1148,1847 L 1148,1847 C 1150,1841 1151,1834 1151,1828 1151,1823 1151,1819 1150,1815 1144,1782 1125,1766 1094,1773 1083,1775 1071,1786 1073,1792 L 1073,1792 C 1074,1802 1075,1812 1075,1823 1075,1824 1075,1826 1075,1827 L 1075,1827 C 1076,1839 1078,1851 1082,1862 1066,1853 1049,1858 1036,1847 1022,1837 1014,1829 1004,1821 994,1813 995,1800 1008,1796 L 1008,1796 Z M 862,2023 C 862,2042 857,2046 840,2043 807,2037 775,2031 742,2026 L 742,2026 C 739,2026 736,2025 733,2023 730,2021 727,2019 725,2015 723,2013 723,2011 722,2009 718,1993 712,1978 707,1963 706,1959 705,1953 701,1954 696,1954 698,1960 698,1964 698,1980 698,1995 698,2010 698,2018 695,2023 685,2024 L 685,2024 C 652,2025 619,2030 587,2037 L 587,2037 C 585,2038 583,2038 582,2038 579,2038 576,2038 574,2036 572,2035 570,2033 569,2031 568,2030 568,2030 568,2029 564,2022 560,2016 555,2009 553,2007 551,2004 548,2005 545,2006 545,2010 546,2014 547,2022 549,2031 550,2038 L 550,2038 C 551,2040 551,2042 551,2043 551,2046 551,2048 550,2050 549,2052 547,2053 545,2054 545,2055 544,2055 544,2055 L 544,2055 C 539,2057 535,2060 531,2062 515,2071 501,2081 487,2093 481,2098 478,2097 474,2090 L 474,2090 C 472,2085 470,2080 467,2076 465,2072 463,2068 460,2065 L 460,2065 C 459,2063 457,2061 456,2060 453,2053 451,2047 451,2039 451,2032 453,2025 456,2019 457,2018 457,2017 458,2016 474,1987 497,1964 515,1937 548,1887 596,1855 642,1820 L 642,1820 C 672,1794 704,1770 738,1748 770,1730 804,1713 838,1695 843,1693 846,1693 846,1701 846,1793 862,1885 862,1978 862,1993 862,2008 862,2023 L 862,2023 Z M 874,1978 C 870,1940 871,1901 868,1862 864,1807 859,1752 859,1698 L 859,1698 C 858,1696 858,1695 858,1694 858,1691 859,1688 860,1685 L 860,1685 C 861,1685 861,1684 861,1684 862,1682 863,1681 865,1680 866,1679 868,1678 870,1678 875,1678 873,1685 873,1688 874,1708 874,1728 875,1747 L 875,1747 C 877,1785 878,1822 878,1859 878,1899 877,1938 874,1978 L 874,1978 874,1978 Z M 935,2502 L 935,2502 C 932,2503 929,2503 926,2503 921,2503 916,2502 911,2499 909,2498 907,2496 905,2494 L 905,2494 C 905,2494 905,2494 904,2494 904,2494 903,2493 903,2492 902,2492 902,2491 902,2490 902,2489 902,2488 902,2488 904,2486 906,2486 908,2486 L 958,2494 958,2494 C 950,2496 942,2499 935,2503 L 935,2502 935,2502 Z M 875,2379 C 853,2379 853,2379 858,2358 L 858,2358 C 865,2335 872,2313 881,2291 L 881,2291 C 888,2311 893,2331 897,2352 899,2375 894,2380 875,2380 L 875,2379 875,2379 Z M 1015,1896 C 1033,1901 1049,1907 1066,1912 1075,1914 1079,1916 1071,1925 L 1071,1925 C 1066,1930 1063,1936 1059,1942 1054,1951 1050,1960 1048,1969 L 1048,1969 C 1046,1975 1043,1980 1041,1985 1038,1990 1034,1995 1031,1999 1027,2005 1022,2002 1017,1999 L 1017,1999 C 1013,1997 1008,1995 1003,1992 989,1984 976,1974 964,1962 L 964,1962 C 955,1955 946,1949 937,1943 L 937,1943 C 936,1943 935,1943 935,1942 932,1940 930,1938 928,1935 927,1933 926,1930 926,1927 926,1924 927,1921 928,1918 929,1916 931,1914 933,1912 L 933,1912 C 935,1911 937,1908 938,1906 940,1903 941,1900 941,1896 941,1896 941,1895 941,1895 L 941,1895 C 941,1892 941,1890 941,1887 941,1880 942,1872 944,1864 944,1861 946,1856 944,1854 942,1851 938,1849 942,1844 946,1839 952,1829 961,1826 966,1826 966,1831 968,1835 L 968,1835 C 972,1849 978,1862 985,1874 L 985,1874 C 990,1882 996,1888 1004,1892 1007,1895 1011,1896 1015,1897 L 1015,1896 1015,1896 Z M 985,1777 L 985,1777 C 982,1774 979,1771 977,1767 975,1764 973,1759 972,1755 L 972,1755 C 972,1751 971,1748 969,1744 967,1741 964,1738 960,1736 959,1735 957,1734 956,1734 L 956,1734 C 955,1733 954,1733 954,1733 952,1732 950,1730 949,1728 948,1727 947,1725 947,1724 L 947,1724 C 943,1709 942,1693 942,1678 942,1666 943,1654 945,1642 L 945,1642 C 945,1640 946,1638 947,1636 948,1633 951,1631 953,1630 954,1629 954,1629 955,1629 977,1615 1001,1603 1021,1588 L 1021,1588 C 1024,1585 1028,1583 1031,1581 1051,1570 1073,1563 1095,1560 1098,1560 1100,1558 1103,1558 1119,1557 1126,1565 1119,1581 1111,1603 1102,1625 1092,1647 1077,1683 1063,1719 1048,1754 L 1048,1754 C 1048,1756 1047,1758 1046,1760 1044,1764 1042,1766 1039,1768 1027,1776 1021,1774 1019,1760 L 1019,1760 C 1018,1754 1015,1748 1012,1742 L 1012,1742 C 1009,1750 1008,1758 1008,1766 1008,1767 1008,1768 1008,1768 L 1008,1768 C 1008,1769 1008,1770 1008,1770 1008,1773 1007,1775 1006,1777 1005,1780 1003,1782 1001,1783 1000,1783 1000,1783 999,1784 992,1787 989,1782 985,1778 L 985,1777 985,1777 Z"/>
        <path fill="rgb(38,46,42)" stroke="none" d="M 2714,426 L 2714,426 C 2710,427 2706,429 2702,431 2696,434 2691,439 2687,444 L 2391,723 2391,723 C 2387,726 2384,730 2382,735 2381,736 2380,737 2380,738 L 2374,731 2669,453 C 2681,442 2691,431 2703,420 L 2714,426 2714,426 Z"/>
        <path fill="rgb(38,46,42)" stroke="none" d="M 2917,629 L 2917,629 C 2910,639 2901,648 2890,654 2888,655 2886,656 2884,656 2852,680 2818,702 2785,724 L 2785,724 C 2783,726 2781,728 2779,729 2775,731 2771,733 2767,734 L 2766,733 C 2815,696 2865,660 2917,629 L 2917,629 2917,629 Z"/>
        <path fill="rgb(38,46,42)" stroke="none" d="M 2647,817 L 2647,817 2647,817 2647,817 C 2650,813 2652,810 2656,807 2692,782 2726,754 2766,732 L 2767,734 2767,734 C 2758,744 2747,752 2736,759 2734,760 2732,761 2731,762 L 2731,762 C 2704,782 2676,801 2647,817 L 2647,817 Z"/>
        <path fill="rgb(38,46,42)" stroke="none" d="M 3017,1190 L 3017,1190 C 3016,1190 3016,1190 3015,1190 3003,1190 2991,1192 2980,1194 L 2980,1194 C 2950,1200 2921,1209 2892,1221 2887,1223 2882,1227 2876,1223 2864,1216 2841,1220 2839,1231 2836,1253 2816,1251 2804,1260 2796,1265 2790,1262 2786,1255 2777,1243 2768,1232 2760,1220 2731,1174 2683,1144 2650,1102 L 2650,1102 C 2649,1100 2648,1098 2646,1098 2644,1096 2641,1096 2639,1096 2638,1096 2637,1096 2636,1096 2605,1101 2575,1090 2544,1089 L 2535,1089 2516,1089 2516,1089 C 2510,1088 2504,1086 2498,1083 2496,1081 2493,1080 2491,1078 L 2491,1078 C 2488,1076 2486,1075 2484,1074 2445,1051 2401,1037 2356,1032 L 2356,1032 C 2355,1032 2355,1032 2353,1031 2352,1030 2352,1030 2351,1029 2350,1028 2350,1027 2350,1026 2344,997 2335,968 2354,939 L 2354,939 C 2359,934 2363,927 2367,921 2374,909 2379,897 2382,883 L 2382,883 2382,883 C 2382,881 2382,878 2383,876 2385,874 2387,872 2389,871 2391,870 2393,869 2396,869 2397,869 2398,869 2399,870 L 2399,870 C 2419,872 2438,879 2455,889 2465,894 2473,901 2481,908 L 2481,908 C 2485,911 2489,914 2493,917 2507,924 2521,928 2536,929 2523,913 2532,906 2544,900 2556,893 2569,885 2579,878 2590,871 2607,865 2612,853 L 2612,853 C 2612,852 2613,852 2613,851 2620,839 2631,828 2643,821 2644,820 2646,820 2647,819 2634,821 2624,837 2608,827 2608,827 2604,829 2603,830 2590,854 2564,861 2544,875 L 2544,875 C 2542,877 2540,878 2537,880 2526,886 2514,889 2501,889 2489,889 2476,886 2466,880 2465,879 2463,879 2462,878 2452,872 2443,867 2433,862 2422,857 2419,850 2430,842 2479,804 2527,766 2576,728 2582,724 2586,717 2596,723 2600,725 2633,701 2631,696 2627,684 2637,682 2643,676 2652,669 2661,662 2670,654 L 2670,654 C 2666,656 2661,658 2656,661 2650,665 2645,669 2639,673 2633,678 2623,687 2619,684 2604,674 2592,686 2581,686 L 2581,686 C 2582,689 2583,693 2583,697 2583,703 2581,709 2578,714 2577,717 2575,719 2573,721 2526,759 2479,796 2432,832 L 2432,832 C 2431,833 2430,834 2429,834 2427,835 2425,836 2423,836 2422,836 2420,835 2418,834 2417,833 2415,833 2414,831 L 2414,831 C 2412,829 2410,827 2407,825 2402,822 2397,821 2391,821 2390,821 2389,821 2387,821 L 2387,821 C 2383,822 2378,823 2373,823 2359,823 2346,819 2334,812 2332,811 2330,810 2329,809 2321,803 2316,801 2326,792 2346,775 2363,757 2381,739 L 2375,732 2375,732 C 2374,732 2372,732 2370,732 2366,732 2362,733 2357,735 2355,736 2352,739 2350,742 L 2314,777 2314,777 C 2312,779 2310,781 2307,783 2303,785 2299,786 2295,786 2294,786 2293,786 2292,786 2279,784 2275,789 2275,804 L 2275,804 C 2275,815 2272,826 2266,837 2261,844 2255,851 2248,856 L 2248,856 C 2245,860 2242,863 2238,865 2230,869 2221,872 2213,872 2207,872 2200,870 2195,868 L 2195,868 C 2189,867 2183,866 2177,866 2167,866 2157,868 2148,873 2127,881 2109,894 2108,918 L 2108,918 C 2107,922 2107,925 2107,930 2107,941 2110,952 2115,962 2120,970 2127,978 2136,984 L 2136,984 C 2140,986 2143,990 2145,994 2148,998 2149,1003 2149,1009 L 2149,1009 C 2149,1018 2145,1028 2133,1025 2121,1021 2118,1028 2118,1036 L 2118,1036 C 2118,1037 2118,1037 2118,1037 2118,1040 2118,1042 2116,1044 2116,1046 2114,1047 2113,1048 L 2113,1048 C 2107,1053 2102,1059 2098,1066 2092,1075 2089,1086 2089,1097 2089,1098 2089,1098 2089,1098 L 2089,1098 C 2088,1134 2079,1169 2062,1201 L 2062,1201 C 2058,1207 2056,1215 2056,1223 2056,1231 2059,1240 2064,1248 2066,1251 2068,1255 2071,1258 2086,1273 2100,1267 2115,1258 2120,1254 2129,1252 2118,1244 L 2118,1244 C 2117,1243 2116,1242 2116,1241 2115,1240 2115,1238 2115,1237 2115,1235 2115,1234 2116,1233 2116,1232 2116,1232 2117,1232 2121,1225 2124,1232 2128,1233 2137,1237 2141,1230 2145,1224 L 2145,1224 C 2144,1223 2143,1223 2141,1222 2138,1220 2136,1218 2134,1215 2133,1212 2132,1208 2132,1205 2132,1202 2133,1198 2134,1196 2135,1195 2135,1194 2136,1193 2146,1180 2156,1167 2166,1153 2163,1175 2170,1198 2153,1217 L 2153,1217 C 2153,1217 2154,1218 2154,1219 2161,1211 2176,1209 2175,1198 L 2175,1198 C 2175,1196 2175,1195 2175,1193 2175,1186 2176,1179 2178,1173 2179,1169 2177,1162 2183,1162 L 2183,1162 C 2185,1162 2187,1162 2189,1163 2190,1164 2192,1166 2193,1168 2193,1168 2194,1169 2194,1170 L 2194,1170 C 2195,1171 2195,1172 2196,1172 2204,1186 2213,1200 2224,1212 2229,1218 2233,1230 2244,1218 L 2244,1218 C 2244,1218 2245,1217 2245,1217 2246,1217 2247,1216 2248,1216 2249,1216 2250,1217 2251,1217 2252,1218 2253,1218 2254,1220 2254,1220 2254,1220 2254,1221 2261,1240 2284,1248 2288,1270 L 2288,1270 C 2292,1279 2296,1289 2301,1297 2304,1303 2308,1308 2312,1314 L 2329,1328 C 2338,1332 2343,1341 2350,1347 2354,1347 2360,1350 2364,1348 2379,1340 2390,1348 2402,1355 L 2402,1355 C 2403,1356 2405,1357 2406,1357 2426,1369 2448,1377 2471,1381 2487,1384 2503,1386 2519,1389 L 2519,1389 C 2522,1389 2524,1390 2526,1391 2529,1392 2531,1394 2532,1397 2533,1398 2534,1400 2534,1402 2536,1409 2528,1411 2523,1414 L 2523,1414 C 2466,1448 2411,1485 2358,1525 2350,1531 2337,1537 2341,1548 2344,1559 2358,1558 2369,1560 L 2369,1560 C 2387,1562 2404,1563 2422,1563 2460,1563 2498,1558 2535,1549 2562,1543 2570,1549 2571,1578 2571,1581 2571,1585 2571,1588 2571,1592 2570,1595 2574,1597 2578,1599 2580,1597 2583,1594 L 2583,1594 C 2589,1590 2595,1584 2599,1577 2604,1567 2607,1557 2607,1546 2607,1545 2607,1543 2606,1542 2605,1529 2609,1524 2620,1521 L 2620,1521 C 2712,1488 2800,1446 2884,1398 2907,1385 2930,1371 2952,1357 L 2952,1357 2977,1342 2977,1342 C 2985,1337 2992,1331 3000,1324 L 3000,1324 C 3008,1317 3015,1310 3021,1302 L 3027,1296 3027,1296 C 3031,1291 3035,1286 3038,1281 3046,1266 3052,1249 3053,1232 3057,1205 3045,1191 3017,1190 L 3017,1190 Z M 2282,914 C 2273,916 2267,925 2260,932 2256,936 2252,942 2246,934 2240,926 2242,923 2250,919 2253,918 2257,917 2257,912 2251,905 2238,905 2236,895 2234,885 2248,881 2252,872 L 2252,872 C 2253,870 2254,868 2255,866 2265,850 2276,836 2289,822 2293,818 2297,813 2304,816 L 2304,816 C 2315,818 2326,823 2336,829 2342,832 2346,835 2350,838 L 2350,838 2350,838 C 2352,839 2353,840 2353,841 2354,843 2354,844 2354,845 2354,847 2354,848 2353,850 2353,851 2352,852 2350,853 L 2350,853 C 2327,872 2316,905 2282,914 L 2282,914 Z M 2420,1091 C 2418,1083 2403,1092 2400,1080 2399,1074 2388,1068 2394,1063 L 2394,1063 C 2396,1060 2399,1057 2402,1056 2406,1053 2411,1052 2415,1052 2416,1052 2417,1052 2418,1052 L 2418,1052 C 2427,1054 2436,1057 2444,1062 2456,1068 2465,1078 2472,1089 2473,1091 2474,1094 2475,1096 L 2442,1100 C 2433,1102 2424,1105 2420,1091 L 2420,1091 Z M 2740,1292 C 2691,1317 2643,1344 2594,1370 L 2594,1370 C 2593,1370 2593,1371 2593,1371 2591,1372 2589,1373 2586,1373 2584,1373 2582,1372 2580,1371 2580,1371 2580,1370 2579,1370 L 2579,1370 C 2546,1351 2515,1329 2486,1304 L 2486,1304 C 2483,1302 2481,1300 2478,1299 2466,1291 2451,1287 2437,1284 2424,1282 2420,1271 2428,1260 L 2428,1260 C 2432,1253 2437,1248 2443,1245 2450,1241 2457,1239 2465,1239 2466,1239 2467,1239 2468,1239 2499,1230 2528,1217 2562,1225 2572,1227 2593,1233 2585,1206 2583,1199 2612,1192 2622,1198 L 2622,1198 C 2633,1206 2644,1215 2654,1225 L 2654,1225 C 2663,1234 2673,1242 2683,1248 2692,1253 2702,1257 2711,1260 L 2711,1260 C 2717,1262 2722,1264 2726,1267 2733,1270 2738,1274 2742,1279 2747,1284 2748,1288 2740,1292 L 2740,1292 Z"/>
        <path fill="rgb(38,46,42)" stroke="none" d="M 2774,2601 C 2728,2655 2686,2709 2637,2757 2637,2761 2635,2765 2630,2765 L 2630,2765 2630,2765 C 2630,2765 2630,2766 2629,2766 2629,2767 2629,2767 2628,2767 2628,2768 2627,2768 2627,2768 2626,2768 2626,2768 2626,2768 L 2626,2768 C 2620,2769 2617,2775 2612,2779 L 2612,2779 C 2507,2880 2393,2973 2272,3056 L 2272,3056 C 2209,3100 2143,3141 2076,3180 2034,3205 1990,3228 1947,3250 L 1947,3250 C 1948,3253 1949,3256 1949,3258 1949,3263 1947,3268 1945,3272 1945,3272 1945,3272 1944,3273 1953,3276 1968,3265 1969,3282 1981,3280 1992,3276 1993,3261 1993,3257 2000,3252 2006,3253 2012,3255 2016,3251 2021,3251 L 2021,3251 C 2037,3243 2052,3234 2067,3226 2152,3176 2234,3122 2313,3062 L 2313,3062 C 2234,3122 2152,3176 2067,3226 2052,3234 2037,3243 2021,3251 2023,3257 2028,3255 2032,3257 2051,3263 2070,3250 2090,3257 2111,3263 2134,3260 2156,3265 L 2245,3211 2321,3166 2331,3160 C 2460,3082 2582,2995 2681,2881 2726,2828 2766,2772 2781,2705 L 2781,2705 C 2785,2691 2787,2677 2787,2664 2787,2642 2783,2620 2774,2601 L 2774,2601 Z"/>
        <path fill="rgb(38,46,42)" stroke="none" d="M 2337,2916 C 2331,2909 2320,2905 2322,2893 2323,2887 2314,2888 2309,2887 2307,2880 2318,2879 2315,2872 L 2315,2872 C 2331,2859 2325,2842 2323,2826 2317,2717 2279,2615 2257,2508 2252,2484 2246,2460 2241,2436 2241,2436 2240,2435 2240,2434 2240,2419 2221,2404 2242,2390 2255,2381 2266,2367 2284,2365 L 2284,2365 C 2287,2364 2290,2363 2292,2361 2299,2357 2305,2352 2309,2345 2312,2340 2314,2335 2314,2328 2314,2324 2311,2321 2307,2319 L 2307,2319 C 2305,2317 2303,2316 2300,2315 2289,2308 2277,2305 2265,2305 2262,2305 2259,2305 2256,2306 L 2256,2306 C 2255,2306 2254,2306 2254,2306 2239,2306 2225,2303 2211,2296 L 2211,2296 C 2211,2296 2210,2296 2210,2295 2208,2294 2207,2293 2206,2292 2205,2290 2205,2289 2205,2288 L 2167,2122 2167,2122 C 2167,2121 2167,2121 2167,2120 2167,2119 2167,2119 2167,2118 L 2167,2118 C 2159,2098 2153,2078 2149,2058 L 2149,2058 C 2149,2055 2148,2053 2147,2051 2145,2049 2143,2046 2140,2044 2139,2044 2138,2043 2136,2043 2056,2012 1977,1978 1896,1948 1934,2032 1971,2116 2009,2200 L 2009,2200 C 2013,2211 2018,2221 2024,2231 2024,2231 2024,2231 2024,2232 2033,2245 2027,2247 2015,2245 L 2007,2244 C 2001,2245 1996,2247 1990,2243 L 1984,2245 C 1977,2249 1970,2250 1965,2242 L 1965,2242 C 1946,2245 1928,2252 1912,2261 1904,2266 1896,2271 1889,2277 L 1889,2277 C 1873,2290 1856,2301 1839,2311 1838,2312 1837,2312 1836,2313 1828,2318 1824,2317 1819,2309 1780,2251 1744,2192 1710,2132 L 1710,2132 C 1658,2041 1613,1947 1573,1851 1571,1844 1559,1837 1566,1831 1573,1825 1582,1833 1590,1836 1645,1856 1698,1879 1753,1896 L 1753,1896 C 1754,1896 1755,1896 1756,1896 1757,1896 1758,1896 1759,1896 L 1759,1896 C 1758,1896 1757,1896 1756,1896 1755,1896 1754,1896 1753,1896 1764,1900 1774,1906 1784,1910 1820,1922 1854,1939 1890,1948 L 1893,1944 2139,2038 2139,2038 C 2139,2036 2139,2034 2139,2032 2139,2028 2138,2023 2136,2019 L 2136,2019 C 2096,1886 2041,1759 1972,1640 1964,1625 1955,1610 1946,1595 L 1946,1595 C 1943,1591 1939,1587 1935,1585 1933,1584 1933,1584 1931,1583 L 1691,1454 1697,1454 C 1776,1493 1853,1534 1934,1573 L 1799,1355 1799,1355 C 1791,1346 1785,1336 1779,1326 1777,1323 1776,1321 1774,1317 1752,1282 1730,1247 1708,1212 L 1708,1212 C 1706,1210 1705,1208 1703,1206 1673,1159 1643,1112 1613,1066 L 1613,1066 C 1594,1033 1568,1006 1537,985 1530,980 1524,977 1535,970 L 1535,970 C 1536,969 1537,969 1538,967 1538,966 1539,965 1539,964 1539,963 1538,961 1538,960 1537,959 1536,958 1535,957 L 1535,957 C 1535,957 1534,956 1533,956 1531,955 1530,954 1529,954 1527,954 1526,955 1524,956 1524,956 1523,957 1522,957 1502,979 1476,994 1456,1016 L 1456,1016 C 1456,1016 1456,1015 1456,1014 1456,1013 1456,1012 1456,1012 1456,1007 1461,1001 1451,1000 1442,998 1444,1006 1443,1010 L 1443,1010 C 1432,1059 1423,1108 1418,1158 L 1418,1158 C 1415,1198 1413,1238 1413,1278 1413,1283 1413,1288 1413,1293 1416,1345 1420,1397 1428,1449 1439,1511 1452,1572 1469,1633 L 1469,1633 C 1513,1788 1573,1938 1648,2081 1651,2087 1653,2093 1656,2098 1686,2151 1716,2204 1746,2255 1761,2279 1776,2303 1791,2325 1796,2333 1796,2337 1787,2341 L 1787,2341 C 1784,2343 1780,2345 1778,2347 1759,2357 1741,2366 1721,2374 1717,2387 1700,2381 1694,2391 L 1677,2367 1677,2367 C 1674,2364 1669,2361 1665,2359 1649,2350 1632,2345 1614,2345 1598,2345 1581,2349 1567,2356 L 1548,2374 1542,2390 1542,2408 1542,2408 C 1544,2422 1549,2436 1556,2449 1557,2450 1558,2451 1558,2452 1563,2459 1563,2462 1554,2464 L 1554,2464 C 1542,2468 1530,2473 1518,2479 L 1518,2479 C 1515,2480 1513,2481 1511,2483 1493,2493 1479,2507 1469,2525 1464,2533 1461,2541 1458,2549 L 1447,2603 C 1447,2611 1446,2620 1445,2628 L 1445,2628 C 1445,2632 1445,2635 1445,2639 1445,2651 1444,2663 1443,2674 L 1443,2695 1441,2713 1441,2713 C 1438,2735 1437,2757 1436,2779 1438,2797 1432,2813 1448,2830 1457,2839 1450,2857 1451,2872 1452,2882 1454,2893 1455,2903 1475,2963 1523,2984 1584,2988 L 1584,2988 C 1590,2989 1597,2989 1603,2989 1674,2989 1745,2976 1811,2950 1824,2945 1829,2944 1832,2960 L 1832,2960 C 1836,2973 1841,2986 1848,2998 1855,3010 1863,3020 1873,3030 L 1873,3030 C 1896,3054 1918,3079 1939,3105 1942,3109 1947,3112 1946,3118 L 1946,3118 C 1946,3119 1946,3119 1946,3119 1949,3120 1951,3123 1953,3126 1954,3128 1955,3130 1955,3133 L 1953,3133 1964,3170 1980,3188 C 1985,3185 1990,3181 1996,3178 2049,3150 2102,3121 2152,3087 2157,3084 2166,3081 2162,3073 2158,3065 2150,3067 2143,3069 L 2143,3069 C 2114,3077 2084,3082 2054,3082 L 2054,3082 C 2052,3082 2051,3083 2049,3083 2040,3083 2031,3080 2022,3075 2014,3071 2007,3064 2002,3056 2002,3054 2001,3053 2000,3052 1974,3001 1952,2948 1928,2895 1900,2832 1899,2831 1830,2826 L 1830,2826 C 1790,2822 1751,2820 1711,2820 1691,2820 1670,2820 1650,2821 1645,2821 1640,2823 1635,2823 1630,2823 1626,2829 1624,2822 1622,2816 1619,2811 1627,2808 1631,2807 1635,2803 1633,2800 1624,2790 1633,2776 1630,2770 1619,2752 1639,2737 1630,2721 1630,2720 1630,2718 1633,2718 L 1633,2718 1633,2718 C 1633,2717 1633,2716 1633,2715 1633,2711 1634,2706 1636,2702 1637,2701 1637,2700 1638,2700 L 1638,2700 C 1638,2699 1638,2699 1639,2698 1654,2671 1664,2642 1667,2612 1739,2637 1810,2657 1884,2625 L 1884,2625 C 1886,2624 1887,2623 1888,2622 1891,2621 1894,2620 1897,2620 1920,2609 1942,2599 1965,2588 1969,2586 1971,2584 1975,2589 2014,2636 2053,2682 2092,2730 2092,2730 2092,2732 2092,2732 2095,2732 2095,2734 2095,2736 L 2095,2736 C 2103,2738 2105,2745 2110,2750 2164,2809 2217,2868 2270,2928 2276,2935 2281,2939 2277,2951 2273,2964 2283,2979 2287,2994 L 2362,2945 C 2354,2935 2345,2926 2337,2916 L 2337,2916 Z M 1546,1779 L 1546,1779 C 1545,1777 1544,1776 1543,1775 1541,1771 1540,1767 1540,1762 L 1540,1762 C 1539,1761 1538,1760 1537,1759 1535,1755 1534,1751 1534,1746 L 1534,1746 1534,1746 1534,1746 C 1516,1704 1502,1660 1491,1615 L 1491,1615 C 1454,1492 1435,1364 1435,1236 1435,1216 1435,1197 1436,1177 1438,1145 1442,1113 1445,1082 L 1445,1082 C 1445,1078 1446,1075 1448,1072 1448,1072 1449,1071 1449,1070 L 1449,1070 C 1449,1066 1449,1062 1449,1058 1449,1043 1452,1029 1457,1016 1457,1027 1462,1031 1472,1022 1488,1007 1505,993 1524,976 1522,999 1519,1021 1517,1044 1517,1051 1517,1058 1517,1066 1519,1202 1602,1391 1602,1391 L 1602,1391 1533,1360 1533,1360 1503,1346 1496,1344 1445,1321 1445,1321 1442,1320 1445,1334 1533,1375 1533,1375 C 1576,1396 1619,1419 1661,1441 1664,1448 1666,1456 1669,1462 1710,1552 1752,1642 1793,1731 1825,1798 1856,1865 1888,1933 L 1888,1933 C 1866,1929 1845,1923 1825,1913 L 1825,1913 C 1806,1903 1786,1896 1766,1892 L 1766,1892 C 1765,1891 1765,1891 1765,1891 1748,1882 1731,1874 1713,1869 1679,1855 1644,1842 1610,1829 1592,1823 1574,1823 1558,1812 L 1558,1812 C 1557,1810 1556,1809 1556,1807 1550,1799 1547,1789 1546,1779 L 1546,1779 Z M 2250,2327 C 2258,2329 2260,2335 2255,2342 2249,2352 2242,2362 2235,2372 2227,2382 2225,2377 2223,2369 2219,2351 2215,2334 2210,2313 L 2250,2327 2250,2327 Z M 1664,2518 L 1664,2518 C 1659,2513 1654,2508 1649,2504 1663,2504 1666,2496 1672,2485 L 1672,2485 C 1675,2472 1680,2458 1687,2446 L 1687,2446 C 1687,2444 1688,2443 1688,2441 1688,2439 1687,2438 1687,2436 1686,2436 1686,2435 1686,2435 1679,2423 1685,2416 1697,2413 L 1697,2413 C 1701,2409 1704,2405 1709,2402 1713,2400 1717,2398 1721,2397 L 1799,2355 C 1803,2353 1808,2349 1811,2355 1820,2369 1828,2384 1837,2398 1837,2398 1836,2401 1835,2403 L 1835,2403 C 1834,2406 1833,2409 1831,2412 1829,2415 1827,2418 1825,2420 L 1825,2420 C 1789,2451 1750,2479 1709,2503 1699,2509 1688,2515 1677,2520 1672,2522 1668,2524 1664,2518 L 1664,2518 Z M 1943,2559 L 1943,2559 C 1924,2569 1903,2574 1882,2575 1856,2578 1831,2581 1805,2585 L 1805,2585 C 1803,2585 1801,2585 1799,2585 1794,2585 1790,2584 1786,2582 L 1786,2582 C 1768,2573 1749,2567 1729,2562 L 1729,2562 C 1756,2539 1781,2513 1803,2486 1820,2467 1847,2463 1868,2450 1872,2447 1874,2452 1876,2455 1899,2486 1922,2517 1946,2547 1951,2554 1949,2556 1943,2559 L 1943,2559 Z M 1882,2397 L 1882,2397 C 1867,2379 1853,2360 1840,2340 1836,2335 1838,2332 1842,2330 1869,2318 1891,2297 1922,2293 1930,2292 1937,2293 1936,2301 1933,2321 1943,2338 1942,2357 L 1942,2357 C 1962,2411 1975,2467 1982,2525 L 1982,2525 C 1947,2484 1913,2441 1882,2397 L 1882,2397 1882,2397 Z M 2178,2746 C 2125,2690 2075,2633 2025,2575 2018,2567 2018,2563 2026,2556 2046,2542 2065,2526 2084,2512 2087,2509 2091,2507 2091,2503 L 2082,2494 2082,2494 C 2081,2494 2080,2495 2080,2495 2066,2503 2052,2513 2040,2524 2026,2535 2012,2529 1998,2528 1993,2528 1994,2524 1993,2521 1986,2489 1976,2457 1972,2424 1967,2385 1961,2346 1953,2307 L 1953,2307 C 1952,2305 1952,2302 1952,2300 1952,2294 1953,2289 1956,2284 1959,2280 1962,2276 1967,2273 1970,2272 1972,2271 1975,2270 L 1975,2270 C 1984,2265 1995,2263 2005,2263 2013,2263 2022,2265 2030,2268 L 2036,2264 C 2035,2274 2050,2274 2048,2285 L 2106,2446 C 2109,2452 2112,2459 2115,2466 2149,2442 2181,2415 2214,2390 2217,2387 2221,2380 2226,2386 2233,2393 2229,2396 2222,2401 2187,2427 2154,2454 2121,2481 2158,2587 2196,2693 2234,2801 2214,2781 2196,2765 2178,2746 L 2178,2746 2178,2746 Z M 2302,2914 C 2296,2909 2288,2907 2293,2899 2294,2898 2299,2895 2299,2896 2305,2900 2304,2906 2303,2914 L 2302,2914 2302,2914 Z M 2305,2865 C 2301,2868 2306,2871 2303,2875 2287,2864 2277,2847 2262,2834 2284,2831 2284,2831 2299,2852 2302,2851 2301,2849 2300,2847 2295,2829 2295,2829 2316,2818 L 2316,2818 C 2318,2826 2319,2835 2319,2843 2319,2853 2318,2863 2314,2872 2308,2874 2310,2867 2305,2865 L 2305,2865 2305,2865 Z"/>
        <path fill="rgb(38,46,42)" stroke="none" d="M 3071,2446 L 2993,2446 2993,2446 C 2969,2447 2944,2447 2920,2447 2829,2447 2738,2442 2647,2434 L 2647,2434 C 2620,2431 2593,2425 2567,2414 2559,2411 2550,2406 2552,2395 2554,2384 2564,2382 2572,2380 L 2572,2380 C 2574,2380 2576,2379 2578,2379 L 2578,2379 C 2587,2378 2597,2377 2607,2377 2617,2377 2627,2378 2636,2379 L 2636,2379 C 2638,2379 2639,2379 2640,2379 2643,2379 2646,2379 2648,2377 2651,2376 2653,2374 2654,2371 2655,2370 2655,2369 2656,2368 L 2656,2368 C 2658,2360 2662,2352 2666,2345 2677,2326 2692,2311 2710,2298 L 2710,2298 C 2712,2297 2713,2295 2714,2293 2715,2292 2716,2291 2716,2289 2746,2219 2776,2149 2805,2078 2807,2075 2809,2071 2807,2067 2800,2055 2808,2048 2816,2042 L 2816,2042 C 2819,2038 2823,2035 2825,2031 2826,2029 2827,2026 2828,2024 2855,1959 2883,1895 2910,1831 L 2910,1831 C 2910,1830 2911,1830 2911,1830 2912,1828 2913,1826 2913,1823 2913,1821 2912,1819 2911,1817 2911,1817 2910,1816 2910,1816 2905,1809 2908,1802 2916,1798 2923,1794 2934,1792 2941,1803 2951,1822 2971,1829 2987,1842 L 2987,1842 2987,1842 C 2989,1843 2992,1844 2994,1844 2996,1844 2997,1844 2999,1843 L 2999,1843 C 3001,1843 3003,1842 3005,1842 3011,1842 3016,1845 3021,1847 3027,1850 3031,1854 3034,1859 3035,1861 3036,1863 3037,1865 L 3037,1865 C 3037,1867 3038,1869 3039,1871 3043,1877 3048,1882 3054,1885 3060,1889 3067,1891 3073,1891 3074,1891 3074,1891 3074,1891 L 3074,1891 C 3074,1891 3075,1891 3075,1891 3079,1891 3084,1892 3087,1894 3091,1896 3094,1899 3097,1903 3097,1903 3097,1904 3098,1905 3110,1934 3129,1960 3136,1991 3140,2010 3148,2028 3153,2047 L 3153,2047 C 3154,2051 3156,2055 3158,2058 3159,2060 3160,2061 3161,2063 L 3161,2063 C 3165,2067 3167,2071 3170,2076 3174,2083 3177,2090 3179,2097 L 3179,2097 C 3180,2101 3181,2105 3181,2109 3181,2116 3179,2122 3176,2127 3175,2129 3174,2131 3173,2132 L 3173,2132 C 3168,2139 3164,2145 3160,2151 3156,2159 3152,2166 3149,2174 L 3149,2174 C 3148,2176 3147,2178 3146,2179 3136,2197 3123,2212 3107,2225 L 3107,2225 C 3106,2225 3105,2226 3104,2227 3103,2228 3101,2228 3099,2228 L 3099,2228 C 3098,2228 3098,2228 3097,2228 3095,2228 3093,2229 3092,2229 3090,2230 3089,2231 3088,2233 3088,2234 3087,2235 3087,2236 L 3087,2236 C 3087,2237 3087,2238 3087,2238 3087,2241 3087,2243 3088,2245 3089,2247 3091,2248 3093,2249 L 3093,2249 C 3100,2256 3106,2264 3111,2273 3118,2285 3123,2298 3124,2313 L 3124,2313 C 3126,2333 3132,2353 3142,2370 3143,2372 3144,2373 3145,2374 L 3145,2374 C 3145,2374 3145,2374 3145,2375 3147,2379 3151,2383 3156,2385 3160,2388 3165,2389 3170,2389 3171,2389 3171,2389 3171,2389 3216,2390 3260,2392 3305,2394 L 3305,2394 C 3321,2395 3338,2397 3353,2401 3365,2405 3374,2410 3373,2423 3373,2436 3362,2438 3352,2441 L 3352,2441 C 3335,2444 3318,2446 3300,2446 3299,2446 3298,2446 3297,2446 L 3071,2446 3071,2446 Z M 2947,2392 L 2947,2392 C 2964,2391 2980,2386 2994,2378 2999,2375 3002,2373 3006,2371 3013,2366 3013,2356 3013,2347 3013,2328 3013,2309 3013,2289 L 3013,2289 C 3014,2279 3015,2268 3015,2258 3015,2247 3014,2237 3013,2226 L 3013,2226 C 3013,2225 3013,2224 3013,2223 3013,2219 3014,2215 3016,2211 L 3016,2211 C 3022,2192 3031,2175 3041,2157 3052,2139 3064,2120 3079,2104 L 3079,2104 C 3080,2103 3081,2101 3082,2100 3084,2096 3085,2093 3085,2088 3085,2085 3084,2082 3083,2079 3074,2043 3045,2030 3017,2014 L 3017,2014 C 3014,2013 3010,2012 3006,2012 3002,2012 2999,2012 2996,2013 2961,2022 2930,2039 2896,2049 L 2896,2049 C 2882,2052 2870,2056 2858,2063 2856,2064 2854,2065 2852,2067 L 2852,2067 C 2851,2068 2849,2069 2847,2070 2845,2071 2842,2073 2840,2073 2825,2075 2820,2084 2815,2096 2787,2163 2758,2230 2730,2297 L 2730,2297 C 2730,2297 2730,2297 2730,2298 2728,2301 2727,2305 2727,2308 L 2727,2308 C 2727,2313 2727,2317 2727,2321 2727,2340 2724,2359 2717,2376 2715,2385 2718,2387 2725,2388 2745,2388 2765,2389 2785,2390 2805,2390 2825,2390 2845,2390 L 2845,2392 C 2880,2392 2914,2391 2948,2392 L 2947,2392 2947,2392 Z M 2885,2023 C 2907,2007 2935,2004 2959,1990 L 2959,1990 C 2960,1990 2961,1990 2962,1989 2966,1987 2970,1983 2973,1978 L 2973,1978 2973,1978 C 2974,1976 2975,1973 2976,1971 2981,1963 2988,1956 2996,1951 3001,1948 3007,1946 3012,1945 L 3012,1945 C 3014,1944 3016,1944 3018,1942 3018,1942 3018,1942 3019,1941 L 3019,1941 C 3019,1941 3019,1942 3020,1941 3020,1941 3021,1940 3021,1940 3021,1939 3021,1939 3021,1938 3021,1938 3021,1938 3021,1937 L 3021,1937 C 3021,1937 3021,1937 3021,1937 3021,1936 3020,1936 3020,1935 3019,1935 3019,1935 3018,1935 3018,1935 3018,1935 3017,1935 3007,1939 3001,1931 2993,1928 2974,1920 2978,1897 2962,1888 2956,1884 2960,1877 2966,1873 2972,1869 2972,1864 2967,1859 2957,1851 2952,1836 2936,1833 2928,1832 2924,1833 2921,1841 2904,1885 2886,1928 2868,1971 L 2839,2039 2839,2039 C 2855,2037 2871,2031 2885,2023 L 2886,2023 2885,2023 2885,2023 Z M 3040,2377 C 3040,2387 3044,2390 3054,2390 L 3054,2390 C 3068,2388 3082,2383 3095,2375 3096,2375 3096,2375 3097,2375 3104,2371 3103,2362 3101,2356 L 3101,2356 C 3094,2342 3088,2329 3080,2316 3075,2306 3068,2295 3061,2286 L 3061,2286 C 3050,2315 3044,2346 3041,2377 L 3040,2377 3040,2377 Z"/>
       </g>
      </g>
      <g class="TextShape">
       <g id="id4">
        <rect class="BoundingBox" stroke="none" fill="none" x="3431" y="394" width="12376" height="2679"/>
        <text class="SVGTextShape"><tspan class="TextParagraph"><tspan class="TextPosition" x="3681" y="2099"><tspan font-family="Arial, sans-serif" font-size="1058px" font-weight="700" fill="rgb(0,0,0)" stroke="none" style="white-space: pre">Lausitzer Surfer e.V.</tspan></tspan></tspan></text>
       </g>
      </g>
     </g>
    </g>
   </g>
  </g>
 </g>
</svg>