<?xml version="1.0" encoding="UTF-8" standalone="no"?>
<!-- Generator: Adobe Illustrator 16.0.0, SVG Export Plug-In . SVG Version: 6.00 Build 0)  -->

<svg
   xmlns:dc="http://purl.org/dc/elements/1.1/"
   xmlns:cc="http://creativecommons.org/ns#"
   xmlns:rdf="http://www.w3.org/1999/02/22-rdf-syntax-ns#"
   xmlns:svg="http://www.w3.org/2000/svg"
   xmlns="http://www.w3.org/2000/svg"
   xmlns:sodipodi="http://sodipodi.sourceforge.net/DTD/sodipodi-0.dtd"
   xmlns:inkscape="http://www.inkscape.org/namespaces/inkscape"
   version="1.1"
   id="Layer_1"
   x="0px"
   y="0px"
   width="1300px"
   height="1300px"
   viewBox="0 0 1300 1300"
   enable-background="new 0 0 1300 1300"
   xml:space="preserve"
   sodipodi:docname="facebook_footer.svg"
   inkscape:version="0.92.1 r15371"><metadata
     id="metadata4765"><rdf:RDF><cc:Work
         rdf:about=""><dc:format>image/svg+xml</dc:format><dc:type
           rdf:resource="http://purl.org/dc/dcmitype/StillImage" /></cc:Work></rdf:RDF></metadata><defs
     id="defs4763" /><sodipodi:namedview
     pagecolor="#ffffff"
     bordercolor="#666666"
     borderopacity="1"
     objecttolerance="10"
     gridtolerance="10"
     guidetolerance="10"
     inkscape:pageopacity="0"
     inkscape:pageshadow="2"
     inkscape:window-width="1362"
     inkscape:window-height="480"
     id="namedview4761"
     showgrid="false"
     inkscape:zoom="0.18153846"
     inkscape:cx="-220.33894"
     inkscape:cy="649.99998"
     inkscape:window-x="0"
     inkscape:window-y="27"
     inkscape:window-maximized="0"
     inkscape:current-layer="g4758" /><line
     fill="none"
     stroke="#000000"
     stroke-miterlimit="10"
     x1="340.714"
     y1="1169.125"
     x2="338.121"
     y2="1169.125"
     id="line4742" /><line
     fill="none"
     stroke="#000000"
     stroke-miterlimit="10"
     x1="340.714"
     y1="1169.125"
     x2="338.121"
     y2="1169.125"
     id="line4744" /><g
     id="g4758"><g
       id="g4748"
       style="fill:#ffffff;fill-opacity:0.95338982"><path
         d="m 653.195,25.597 c 346.772,0 627.893,281.117 627.893,627.893 0,346.772 -281.117,627.893 -627.893,627.893 C 306.419,1281.383 16.5,996.775 16.5,650 16.5,303.224 306.419,25.597 653.195,25.597 Z"
         id="path4746"
         inkscape:connector-curvature="0"
         style="fill:#ffffff;fill-opacity:0.95338982" /></g><g
       id="g4752"
       style="fill:#008000;fill-opacity:1"><path
         d="M 736.666,530.497 H 875.867 V 707.038 H 736.666 c 2.705,181.615 2.953,198.326 5.65,379.939 -34.383,4.693 -71.805,14.676 -119.037,12.656 -49.118,-2.099 -83.185,-3.526 -117.955,-11.582 5.769,-179.334 1.034,-206.332 6.807,-385.666 H 431.3 l 1.089,-169.174 h 77.84 c 0.244,-18.991 0.933,-46.854 2.996,-80.53 2.801,-45.912 3.811,-68.961 7.483,-85.172 12.304,-54.342 52.208,-123.718 116.145,-150.024 22.308,-9.181 58.619,-8.616 131.243,-7.547 43.492,0.646 79.581,2.778 104.768,4.649 1.035,57.285 2.023,114.612 3.01,171.896 h -60.625 c -5.075,0 -10.015,0.467 -14.814,1.373 0,0 -2.965,0.563 -5.798,1.32 -6.612,1.778 -42.822,17.257 -54.798,54.955 -2.652,8.348 -2.962,20.808 -3.578,45.719 -0.415,16.81 -0.038,30.806 0.405,40.647"
         id="path4750"
         inkscape:connector-curvature="0"
         style="fill:#40c838;fill-opacity:1" /></g><g
       id="g4756"><path
         d="M 719.449,553.956 H 829.803 V 693.911 H 719.449 c 2.145,143.979 2.341,157.227 4.479,301.202 -27.257,3.721 -56.922,11.634 -94.367,10.033 -38.938,-1.664 -65.945,-2.795 -93.51,-9.182 4.573,-142.17 0.819,-163.572 5.396,-305.742 h -64.081 l 0.863,-134.114 h 61.709 c 0.193,-15.056 0.739,-37.145 2.375,-63.841 2.221,-36.397 3.021,-54.67 5.933,-67.521 9.754,-43.08 41.388,-98.079 92.075,-118.934 17.685,-7.278 46.472,-6.831 104.045,-5.983 34.479,0.513 63.089,2.202 83.056,3.686 0.821,45.413 1.604,90.86 2.386,136.273 h -48.062 c -4.022,0 -7.938,0.37 -11.744,1.088 0,0 -2.35,0.446 -4.596,1.047 -5.242,1.409 -33.948,13.681 -43.441,43.566 -2.104,6.617 -2.349,16.495 -2.837,36.244 -0.329,13.326 -0.03,24.421 0.321,32.223 z"
         id="path4754"
         inkscape:connector-curvature="0"
         style="fill:none" /></g></g></svg>