{
    "parts": [
        {
            "name": "ep_countable",
            "client_hooks": {
                "aceEditEvent": "ep_countable/static/js/index:aceEditEvent"
            },
            "hooks": {
                "eejsBlock_editbarMenuRight": "ep_countable/pad:eejsBlock_editbarMenuRight",
                "eejsBlock_afterEditbar": "ep_countable/pad:eejsBlock_afterEditbar",
                "eejsBlock_styles": "ep_countable/pad:eejsBlock_styles"
            }
        }
    ]
}
