Update URL.pm

Custom_url
* Convert space to _
* convert accent and symbol to percent-encoded
* add unixtimestamp to existing custom_url 
32 jobs from patch-1 in 7 minutes and 7 seconds (queued for 2 seconds)
latest
Status Job ID Name Coverage
  Podcheck
passed #250128
podcheck

00:00:31

 
  Carton
passed #250129
carton

00:02:03

 
  Carton Bdd
passed #250132
carton_mysql

00:00:30

passed #250131
carton_postgresql

00:00:30

passed #250130
carton_sqlite

00:00:54

 
  Tests
failed #250156
mysql1

00:02:22

failed #250157
mysql2

00:02:11

failed #250159
mysql3

00:01:59

failed #250154
postgresql1

00:02:02

failed #250153
postgresql2

00:01:52

failed #250155
postgresql3

00:02:03

failed #250158
sqlite1

00:01:36

failed #250151
sqlite2

00:01:34

failed #250152
sqlite3

00:01:41

failed #250139
mysql1

00:02:08

failed #250147
mysql1

00:02:32

failed #250140
mysql2

00:02:18

failed #250148
mysql2

00:02:28

failed #250141
mysql3

00:02:27

failed #250149
mysql3

00:02:36

failed #250145
postgresql1

00:02:10

failed #250136
postgresql1

00:02:02

failed #250144
postgresql2

00:02:09

failed #250137
postgresql2

00:02:01

failed #250138
postgresql3

00:02:05

failed #250146
postgresql3

00:02:22

failed #250133
sqlite1

00:01:29

failed #250150
sqlite1

00:01:39

failed #250142
sqlite2

00:01:40

failed #250134
sqlite2

00:01:37

failed #250143
sqlite3

00:02:09

failed #250135
sqlite3

00:01:50

 
Name Stage Failure
failed
mysql3 Tests
                120, 122-123, 125, 127-128, 130, 132, 134
136, 138, 140-141, 143, 145-146, 148, 150-152
154, 156, 163, 167, 169-172, 181-182
Non-zero exit status: 77
Files=1, Tests=188, 65 wallclock secs ( 0.03 usr 0.01 sys + 21.61 cusr 0.80 csys = 22.45 CPU)
Result: FAIL
Makefile:33: recipe for target 'test' failed
make: *** [test] Error 1
ERROR: Job failed: exit code 1
failed
mysql2 Tests
                120, 122-123, 125, 127-128, 130, 132, 134
136, 138, 140-141, 143, 145-146, 148, 150-152
154, 156, 163, 167, 169-172, 181-182
Non-zero exit status: 77
Files=1, Tests=188, 69 wallclock secs ( 0.03 usr 0.01 sys + 21.46 cusr 0.84 csys = 22.34 CPU)
Result: FAIL
Makefile:33: recipe for target 'test' failed
make: *** [test] Error 1
ERROR: Job failed: exit code 1
failed
sqlite1 Tests
                120, 122-123, 125, 127-128, 130, 132, 134
136, 138, 140-141, 143, 145-146, 148, 150-152
154, 156, 163, 167, 169-172, 181-182
Non-zero exit status: 77
Files=1, Tests=188, 62 wallclock secs ( 0.04 usr 0.01 sys + 21.58 cusr 0.56 csys = 22.19 CPU)
Result: FAIL
Makefile:33: recipe for target 'test' failed
make: *** [test] Error 1
ERROR: Job failed: exit code 1
failed
mysql1 Tests
                120, 122-123, 125, 127-128, 130, 132, 134
136, 138, 140-141, 143, 145-146, 148, 150-152
154, 156, 163, 167, 169-172, 181-182
Non-zero exit status: 77
Files=1, Tests=188, 70 wallclock secs ( 0.03 usr 0.00 sys + 21.76 cusr 0.67 csys = 22.46 CPU)
Result: FAIL
Makefile:33: recipe for target 'test' failed
make: *** [test] Error 1
ERROR: Job failed: exit code 1
failed
postgresql3 Tests
                120, 122-123, 125, 127-128, 130, 132, 134
136, 138, 140-141, 143, 145-146, 148, 150-152
154, 156, 163, 167, 169-172, 181-182
Non-zero exit status: 77
Files=1, Tests=188, 62 wallclock secs ( 0.04 usr 0.00 sys + 22.03 cusr 0.75 csys = 22.82 CPU)
Result: FAIL
make: *** [test] Error 1
Makefile:33: recipe for target 'test' failed
ERROR: Job failed: exit code 1
failed
postgresql1 Tests
                120, 122-123, 125, 127-128, 130, 132, 134
136, 138, 140-141, 143, 145-146, 148, 150-152
154, 156, 163, 167, 169-172, 181-182
Non-zero exit status: 77
Files=1, Tests=188, 68 wallclock secs ( 0.03 usr 0.02 sys + 22.44 cusr 0.84 csys = 23.33 CPU)
Result: FAIL
Makefile:33: recipe for target 'test' failed
make: *** [test] Error 1
ERROR: Job failed: exit code 1
failed
postgresql2 Tests
                120, 122-123, 125, 127-128, 130, 132, 134
136, 138, 140-141, 143, 145-146, 148, 150-152
154, 156, 163, 167, 169-172, 181-182
Non-zero exit status: 77
Files=1, Tests=188, 71 wallclock secs ( 0.03 usr 0.01 sys + 22.81 cusr 0.80 csys = 23.65 CPU)
Result: FAIL
Makefile:33: recipe for target 'test' failed
make: *** [test] Error 1
ERROR: Job failed: exit code 1
failed
sqlite3 Tests
                120, 122-123, 125, 127-128, 130, 132, 134
136, 138, 140-141, 143, 145-146, 148, 150-152
154, 156, 163, 167, 169-172, 181-182
Non-zero exit status: 77
Files=1, Tests=188, 64 wallclock secs ( 0.04 usr 0.01 sys + 22.78 cusr 0.74 csys = 23.57 CPU)
Result: FAIL
Makefile:33: recipe for target 'test' failed
make: *** [test] Error 1
ERROR: Job failed: exit code 1
failed
sqlite2 Tests
                120, 122-123, 125, 127-128, 130, 132, 134
136, 138, 140-141, 143, 145-146, 148, 150-152
154, 156, 163, 167, 169-172, 181-182
Non-zero exit status: 77
Files=1, Tests=188, 62 wallclock secs ( 0.03 usr 0.01 sys + 22.48 cusr 0.73 csys = 23.25 CPU)
Result: FAIL
Makefile:33: recipe for target 'test' failed
make: *** [test] Error 1
ERROR: Job failed: exit code 1