country_code,country_name,dr_code,dr_name
AGO,Angola,DR_AFA,Afrique australe
BDI,Burundi,DR_AFE,Afrique de l’est
BEN,Bénin,DR_GOG,Golfe de Guinée
BFA,Burkina Faso,DR_GSA,Grand Sahel
BWA,Botswana,DR_AFA,Afrique australe
CAF,République centrafricaine,DR_AFC,Afrique centrale
CIV,Côte d'Ivoire,DR_GOG,Golfe de Guinée
CMR,Cameroun,DR_AFC,Afrique centrale
COD,République démocratique du Congo,DR_AFC,Afrique centrale
COG,République du Congo,DR_AFC,Afrique centrale
DJI,Djibouti,DR_AFE,Afrique de l’est
DZA,Algérie,DR_AFN,Afrique du nord
EGY,Égypte,DR_AFN,Afrique du nord
ERI,Érythrée,DR_AFE,Afrique de l’est
ESH,Sahara occidental,DR_AFN,Afrique du nord
ETH,Éthiopie,DR_AFE,Afrique de l’est
GAB,Gabon,DR_AFC,Afrique centrale
GHA,Ghana,DR_GOG,Golfe de Guinée
GIN,Guinée,DR_GOG,Golfe de Guinée
GMB,Gambie,DR_GSA,Grand Sahel
GNB,Guinée-Bissau,DR_GSA,Grand Sahel
GNQ,Guinée équatoriale,DR_AFC,Afrique centrale
KEN,Kenya,DR_AFE,Afrique de l’est
LBR,Liberia,DR_GOG,Golfe de Guinée
LBY,Libye,DR_AFN,Afrique du nord
LSO,Lesotho,DR_AFA,Afrique australe
MAR,Maroc,DR_AFN,Afrique du nord
MDG,Madagascar,DR_OCI,Océan indien
MLI,Mali,DR_GSA,Grand Sahel
MOZ,Mozambique,DR_AFA,Afrique australe
MRT,Mauritanie,DR_GSA,Grand Sahel
MWI,Malawi,DR_AFA,Afrique australe
NAM,Namibie,DR_AFA,Afrique australe
NER,Niger,DR_GSA,Grand Sahel
NGA,Nigeria,DR_GOG,Golfe de Guinée
RWA,Rwanda,DR_AFE,Afrique de l’est
SDN,Soudan,DR_AFE,Afrique de l’est
SEN,Sénégal,DR_GSA,Grand Sahel
SLE,Sierra Leone,DR_GOG,Golfe de Guinée
SOM,Somalie,DR_AFE,Afrique de l’est
SSD,Soudan du Sud,DR_AFE,Afrique de l’est
SWZ,Swaziland,DR_AFA,Afrique australe
TCD,Tchad,DR_GSA,Grand Sahel
TGO,Togo,DR_GOG,Golfe de Guinée
TUN,Tunisie,DR_AFN,Afrique du nord
TZA,Tanzanie,DR_AFE,Afrique de l’est
UGA,Ouganda,DR_AFE,Afrique de l’est
ZAF,Afrique du Sud,DR_AFA,Afrique australe
ZMB,Zambie,DR_AFA,Afrique australe
ZWE,Zimbabwe,DR_AFA,Afrique australe
STP,Sao Tomé-et-Principe,DR_AFC,Afrique centrale
CPV,Cap-Vert,DR_GSA,Grand Sahel
COM,Comores,DR_OCI,Océan indien
MUS,Maurice,DR_OCI,Océan indien
SYC,Seychelles,DR_OCI,Océan indien
REU,Réunion,DR_OCI,Océan indien
MYT,Mayotte,DR_OCI,Océan indien
