country,year,value
AFG,2016,26.60464
AFG,2017,26.0573
AFG,2018,25.66295
ALB,2018,82.75689
AND,2016,100
AND,2017,100
AND,2018,100
ARE,2016,100
ARE,2017,100
ATG,2017,100
ATG,2018,100
AUS,2000,100
AUS,2001,100
AUS,2002,100
AUS,2003,100
AUS,2004,100
AUS,2005,100
AUS,2006,100
AUS,2007,100
AUS,2008,100
AUS,2009,100
AUS,2010,100
AUS,2011,100
AUS,2012,100
AUS,2013,100
AUS,2014,100
AUS,2015,100
AUS,2016,100
AZE,2016,100
AZE,2017,100
AZE,2018,100
BDI,2016,34.92845
BDI,2017,35.45476
BDI,2018,35.09638
BFA,2016,74.06346
BFA,2017,74.71624
BGD,2016,36.57939
BHR,2016,100
BHR,2017,100
BHR,2018,100
BLR,2016,100
BLR,2017,100
BLR,2018,100
BRB,2015,100
BRB,2016,100
BRB,2017,100
BRB,2018,100
CHE,2011,100
CHE,2012,100
CHE,2013,100
CHE,2014,100
CHE,2015,100
CHE,2016,100
CHN,2016,98.56134
CHN,2017,98.98386
CHN,2018,99.35572
CMR,2017,38.76213
COK,2016,100
CPV,2017,89.07767
CPV,2018,92.19512
CRI,2016,82.93737
CRI,2018,68.21335
CUB,2018,100
CYM,2018,100
DEU,2000,100
DEU,2001,100
DEU,2002,100
DEU,2003,100
DEU,2004,100
DEU,2005,100
DEU,2006,100
DEU,2007,100
DEU,2008,100
DEU,2009,100
DEU,2010,100
DEU,2011,100
DEU,2012,100
DEU,2013,100
DEU,2014,100
DEU,2015,100
DEU,2016,100
DEU,2017,100
DEU,2018,100
DJI,2017,98.18182
DMA,2016,100
DNK,2001,100
DNK,2002,100
DNK,2003,100
DNK,2004,100
DNK,2005,100
DNK,2006,100
DNK,2007,100
DNK,2008,100
DNK,2009,100
DNK,2010,100
DNK,2011,100
DNK,2012,100
DNK,2013,100
DNK,2014,100
DNK,2015,100
DNK,2016,100
DOM,2016,89.54802
ECU,2016,82.72727
EGY,2016,100
ERI,2017,26.70103
ERI,2018,26.24113
ESP,2000,100
ESP,2001,100
ESP,2002,100
ESP,2003,100
ESP,2004,100
ESP,2005,100
ESP,2006,100
ESP,2007,100
ESP,2008,100
ESP,2009,100
ESP,2010,100
ESP,2011,100
ESP,2012,100
ESP,2013,100
ESP,2014,100
ESP,2015,100
ESP,2016,100
ESP,2017,100
ESP,2018,100
EST,2000,100
EST,2001,100
EST,2002,100
EST,2003,100
EST,2004,100
EST,2005,100
EST,2006,100
EST,2007,100
EST,2008,100
EST,2009,100
EST,2010,100
EST,2011,100
EST,2012,100
EST,2013,100
EST,2014,100
EST,2015,100
EST,2016,100
FIN,2000,100
FIN,2001,100
FIN,2002,100
FIN,2003,100
FIN,2004,100
FIN,2005,100
FIN,2006,100
FIN,2007,100
FIN,2008,100
FIN,2009,100
FIN,2010,100
FIN,2011,100
FIN,2012,100
FIN,2013,100
FIN,2014,100
FIN,2015,100
FIN,2016,100
FIN,2017,100
FIN,2018,100
FIN,2019,100
FRA,2001,100
FRA,2002,100
FRA,2003,100
FRA,2004,100
FRA,2005,100
FRA,2006,100
FRA,2007,100
FRA,2008,100
FRA,2009,100
FRA,2010,100
FRA,2011,100
FRA,2012,100
FRA,2013,100
FRA,2014,100
FRA,2015,100
FRA,2016,100
FRA,2017,100
FRA,2018,100
GEO,2016,100
GEO,2017,99.74026
GEO,2018,100
GHA,2017,90.57431
GIB,2016,100
GIB,2017,100
GMB,2016,82.89738
GMB,2017,82.89738
GMB,2018,84.16588
GTM,2016,76.20397
HKG,2016,100
HKG,2017,100
HKG,2018,100
HUN,2000,100
HUN,2001,100
HUN,2002,100
HUN,2003,100
HUN,2004,100
HUN,2005,100
HUN,2006,100
HUN,2007,100
HUN,2008,100
HUN,2009,100
HUN,2010,100
HUN,2011,100
HUN,2012,100
HUN,2013,100
HUN,2014,100
HUN,2015,100
HUN,2016,100
IDN,2018,49.77455
IND,2016,93.31446
IND,2017,89.3383
IND,2018,91.72676
ISR,2000,100
ISR,2001,100
ISR,2002,100
ISR,2003,100
ISR,2004,100
ISR,2005,100
ISR,2006,100
ISR,2007,100
ISR,2008,100
ISR,2009,100
ISR,2010,100
ISR,2011,100
ISR,2012,100
ISR,2013,100
ISR,2014,100
ISR,2015,100
ISR,2016,100
ITA,2000,100
ITA,2001,100
ITA,2002,100
ITA,2003,100
ITA,2004,100
ITA,2005,100
ITA,2006,100
ITA,2007,100
ITA,2008,100
ITA,2009,100
ITA,2010,100
ITA,2011,100
ITA,2012,100
ITA,2013,100
ITA,2014,100
ITA,2015,100
ITA,2016,100
JAM,2016,93.92202
JAM,2017,93.92898
JOR,2018,35.5813
KHM,2016,48.40097
KOR,2000,100
KOR,2001,100
KOR,2002,100
KOR,2003,100
KOR,2004,100
KOR,2005,100
KOR,2006,100
KOR,2007,100
KOR,2008,100
KOR,2009,100
KOR,2010,100
KOR,2011,100
KOR,2012,100
KOR,2013,100
KOR,2014,100
KOR,2015,100
KOR,2016,100
KWT,2016,100
KWT,2017,100
KWT,2018,100
LBN,2016,92
LBR,2016,28.06103
LCA,2016,98.75
LCA,2017,98.75
LCA,2018,100
LKA,2016,79.48828
LKA,2018,88.28117
LVA,2016,100
MAC,2016,100
MAC,2017,100
MAC,2018,100
MAR,2016,69.99809
MAR,2017,89.48161
MAR,2018,89.58679
MCO,2016,100
MCO,2017,100
MCO,2018,100
MCO,2019,100
MDA,2016,100
MDA,2017,100
MDA,2018,100
MDV,2016,100
MDV,2017,100
MEX,2016,74.7
MHL,2016,26.59574
MLI,2016,17.3
MMR,2017,66.25261
MMR,2018,64.41704
MOZ,2016,47.5
MRT,2016,26.7381
MSR,2016,100
MSR,2018,100
MUS,2013,100
MUS,2014,100
MUS,2015,100
MUS,2016,100
MUS,2017,100
MUS,2018,100
MWI,2016,72.32857
MYS,2016,99.29315
MYS,2017,100
MYS,2018,100
NER,2016,17.78048
NER,2017,34.05622
NIU,2016,100
NLD,2000,100
NLD,2001,100
NLD,2002,100
NLD,2003,100
NLD,2004,100
NLD,2005,100
NLD,2006,100
NLD,2007,100
NLD,2008,100
NLD,2009,100
NLD,2010,100
NLD,2011,100
NLD,2012,100
NLD,2013,100
NLD,2014,100
NLD,2015,100
NLD,2016,100
NLD,2017,100
NLD,2018,100
NLD,2019,100
NOR,2000,100
NOR,2001,100
NOR,2002,100
NOR,2003,100
NOR,2004,100
NOR,2005,100
NOR,2006,100
NOR,2007,100
NOR,2008,100
NOR,2009,100
NOR,2010,100
NOR,2011,100
NOR,2012,100
NOR,2013,100
NOR,2014,100
NOR,2015,100
NOR,2016,100
NOR,2017,100
NOR,2018,100
NOR,2019,100
NRU,2016,100
OMN,2016,100
OMN,2017,100
OMN,2018,100
PAN,2016,81.50289
PHL,2016,32.75059
POL,2000,100
POL,2001,100
POL,2002,100
POL,2003,100
POL,2004,100
POL,2005,100
POL,2006,100
POL,2007,100
POL,2008,100
POL,2009,100
POL,2010,100
POL,2011,100
POL,2012,100
POL,2013,100
POL,2014,100
POL,2015,100
POL,2016,100
PRT,2000,100
PRT,2001,100
PRT,2002,100
PRT,2003,100
PRT,2004,100
PRT,2005,100
PRT,2006,100
PRT,2007,100
PRT,2008,100
PRT,2009,100
PRT,2010,100
PRT,2011,100
PRT,2012,100
PRT,2013,100
PRT,2014,100
PRT,2015,100
PRT,2016,100
PRT,2017,100
PRT,2018,100
PSE,2016,99.54853
PSE,2017,99.58246
PSE,2018,99.39148
QAT,2016,100
QAT,2017,100
QAT,2018,100
RWA,2011,86.51199
RWA,2012,87.66384
RWA,2013,90.52473
RWA,2014,91.0734
RWA,2015,90.95203
RWA,2016,90.85151
RWA,2017,83.87209
SAU,2017,100
SDN,2016,73.48535
SEN,2017,9.44172
SGP,2016,100
SGP,2017,100
SLE,2017,47.22828
SLE,2018,47.17224
SMR,2018,100
STP,2016,72.61858
STP,2017,71.73913
SVK,2014,100
SVK,2015,100
SVK,2016,100
SVN,2000,100
SVN,2001,100
SVN,2002,100
SVN,2003,100
SVN,2004,100
SVN,2005,100
SVN,2006,100
SVN,2007,100
SVN,2008,100
SVN,2009,100
SVN,2010,100
SVN,2011,100
SVN,2012,100
SVN,2013,100
SVN,2014,100
SVN,2015,100
SVN,2016,100
SWZ,2016,100
SYC,2016,100
SYC,2017,100
SYC,2018,100
TCA,2018,100
TCD,2015,17.37031
TGO,2017,45.08544
TGO,2018,57.76348
TUN,2016,99.63258
TUN,2017,99.61763
URY,2016,83.13253
UZB,2018,92.28679
VCT,2016,100
VCT,2017,100
VCT,2018,100
VEN,2016,90.40749
VGB,2016,100
VGB,2017,100
WSM,2016,100
WSM,2017,100
WSM,2018,100
