{
  "country": "DJI",
  "country_name": "Djibouti",
  "indicators": {
    "abo_mobile": [
      [
        1960,
        0.0
      ],
      [
        1961,
        "NA"
      ],
      [
        1962,
        "NA"
      ],
      [
        1963,
        "NA"
      ],
      [
        1964,
        "NA"
      ],
      [
        1965,
        0.0
      ],
      [
        1966,
        "NA"
      ],
      [
        1967,
        "NA"
      ],
      [
        1968,
        "NA"
      ],
      [
        1969,
        "NA"
      ],
      [
        1970,
        0.0
      ],
      [
        1971,
        "NA"
      ],
      [
        1972,
        "NA"
      ],
      [
        1973,
        "NA"
      ],
      [
        1974,
        "NA"
      ],
      [
        1975,
        0.0
      ],
      [
        1976,
        0.0
      ],
      [
        1977,
        0.0
      ],
      [
        1978,
        0.0
      ],
      [
        1979,
        0.0
      ],
      [
        1980,
        0.0
      ],
      [
        1981,
        0.0
      ],
      [
        1982,
        0.0
      ],
      [
        1983,
        0.0
      ],
      [
        1984,
        0.0
      ],
      [
        1985,
        0.0
      ],
      [
        1986,
        0.0
      ],
      [
        1987,
        0.0
      ],
      [
        1988,
        0.0
      ],
      [
        1989,
        0.0
      ],
      [
        1990,
        0.0
      ],
      [
        1991,
        0.0
      ],
      [
        1992,
        0.0
      ],
      [
        1993,
        0.0
      ],
      [
        1994,
        0.0
      ],
      [
        1995,
        0.0
      ],
      [
        1996,
        0.00011
      ],
      [
        1997,
        0.00020299999999999997
      ],
      [
        1998,
        0.00022
      ],
      [
        1999,
        0.00028
      ],
      [
        2000,
        0.00022999999999999998
      ],
      [
        2001,
        0.003
      ],
      [
        2002,
        0.015
      ],
      [
        2003,
        0.023
      ],
      [
        2004,
        0.034482
      ],
      [
        2005,
        0.044052999999999995
      ],
      [
        2006,
        0.044817
      ],
      [
        2007,
        0.069539
      ],
      [
        2008,
        0.112848
      ],
      [
        2009,
        0.128776
      ],
      [
        2010,
        0.165613
      ],
      [
        2011,
        0.193049
      ],
      [
        2012,
        0.212468
      ],
      [
        2013,
        0.244123
      ],
      [
        2014,
        0.287049
      ],
      [
        2015,
        0.31435
      ],
      [
        2016,
        0.345246
      ],
      [
        2017,
        0.373052
      ],
      [
        2018,
        0.39503699999999997
      ],
      [
        2019,
        "NA"
      ]
    ],
    "acces_elec": [
      [
        1960,
        "NA"
      ],
      [
        1961,
        "NA"
      ],
      [
        1962,
        "NA"
      ],
      [
        1963,
        "NA"
      ],
      [
        1964,
        "NA"
      ],
      [
        1965,
        "NA"
      ],
      [
        1966,
        "NA"
      ],
      [
        1967,
        "NA"
      ],
      [
        1968,
        "NA"
      ],
      [
        1969,
        "NA"
      ],
      [
        1970,
        "NA"
      ],
      [
        1971,
        "NA"
      ],
      [
        1972,
        "NA"
      ],
      [
        1973,
        "NA"
      ],
      [
        1974,
        "NA"
      ],
      [
        1975,
        "NA"
      ],
      [
        1976,
        "NA"
      ],
      [
        1977,
        "NA"
      ],
      [
        1978,
        "NA"
      ],
      [
        1979,
        "NA"
      ],
      [
        1980,
        "NA"
      ],
      [
        1981,
        "NA"
      ],
      [
        1982,
        "NA"
      ],
      [
        1983,
        "NA"
      ],
      [
        1984,
        "NA"
      ],
      [
        1985,
        "NA"
      ],
      [
        1986,
        "NA"
      ],
      [
        1987,
        "NA"
      ],
      [
        1988,
        "NA"
      ],
      [
        1989,
        "NA"
      ],
      [
        1990,
        "NA"
      ],
      [
        1991,
        "NA"
      ],
      [
        1992,
        "NA"
      ],
      [
        1993,
        "NA"
      ],
      [
        1994,
        "NA"
      ],
      [
        1995,
        "NA"
      ],
      [
        1996,
        62.0
      ],
      [
        1997,
        56.3123588562
      ],
      [
        1998,
        56.34375
      ],
      [
        1999,
        56.3742637634
      ],
      [
        2000,
        56.3994293213
      ],
      [
        2001,
        56.4147834778
      ],
      [
        2002,
        49.7
      ],
      [
        2003,
        56.3981628418
      ],
      [
        2004,
        56.3572502136
      ],
      [
        2005,
        56.2913208008
      ],
      [
        2006,
        55.5
      ],
      [
        2007,
        56.1227226257
      ],
      [
        2008,
        56.04322052
      ],
      [
        2009,
        55.982360839799995
      ],
      [
        2010,
        55.9517288208
      ],
      [
        2011,
        55.962909698500006
      ],
      [
        2012,
        54.6
      ],
      [
        2013,
        56.129734039300004
      ],
      [
        2014,
        56.419765472399995
      ],
      [
        2015,
        57.531120300299996
      ],
      [
        2016,
        58.6942405701
      ],
      [
        2017,
        60.2
      ],
      [
        2018,
        60.395446777299995
      ],
      [
        2019,
        "NA"
      ]
    ],
    "acces_elec_primaire": [
      [
        2000,
        "NA"
      ],
      [
        2001,
        "NA"
      ],
      [
        2002,
        "NA"
      ],
      [
        2003,
        "NA"
      ],
      [
        2004,
        "NA"
      ],
      [
        2005,
        "NA"
      ],
      [
        2006,
        "NA"
      ],
      [
        2007,
        "NA"
      ],
      [
        2008,
        "NA"
      ],
      [
        2009,
        "NA"
      ],
      [
        2010,
        "NA"
      ],
      [
        2011,
        "NA"
      ],
      [
        2012,
        "NA"
      ],
      [
        2013,
        76.72955999999998
      ],
      [
        2014,
        "NA"
      ],
      [
        2015,
        "NA"
      ],
      [
        2016,
        "NA"
      ],
      [
        2017,
        95.15152
      ],
      [
        2018,
        "NA"
      ],
      [
        2019,
        "NA"
      ]
    ],
    "alpha_adulte": [
      [
        1960,
        "NA"
      ],
      [
        1961,
        "NA"
      ],
      [
        1962,
        "NA"
      ],
      [
        1963,
        "NA"
      ],
      [
        1964,
        "NA"
      ],
      [
        1965,
        "NA"
      ],
      [
        1966,
        "NA"
      ],
      [
        1967,
        "NA"
      ],
      [
        1968,
        "NA"
      ],
      [
        1969,
        "NA"
      ],
      [
        1970,
        "NA"
      ],
      [
        1971,
        "NA"
      ],
      [
        1972,
        "NA"
      ],
      [
        1973,
        "NA"
      ],
      [
        1974,
        "NA"
      ],
      [
        1975,
        "NA"
      ],
      [
        1976,
        "NA"
      ],
      [
        1977,
        "NA"
      ],
      [
        1978,
        "NA"
      ],
      [
        1979,
        "NA"
      ],
      [
        1980,
        "NA"
      ],
      [
        1981,
        "NA"
      ],
      [
        1982,
        "NA"
      ],
      [
        1983,
        "NA"
      ],
      [
        1984,
        "NA"
      ],
      [
        1985,
        "NA"
      ],
      [
        1986,
        "NA"
      ],
      [
        1987,
        "NA"
      ],
      [
        1988,
        "NA"
      ],
      [
        1989,
        "NA"
      ],
      [
        1990,
        "NA"
      ],
      [
        1991,
        "NA"
      ],
      [
        1992,
        "NA"
      ],
      [
        1993,
        "NA"
      ],
      [
        1994,
        "NA"
      ],
      [
        1995,
        "NA"
      ],
      [
        1996,
        "NA"
      ],
      [
        1997,
        "NA"
      ],
      [
        1998,
        "NA"
      ],
      [
        1999,
        "NA"
      ],
      [
        2000,
        "NA"
      ],
      [
        2001,
        "NA"
      ],
      [
        2002,
        "NA"
      ],
      [
        2003,
        "NA"
      ],
      [
        2004,
        "NA"
      ],
      [
        2005,
        "NA"
      ],
      [
        2006,
        "NA"
      ],
      [
        2007,
        "NA"
      ],
      [
        2008,
        "NA"
      ],
      [
        2009,
        "NA"
      ],
      [
        2010,
        "NA"
      ],
      [
        2011,
        "NA"
      ],
      [
        2012,
        "NA"
      ],
      [
        2013,
        "NA"
      ],
      [
        2014,
        "NA"
      ],
      [
        2015,
        "NA"
      ],
      [
        2016,
        "NA"
      ],
      [
        2017,
        "NA"
      ],
      [
        2018,
        "NA"
      ],
      [
        2019,
        "NA"
      ]
    ],
    "alpha_jeune": [
      [
        1960,
        "NA"
      ],
      [
        1961,
        "NA"
      ],
      [
        1962,
        "NA"
      ],
      [
        1963,
        "NA"
      ],
      [
        1964,
        "NA"
      ],
      [
        1965,
        "NA"
      ],
      [
        1966,
        "NA"
      ],
      [
        1967,
        "NA"
      ],
      [
        1968,
        "NA"
      ],
      [
        1969,
        "NA"
      ],
      [
        1970,
        "NA"
      ],
      [
        1971,
        "NA"
      ],
      [
        1972,
        "NA"
      ],
      [
        1973,
        "NA"
      ],
      [
        1974,
        "NA"
      ],
      [
        1975,
        "NA"
      ],
      [
        1976,
        "NA"
      ],
      [
        1977,
        "NA"
      ],
      [
        1978,
        "NA"
      ],
      [
        1979,
        "NA"
      ],
      [
        1980,
        "NA"
      ],
      [
        1981,
        "NA"
      ],
      [
        1982,
        "NA"
      ],
      [
        1983,
        "NA"
      ],
      [
        1984,
        "NA"
      ],
      [
        1985,
        "NA"
      ],
      [
        1986,
        "NA"
      ],
      [
        1987,
        "NA"
      ],
      [
        1988,
        "NA"
      ],
      [
        1989,
        "NA"
      ],
      [
        1990,
        "NA"
      ],
      [
        1991,
        "NA"
      ],
      [
        1992,
        "NA"
      ],
      [
        1993,
        "NA"
      ],
      [
        1994,
        "NA"
      ],
      [
        1995,
        "NA"
      ],
      [
        1996,
        "NA"
      ],
      [
        1997,
        "NA"
      ],
      [
        1998,
        "NA"
      ],
      [
        1999,
        "NA"
      ],
      [
        2000,
        "NA"
      ],
      [
        2001,
        "NA"
      ],
      [
        2002,
        "NA"
      ],
      [
        2003,
        "NA"
      ],
      [
        2004,
        "NA"
      ],
      [
        2005,
        "NA"
      ],
      [
        2006,
        "NA"
      ],
      [
        2007,
        "NA"
      ],
      [
        2008,
        "NA"
      ],
      [
        2009,
        "NA"
      ],
      [
        2010,
        "NA"
      ],
      [
        2011,
        "NA"
      ],
      [
        2012,
        "NA"
      ],
      [
        2013,
        "NA"
      ],
      [
        2014,
        "NA"
      ],
      [
        2015,
        "NA"
      ],
      [
        2016,
        "NA"
      ],
      [
        2017,
        "NA"
      ],
      [
        2018,
        "NA"
      ],
      [
        2019,
        "NA"
      ]
    ],
    "bidonvilles": [
      [
        1960,
        "NA"
      ],
      [
        1961,
        "NA"
      ],
      [
        1962,
        "NA"
      ],
      [
        1963,
        "NA"
      ],
      [
        1964,
        "NA"
      ],
      [
        1965,
        "NA"
      ],
      [
        1966,
        "NA"
      ],
      [
        1967,
        "NA"
      ],
      [
        1968,
        "NA"
      ],
      [
        1969,
        "NA"
      ],
      [
        1970,
        "NA"
      ],
      [
        1971,
        "NA"
      ],
      [
        1972,
        "NA"
      ],
      [
        1973,
        "NA"
      ],
      [
        1974,
        "NA"
      ],
      [
        1975,
        "NA"
      ],
      [
        1976,
        "NA"
      ],
      [
        1977,
        "NA"
      ],
      [
        1978,
        "NA"
      ],
      [
        1979,
        "NA"
      ],
      [
        1980,
        "NA"
      ],
      [
        1981,
        "NA"
      ],
      [
        1982,
        "NA"
      ],
      [
        1983,
        "NA"
      ],
      [
        1984,
        "NA"
      ],
      [
        1985,
        "NA"
      ],
      [
        1986,
        "NA"
      ],
      [
        1987,
        "NA"
      ],
      [
        1988,
        "NA"
      ],
      [
        1989,
        "NA"
      ],
      [
        1990,
        "NA"
      ],
      [
        1991,
        "NA"
      ],
      [
        1992,
        "NA"
      ],
      [
        1993,
        "NA"
      ],
      [
        1994,
        "NA"
      ],
      [
        1995,
        "NA"
      ],
      [
        1996,
        "NA"
      ],
      [
        1997,
        "NA"
      ],
      [
        1998,
        "NA"
      ],
      [
        1999,
        "NA"
      ],
      [
        2000,
        "NA"
      ],
      [
        2001,
        "NA"
      ],
      [
        2002,
        "NA"
      ],
      [
        2003,
        "NA"
      ],
      [
        2004,
        "NA"
      ],
      [
        2005,
        "NA"
      ],
      [
        2006,
        "NA"
      ],
      [
        2007,
        "NA"
      ],
      [
        2008,
        "NA"
      ],
      [
        2009,
        "NA"
      ],
      [
        2010,
        "NA"
      ],
      [
        2011,
        "NA"
      ],
      [
        2012,
        "NA"
      ],
      [
        2013,
        "NA"
      ],
      [
        2014,
        65.6
      ],
      [
        2015,
        "NA"
      ],
      [
        2016,
        "NA"
      ],
      [
        2017,
        "NA"
      ],
      [
        2018,
        "NA"
      ],
      [
        2019,
        "NA"
      ]
    ],
    "compte_adulte": [
      [
        1960,
        "NA"
      ],
      [
        1961,
        "NA"
      ],
      [
        1962,
        "NA"
      ],
      [
        1963,
        "NA"
      ],
      [
        1964,
        "NA"
      ],
      [
        1965,
        "NA"
      ],
      [
        1966,
        "NA"
      ],
      [
        1967,
        "NA"
      ],
      [
        1968,
        "NA"
      ],
      [
        1969,
        "NA"
      ],
      [
        1970,
        "NA"
      ],
      [
        1971,
        "NA"
      ],
      [
        1972,
        "NA"
      ],
      [
        1973,
        "NA"
      ],
      [
        1974,
        "NA"
      ],
      [
        1975,
        "NA"
      ],
      [
        1976,
        "NA"
      ],
      [
        1977,
        "NA"
      ],
      [
        1978,
        "NA"
      ],
      [
        1979,
        "NA"
      ],
      [
        1980,
        "NA"
      ],
      [
        1981,
        "NA"
      ],
      [
        1982,
        "NA"
      ],
      [
        1983,
        "NA"
      ],
      [
        1984,
        "NA"
      ],
      [
        1985,
        "NA"
      ],
      [
        1986,
        "NA"
      ],
      [
        1987,
        "NA"
      ],
      [
        1988,
        "NA"
      ],
      [
        1989,
        "NA"
      ],
      [
        1990,
        "NA"
      ],
      [
        1991,
        "NA"
      ],
      [
        1992,
        "NA"
      ],
      [
        1993,
        "NA"
      ],
      [
        1994,
        "NA"
      ],
      [
        1995,
        "NA"
      ],
      [
        1996,
        "NA"
      ],
      [
        1997,
        "NA"
      ],
      [
        1998,
        "NA"
      ],
      [
        1999,
        "NA"
      ],
      [
        2000,
        "NA"
      ],
      [
        2001,
        "NA"
      ],
      [
        2002,
        "NA"
      ],
      [
        2003,
        "NA"
      ],
      [
        2004,
        "NA"
      ],
      [
        2005,
        "NA"
      ],
      [
        2006,
        "NA"
      ],
      [
        2007,
        "NA"
      ],
      [
        2008,
        "NA"
      ],
      [
        2009,
        "NA"
      ],
      [
        2010,
        "NA"
      ],
      [
        2011,
        15.9081573486
      ],
      [
        2012,
        "NA"
      ],
      [
        2013,
        "NA"
      ],
      [
        2014,
        "NA"
      ],
      [
        2015,
        "NA"
      ],
      [
        2016,
        "NA"
      ],
      [
        2017,
        "NA"
      ],
      [
        2018,
        "NA"
      ],
      [
        2019,
        "NA"
      ]
    ],
    "compte_jeune": [
      [
        1960,
        "NA"
      ],
      [
        1961,
        "NA"
      ],
      [
        1962,
        "NA"
      ],
      [
        1963,
        "NA"
      ],
      [
        1964,
        "NA"
      ],
      [
        1965,
        "NA"
      ],
      [
        1966,
        "NA"
      ],
      [
        1967,
        "NA"
      ],
      [
        1968,
        "NA"
      ],
      [
        1969,
        "NA"
      ],
      [
        1970,
        "NA"
      ],
      [
        1971,
        "NA"
      ],
      [
        1972,
        "NA"
      ],
      [
        1973,
        "NA"
      ],
      [
        1974,
        "NA"
      ],
      [
        1975,
        "NA"
      ],
      [
        1976,
        "NA"
      ],
      [
        1977,
        "NA"
      ],
      [
        1978,
        "NA"
      ],
      [
        1979,
        "NA"
      ],
      [
        1980,
        "NA"
      ],
      [
        1981,
        "NA"
      ],
      [
        1982,
        "NA"
      ],
      [
        1983,
        "NA"
      ],
      [
        1984,
        "NA"
      ],
      [
        1985,
        "NA"
      ],
      [
        1986,
        "NA"
      ],
      [
        1987,
        "NA"
      ],
      [
        1988,
        "NA"
      ],
      [
        1989,
        "NA"
      ],
      [
        1990,
        "NA"
      ],
      [
        1991,
        "NA"
      ],
      [
        1992,
        "NA"
      ],
      [
        1993,
        "NA"
      ],
      [
        1994,
        "NA"
      ],
      [
        1995,
        "NA"
      ],
      [
        1996,
        "NA"
      ],
      [
        1997,
        "NA"
      ],
      [
        1998,
        "NA"
      ],
      [
        1999,
        "NA"
      ],
      [
        2000,
        "NA"
      ],
      [
        2001,
        "NA"
      ],
      [
        2002,
        "NA"
      ],
      [
        2003,
        "NA"
      ],
      [
        2004,
        "NA"
      ],
      [
        2005,
        "NA"
      ],
      [
        2006,
        "NA"
      ],
      [
        2007,
        "NA"
      ],
      [
        2008,
        "NA"
      ],
      [
        2009,
        "NA"
      ],
      [
        2010,
        "NA"
      ],
      [
        2011,
        4.4812002182
      ],
      [
        2012,
        "NA"
      ],
      [
        2013,
        "NA"
      ],
      [
        2014,
        "NA"
      ],
      [
        2015,
        "NA"
      ],
      [
        2016,
        "NA"
      ],
      [
        2017,
        "NA"
      ],
      [
        2018,
        "NA"
      ],
      [
        2019,
        "NA"
      ]
    ],
    "croissance_pib": [
      [
        1960,
        "NA"
      ],
      [
        1961,
        "NA"
      ],
      [
        1962,
        "NA"
      ],
      [
        1963,
        "NA"
      ],
      [
        1964,
        "NA"
      ],
      [
        1965,
        "NA"
      ],
      [
        1966,
        "NA"
      ],
      [
        1967,
        "NA"
      ],
      [
        1968,
        "NA"
      ],
      [
        1969,
        "NA"
      ],
      [
        1970,
        "NA"
      ],
      [
        1971,
        "NA"
      ],
      [
        1972,
        "NA"
      ],
      [
        1973,
        "NA"
      ],
      [
        1974,
        "NA"
      ],
      [
        1975,
        "NA"
      ],
      [
        1976,
        "NA"
      ],
      [
        1977,
        "NA"
      ],
      [
        1978,
        "NA"
      ],
      [
        1979,
        "NA"
      ],
      [
        1980,
        "NA"
      ],
      [
        1981,
        "NA"
      ],
      [
        1982,
        "NA"
      ],
      [
        1983,
        "NA"
      ],
      [
        1984,
        "NA"
      ],
      [
        1985,
        "NA"
      ],
      [
        1986,
        "NA"
      ],
      [
        1987,
        "NA"
      ],
      [
        1988,
        "NA"
      ],
      [
        1989,
        "NA"
      ],
      [
        1990,
        "NA"
      ],
      [
        1991,
        "NA"
      ],
      [
        1992,
        "NA"
      ],
      [
        1993,
        "NA"
      ],
      [
        1994,
        "NA"
      ],
      [
        1995,
        "NA"
      ],
      [
        1996,
        "NA"
      ],
      [
        1997,
        "NA"
      ],
      [
        1998,
        "NA"
      ],
      [
        1999,
        "NA"
      ],
      [
        2000,
        "NA"
      ],
      [
        2001,
        "NA"
      ],
      [
        2002,
        "NA"
      ],
      [
        2003,
        "NA"
      ],
      [
        2004,
        "NA"
      ],
      [
        2005,
        "NA"
      ],
      [
        2006,
        "NA"
      ],
      [
        2007,
        "NA"
      ],
      [
        2008,
        "NA"
      ],
      [
        2009,
        "NA"
      ],
      [
        2010,
        "NA"
      ],
      [
        2011,
        "NA"
      ],
      [
        2012,
        "NA"
      ],
      [
        2013,
        "NA"
      ],
      [
        2014,
        7.0615432423
      ],
      [
        2015,
        7.6750700864
      ],
      [
        2016,
        6.9185846236
      ],
      [
        2017,
        5.0768996433
      ],
      [
        2018,
        5.4601907587000005
      ],
      [
        2019,
        "NA"
      ]
    ],
    "eau_douce_agri": [
      [
        1960,
        "NA"
      ],
      [
        1961,
        "NA"
      ],
      [
        1962,
        "NA"
      ],
      [
        1963,
        "NA"
      ],
      [
        1964,
        "NA"
      ],
      [
        1965,
        "NA"
      ],
      [
        1966,
        "NA"
      ],
      [
        1967,
        "NA"
      ],
      [
        1968,
        "NA"
      ],
      [
        1969,
        "NA"
      ],
      [
        1970,
        "NA"
      ],
      [
        1971,
        "NA"
      ],
      [
        1972,
        "NA"
      ],
      [
        1973,
        "NA"
      ],
      [
        1974,
        "NA"
      ],
      [
        1975,
        "NA"
      ],
      [
        1976,
        "NA"
      ],
      [
        1977,
        "NA"
      ],
      [
        1978,
        "NA"
      ],
      [
        1979,
        "NA"
      ],
      [
        1980,
        "NA"
      ],
      [
        1981,
        "NA"
      ],
      [
        1982,
        "NA"
      ],
      [
        1983,
        "NA"
      ],
      [
        1984,
        "NA"
      ],
      [
        1985,
        87.5
      ],
      [
        1986,
        "NA"
      ],
      [
        1987,
        "NA"
      ],
      [
        1988,
        "NA"
      ],
      [
        1989,
        "NA"
      ],
      [
        1990,
        "NA"
      ],
      [
        1991,
        "NA"
      ],
      [
        1992,
        "NA"
      ],
      [
        1993,
        "NA"
      ],
      [
        1994,
        "NA"
      ],
      [
        1995,
        "NA"
      ],
      [
        1996,
        "NA"
      ],
      [
        1997,
        "NA"
      ],
      [
        1998,
        "NA"
      ],
      [
        1999,
        "NA"
      ],
      [
        2000,
        15.79
      ],
      [
        2001,
        "NA"
      ],
      [
        2002,
        "NA"
      ],
      [
        2003,
        "NA"
      ],
      [
        2004,
        "NA"
      ],
      [
        2005,
        "NA"
      ],
      [
        2006,
        "NA"
      ],
      [
        2007,
        "NA"
      ],
      [
        2008,
        "NA"
      ],
      [
        2009,
        "NA"
      ],
      [
        2010,
        "NA"
      ],
      [
        2011,
        "NA"
      ],
      [
        2012,
        "NA"
      ],
      [
        2013,
        "NA"
      ],
      [
        2014,
        "NA"
      ],
      [
        2015,
        "NA"
      ],
      [
        2016,
        "NA"
      ],
      [
        2017,
        "NA"
      ],
      [
        2018,
        "NA"
      ],
      [
        2019,
        "NA"
      ]
    ],
    "eau_potable_primaire": [
      [
        2000,
        "NA"
      ],
      [
        2001,
        "NA"
      ],
      [
        2002,
        "NA"
      ],
      [
        2003,
        "NA"
      ],
      [
        2004,
        "NA"
      ],
      [
        2005,
        "NA"
      ],
      [
        2006,
        "NA"
      ],
      [
        2007,
        "NA"
      ],
      [
        2008,
        "NA"
      ],
      [
        2009,
        "NA"
      ],
      [
        2010,
        "NA"
      ],
      [
        2011,
        "NA"
      ],
      [
        2012,
        "NA"
      ],
      [
        2013,
        "NA"
      ],
      [
        2014,
        "NA"
      ],
      [
        2015,
        "NA"
      ],
      [
        2016,
        "NA"
      ],
      [
        2017,
        88.48485
      ],
      [
        2018,
        "NA"
      ],
      [
        2019,
        "NA"
      ]
    ],
    "emploi_agri": [
      [
        1960,
        "NA"
      ],
      [
        1961,
        "NA"
      ],
      [
        1962,
        "NA"
      ],
      [
        1963,
        "NA"
      ],
      [
        1964,
        "NA"
      ],
      [
        1965,
        "NA"
      ],
      [
        1966,
        "NA"
      ],
      [
        1967,
        "NA"
      ],
      [
        1968,
        "NA"
      ],
      [
        1969,
        "NA"
      ],
      [
        1970,
        "NA"
      ],
      [
        1971,
        "NA"
      ],
      [
        1972,
        "NA"
      ],
      [
        1973,
        "NA"
      ],
      [
        1974,
        "NA"
      ],
      [
        1975,
        "NA"
      ],
      [
        1976,
        "NA"
      ],
      [
        1977,
        "NA"
      ],
      [
        1978,
        "NA"
      ],
      [
        1979,
        "NA"
      ],
      [
        1980,
        "NA"
      ],
      [
        1981,
        "NA"
      ],
      [
        1982,
        "NA"
      ],
      [
        1983,
        "NA"
      ],
      [
        1984,
        "NA"
      ],
      [
        1985,
        "NA"
      ],
      [
        1986,
        "NA"
      ],
      [
        1987,
        "NA"
      ],
      [
        1988,
        "NA"
      ],
      [
        1989,
        "NA"
      ],
      [
        1990,
        "NA"
      ],
      [
        1991,
        43.9280014038
      ],
      [
        1992,
        43.9640007019
      ],
      [
        1993,
        44.2509994507
      ],
      [
        1994,
        44.3219985962
      ],
      [
        1995,
        44.5060005188
      ],
      [
        1996,
        44.7859992981
      ],
      [
        1997,
        44.944000244099996
      ],
      [
        1998,
        45.0239982605
      ],
      [
        1999,
        44.9029998779
      ],
      [
        2000,
        44.9259986877
      ],
      [
        2001,
        44.7630004883
      ],
      [
        2002,
        44.4500007629
      ],
      [
        2003,
        44.1160011292
      ],
      [
        2004,
        43.78099823
      ],
      [
        2005,
        43.3930015564
      ],
      [
        2006,
        42.8759994507
      ],
      [
        2007,
        42.307998657199995
      ],
      [
        2008,
        41.625
      ],
      [
        2009,
        41.2999992371
      ],
      [
        2010,
        40.7299995422
      ],
      [
        2011,
        39.8429985046
      ],
      [
        2012,
        39.1430015564
      ],
      [
        2013,
        38.3829994202
      ],
      [
        2014,
        37.456001281700004
      ],
      [
        2015,
        36.4780006409
      ],
      [
        2016,
        35.5400009155
      ],
      [
        2017,
        34.7430000305
      ],
      [
        2018,
        33.9140014648
      ],
      [
        2019,
        33.1220016479
      ]
    ],
    "enseignant_primaire": [
      [
        1960,
        "NA"
      ],
      [
        1961,
        "NA"
      ],
      [
        1962,
        "NA"
      ],
      [
        1963,
        "NA"
      ],
      [
        1964,
        "NA"
      ],
      [
        1965,
        "NA"
      ],
      [
        1966,
        "NA"
      ],
      [
        1967,
        "NA"
      ],
      [
        1968,
        "NA"
      ],
      [
        1969,
        "NA"
      ],
      [
        1970,
        "NA"
      ],
      [
        1971,
        "NA"
      ],
      [
        1972,
        "NA"
      ],
      [
        1973,
        "NA"
      ],
      [
        1974,
        "NA"
      ],
      [
        1975,
        "NA"
      ],
      [
        1976,
        "NA"
      ],
      [
        1977,
        "NA"
      ],
      [
        1978,
        "NA"
      ],
      [
        1979,
        "NA"
      ],
      [
        1980,
        "NA"
      ],
      [
        1981,
        "NA"
      ],
      [
        1982,
        "NA"
      ],
      [
        1983,
        "NA"
      ],
      [
        1984,
        "NA"
      ],
      [
        1985,
        "NA"
      ],
      [
        1986,
        "NA"
      ],
      [
        1987,
        "NA"
      ],
      [
        1988,
        "NA"
      ],
      [
        1989,
        "NA"
      ],
      [
        1990,
        "NA"
      ],
      [
        1991,
        "NA"
      ],
      [
        1992,
        "NA"
      ],
      [
        1993,
        "NA"
      ],
      [
        1994,
        "NA"
      ],
      [
        1995,
        "NA"
      ],
      [
        1996,
        "NA"
      ],
      [
        1997,
        "NA"
      ],
      [
        1998,
        "NA"
      ],
      [
        1999,
        "NA"
      ],
      [
        2000,
        "NA"
      ],
      [
        2001,
        "NA"
      ],
      [
        2002,
        "NA"
      ],
      [
        2003,
        "NA"
      ],
      [
        2004,
        "NA"
      ],
      [
        2005,
        "NA"
      ],
      [
        2006,
        79.09886999999999
      ],
      [
        2007,
        "NA"
      ],
      [
        2008,
        80.32589
      ],
      [
        2009,
        100.0
      ],
      [
        2010,
        "NA"
      ],
      [
        2011,
        100.0
      ],
      [
        2012,
        "NA"
      ],
      [
        2013,
        96.00431999999999
      ],
      [
        2014,
        "NA"
      ],
      [
        2015,
        100.0
      ],
      [
        2016,
        "NA"
      ],
      [
        2017,
        "NA"
      ],
      [
        2018,
        100.0
      ],
      [
        2019,
        "NA"
      ]
    ],
    "enseignant_secondaire": [
      [
        1960,
        "NA"
      ],
      [
        1961,
        "NA"
      ],
      [
        1962,
        "NA"
      ],
      [
        1963,
        "NA"
      ],
      [
        1964,
        "NA"
      ],
      [
        1965,
        "NA"
      ],
      [
        1966,
        "NA"
      ],
      [
        1967,
        "NA"
      ],
      [
        1968,
        "NA"
      ],
      [
        1969,
        "NA"
      ],
      [
        1970,
        "NA"
      ],
      [
        1971,
        "NA"
      ],
      [
        1972,
        "NA"
      ],
      [
        1973,
        "NA"
      ],
      [
        1974,
        "NA"
      ],
      [
        1975,
        "NA"
      ],
      [
        1976,
        "NA"
      ],
      [
        1977,
        "NA"
      ],
      [
        1978,
        "NA"
      ],
      [
        1979,
        "NA"
      ],
      [
        1980,
        "NA"
      ],
      [
        1981,
        "NA"
      ],
      [
        1982,
        "NA"
      ],
      [
        1983,
        "NA"
      ],
      [
        1984,
        "NA"
      ],
      [
        1985,
        "NA"
      ],
      [
        1986,
        "NA"
      ],
      [
        1987,
        "NA"
      ],
      [
        1988,
        "NA"
      ],
      [
        1989,
        "NA"
      ],
      [
        1990,
        "NA"
      ],
      [
        1991,
        "NA"
      ],
      [
        1992,
        "NA"
      ],
      [
        1993,
        "NA"
      ],
      [
        1994,
        "NA"
      ],
      [
        1995,
        "NA"
      ],
      [
        1996,
        "NA"
      ],
      [
        1997,
        "NA"
      ],
      [
        1998,
        "NA"
      ],
      [
        1999,
        "NA"
      ],
      [
        2000,
        "NA"
      ],
      [
        2001,
        "NA"
      ],
      [
        2002,
        "NA"
      ],
      [
        2003,
        "NA"
      ],
      [
        2004,
        "NA"
      ],
      [
        2005,
        "NA"
      ],
      [
        2006,
        "NA"
      ],
      [
        2007,
        "NA"
      ],
      [
        2008,
        "NA"
      ],
      [
        2009,
        "NA"
      ],
      [
        2010,
        "NA"
      ],
      [
        2011,
        100.0
      ],
      [
        2012,
        "NA"
      ],
      [
        2013,
        "NA"
      ],
      [
        2014,
        100.0
      ],
      [
        2015,
        100.0
      ],
      [
        2016,
        "NA"
      ],
      [
        2017,
        "NA"
      ],
      [
        2018,
        "NA"
      ],
      [
        2019,
        "NA"
      ]
    ],
    "frag_pol": [
      [
        2006,
        1.0
      ],
      [
        2007,
        1.0
      ],
      [
        2008,
        1.0
      ],
      [
        2009,
        1.0
      ],
      [
        2010,
        1.0
      ],
      [
        2011,
        0.0
      ],
      [
        2012,
        0.0
      ],
      [
        2013,
        0.0
      ],
      [
        2014,
        0.0
      ],
      [
        2015,
        0.0
      ],
      [
        2016,
        0.0
      ],
      [
        2017,
        1.0
      ]
    ],
    "idh": [
      [
        1990,
        "NA"
      ],
      [
        1991,
        "NA"
      ],
      [
        1992,
        "NA"
      ],
      [
        1993,
        "NA"
      ],
      [
        1994,
        "NA"
      ],
      [
        1995,
        0.355
      ],
      [
        1996,
        0.353
      ],
      [
        1997,
        0.35700000000000004
      ],
      [
        1998,
        0.359
      ],
      [
        1999,
        0.362
      ],
      [
        2000,
        0.363
      ],
      [
        2001,
        0.3720000000000001
      ],
      [
        2002,
        0.378
      ],
      [
        2003,
        0.388
      ],
      [
        2004,
        0.396
      ],
      [
        2005,
        0.405
      ],
      [
        2006,
        0.416
      ],
      [
        2007,
        0.426
      ],
      [
        2008,
        0.435
      ],
      [
        2009,
        0.441
      ],
      [
        2010,
        0.449
      ],
      [
        2011,
        0.454
      ],
      [
        2012,
        0.459
      ],
      [
        2013,
        0.463
      ],
      [
        2014,
        0.467
      ],
      [
        2015,
        0.47
      ],
      [
        2016,
        0.474
      ],
      [
        2017,
        0.476
      ]
    ],
    "lib_monde": [
      [
        2013,
        1.0
      ],
      [
        2014,
        1.0
      ],
      [
        2015,
        1.0
      ],
      [
        2016,
        1.0
      ],
      [
        2017,
        1.0
      ],
      [
        2018,
        1.0
      ]
    ],
    "migration": [
      [
        1955,
        3.037
      ],
      [
        1960,
        13.052
      ],
      [
        1965,
        36.254
      ],
      [
        1970,
        36.413000000000004
      ],
      [
        1975,
        36.47
      ],
      [
        1980,
        62.553000000000004
      ],
      [
        1985,
        5.098
      ],
      [
        1990,
        35.431999999999995
      ],
      [
        1995,
        -14.745
      ],
      [
        2000,
        2.964
      ],
      [
        2005,
        -2.398
      ],
      [
        2010,
        -3.011
      ],
      [
        2015,
        1.369
      ],
      [
        2020,
        0.9470000000000001
      ],
      [
        2025,
        0.8809999999999999
      ],
      [
        2030,
        0.8290000000000001
      ],
      [
        2035,
        0.787
      ],
      [
        2040,
        0.754
      ],
      [
        2045,
        0.727
      ],
      [
        2050,
        0.705
      ],
      [
        2055,
        0.687
      ],
      [
        2060,
        0.674
      ],
      [
        2065,
        0.6659999999999999
      ],
      [
        2070,
        0.6609999999999999
      ],
      [
        2075,
        0.66
      ],
      [
        2080,
        0.66
      ],
      [
        2085,
        0.6609999999999999
      ],
      [
        2090,
        0.664
      ],
      [
        2095,
        0.6679999999999999
      ],
      [
        2100,
        0.6729999999999999
      ]
    ],
    "mortal_infant": [
      [
        1960,
        "NA"
      ],
      [
        1961,
        "NA"
      ],
      [
        1962,
        "NA"
      ],
      [
        1963,
        "NA"
      ],
      [
        1964,
        "NA"
      ],
      [
        1965,
        "NA"
      ],
      [
        1966,
        "NA"
      ],
      [
        1967,
        "NA"
      ],
      [
        1968,
        "NA"
      ],
      [
        1969,
        "NA"
      ],
      [
        1970,
        "NA"
      ],
      [
        1971,
        "NA"
      ],
      [
        1972,
        "NA"
      ],
      [
        1973,
        "NA"
      ],
      [
        1974,
        "NA"
      ],
      [
        1975,
        "NA"
      ],
      [
        1976,
        172.6
      ],
      [
        1977,
        167.9
      ],
      [
        1978,
        163.2
      ],
      [
        1979,
        158.6
      ],
      [
        1980,
        154.2
      ],
      [
        1981,
        150.0
      ],
      [
        1982,
        145.8
      ],
      [
        1983,
        141.7
      ],
      [
        1984,
        137.7
      ],
      [
        1985,
        133.9
      ],
      [
        1986,
        130.2
      ],
      [
        1987,
        126.7
      ],
      [
        1988,
        123.7
      ],
      [
        1989,
        120.8
      ],
      [
        1990,
        118.3
      ],
      [
        1991,
        116.2
      ],
      [
        1992,
        114.3
      ],
      [
        1993,
        112.6
      ],
      [
        1994,
        111.3
      ],
      [
        1995,
        110.0
      ],
      [
        1996,
        108.6
      ],
      [
        1997,
        107.1
      ],
      [
        1998,
        105.4
      ],
      [
        1999,
        103.4
      ],
      [
        2000,
        101.3
      ],
      [
        2001,
        99.1
      ],
      [
        2002,
        96.5
      ],
      [
        2003,
        94.0
      ],
      [
        2004,
        91.5
      ],
      [
        2005,
        89.0
      ],
      [
        2006,
        86.4
      ],
      [
        2007,
        83.7
      ],
      [
        2008,
        81.2
      ],
      [
        2009,
        78.7
      ],
      [
        2010,
        76.4
      ],
      [
        2011,
        74.1
      ],
      [
        2012,
        71.8
      ],
      [
        2013,
        69.6
      ],
      [
        2014,
        67.4
      ],
      [
        2015,
        65.3
      ],
      [
        2016,
        63.2
      ],
      [
        2017,
        61.2
      ],
      [
        2018,
        59.3
      ],
      [
        2019,
        "NA"
      ]
    ],
    "pib": [
      [
        1980,
        "NA"
      ],
      [
        1981,
        "NA"
      ],
      [
        1982,
        "NA"
      ],
      [
        1983,
        "NA"
      ],
      [
        1984,
        "NA"
      ],
      [
        1985,
        "NA"
      ],
      [
        1986,
        "NA"
      ],
      [
        1987,
        "NA"
      ],
      [
        1988,
        "NA"
      ],
      [
        1989,
        "NA"
      ],
      [
        1990,
        "NA"
      ],
      [
        1991,
        0.649
      ],
      [
        1992,
        0.6709999999999999
      ],
      [
        1993,
        0.654
      ],
      [
        1994,
        0.69
      ],
      [
        1995,
        0.6990000000000001
      ],
      [
        1996,
        0.693
      ],
      [
        1997,
        0.706
      ],
      [
        1998,
        0.722
      ],
      [
        1999,
        0.759
      ],
      [
        2000,
        0.78
      ],
      [
        2001,
        0.8109999999999999
      ],
      [
        2002,
        0.8370000000000001
      ],
      [
        2003,
        0.8809999999999999
      ],
      [
        2004,
        0.935
      ],
      [
        2005,
        0.995
      ],
      [
        2006,
        1.079
      ],
      [
        2007,
        1.19
      ],
      [
        2008,
        1.381
      ],
      [
        2009,
        1.425
      ],
      [
        2010,
        1.5419999999999998
      ],
      [
        2011,
        1.739
      ],
      [
        2012,
        1.9
      ],
      [
        2013,
        2.043
      ],
      [
        2014,
        2.2159999999999997
      ],
      [
        2015,
        2.445
      ],
      [
        2016,
        2.6189999999999998
      ],
      [
        2017,
        2.767
      ],
      [
        2018,
        2.923
      ],
      [
        2019,
        3.1660000000000004
      ],
      [
        2020,
        3.423
      ],
      [
        2021,
        3.701
      ],
      [
        2022,
        4.002
      ],
      [
        2023,
        4.327
      ],
      [
        2024,
        4.678
      ]
    ],
    "pib_hab": [
      [
        1980,
        "NA"
      ],
      [
        1981,
        "NA"
      ],
      [
        1982,
        "NA"
      ],
      [
        1983,
        "NA"
      ],
      [
        1984,
        "NA"
      ],
      [
        1985,
        "NA"
      ],
      [
        1986,
        "NA"
      ],
      [
        1987,
        "NA"
      ],
      [
        1988,
        "NA"
      ],
      [
        1989,
        "NA"
      ],
      [
        1990,
        "NA"
      ],
      [
        1991,
        1304.123
      ],
      [
        1992,
        1311.499
      ],
      [
        1993,
        1243.7269999999999
      ],
      [
        1994,
        1276.414
      ],
      [
        1995,
        1256.887
      ],
      [
        1996,
        1213.516
      ],
      [
        1997,
        1201.183
      ],
      [
        1998,
        1195.412
      ],
      [
        1999,
        1222.445
      ],
      [
        2000,
        1222.757
      ],
      [
        2001,
        1235.6580000000001
      ],
      [
        2002,
        1240.878
      ],
      [
        2003,
        1270.621
      ],
      [
        2004,
        1312.1429999999998
      ],
      [
        2005,
        1358.029
      ],
      [
        2006,
        1433.162
      ],
      [
        2007,
        1536.891
      ],
      [
        2008,
        1734.616
      ],
      [
        2009,
        1741.295
      ],
      [
        2010,
        1833.846
      ],
      [
        2011,
        2011.154
      ],
      [
        2012,
        2137.598
      ],
      [
        2013,
        2235.73
      ],
      [
        2014,
        2359.42
      ],
      [
        2015,
        2532.597
      ],
      [
        2016,
        2638.002
      ],
      [
        2017,
        2711.461
      ],
      [
        2018,
        2786.7940000000003
      ],
      [
        2019,
        2936.2129999999997
      ],
      [
        2020,
        3088.165
      ],
      [
        2021,
        3247.9809999999998
      ],
      [
        2022,
        3416.067
      ],
      [
        2023,
        3592.8509999999997
      ],
      [
        2024,
        3778.785
      ]
    ],
    "pib_ppa": [
      [
        1980,
        "NA"
      ],
      [
        1981,
        "NA"
      ],
      [
        1982,
        "NA"
      ],
      [
        1983,
        "NA"
      ],
      [
        1984,
        "NA"
      ],
      [
        1985,
        "NA"
      ],
      [
        1986,
        "NA"
      ],
      [
        1987,
        "NA"
      ],
      [
        1988,
        "NA"
      ],
      [
        1989,
        "NA"
      ],
      [
        1990,
        "NA"
      ],
      [
        1991,
        1.6469999999999998
      ],
      [
        1992,
        1.694
      ],
      [
        1993,
        1.617
      ],
      [
        1994,
        1.629
      ],
      [
        1995,
        1.6059999999999999
      ],
      [
        1996,
        1.574
      ],
      [
        1997,
        1.5819999999999999
      ],
      [
        1998,
        1.601
      ],
      [
        1999,
        1.672
      ],
      [
        2000,
        1.7209999999999999
      ],
      [
        2001,
        1.791
      ],
      [
        2002,
        1.8780000000000001
      ],
      [
        2003,
        1.974
      ],
      [
        2004,
        2.083
      ],
      [
        2005,
        2.215
      ],
      [
        2006,
        2.392
      ],
      [
        2007,
        2.5789999999999997
      ],
      [
        2008,
        2.782
      ],
      [
        2009,
        2.8489999999999998
      ],
      [
        2010,
        3.0010000000000003
      ],
      [
        2011,
        3.2880000000000003
      ],
      [
        2012,
        3.513
      ],
      [
        2013,
        3.753
      ],
      [
        2014,
        4.093
      ],
      [
        2015,
        4.453
      ],
      [
        2016,
        4.7989999999999995
      ],
      [
        2017,
        5.153
      ],
      [
        2018,
        5.723
      ],
      [
        2019,
        6.2589999999999995
      ],
      [
        2020,
        6.362
      ],
      [
        2021,
        7.037000000000001
      ]
    ],
    "pop_pauvrete": [
      [
        1960,
        "NA"
      ],
      [
        1961,
        "NA"
      ],
      [
        1962,
        "NA"
      ],
      [
        1963,
        "NA"
      ],
      [
        1964,
        "NA"
      ],
      [
        1965,
        "NA"
      ],
      [
        1966,
        "NA"
      ],
      [
        1967,
        "NA"
      ],
      [
        1968,
        "NA"
      ],
      [
        1969,
        "NA"
      ],
      [
        1970,
        "NA"
      ],
      [
        1971,
        "NA"
      ],
      [
        1972,
        "NA"
      ],
      [
        1973,
        "NA"
      ],
      [
        1974,
        "NA"
      ],
      [
        1975,
        "NA"
      ],
      [
        1976,
        "NA"
      ],
      [
        1977,
        "NA"
      ],
      [
        1978,
        "NA"
      ],
      [
        1979,
        "NA"
      ],
      [
        1980,
        "NA"
      ],
      [
        1981,
        "NA"
      ],
      [
        1982,
        "NA"
      ],
      [
        1983,
        "NA"
      ],
      [
        1984,
        "NA"
      ],
      [
        1985,
        "NA"
      ],
      [
        1986,
        "NA"
      ],
      [
        1987,
        "NA"
      ],
      [
        1988,
        "NA"
      ],
      [
        1989,
        "NA"
      ],
      [
        1990,
        "NA"
      ],
      [
        1991,
        "NA"
      ],
      [
        1992,
        "NA"
      ],
      [
        1993,
        "NA"
      ],
      [
        1994,
        "NA"
      ],
      [
        1995,
        "NA"
      ],
      [
        1996,
        "NA"
      ],
      [
        1997,
        "NA"
      ],
      [
        1998,
        "NA"
      ],
      [
        1999,
        "NA"
      ],
      [
        2000,
        "NA"
      ],
      [
        2001,
        "NA"
      ],
      [
        2002,
        20.6
      ],
      [
        2003,
        "NA"
      ],
      [
        2004,
        "NA"
      ],
      [
        2005,
        "NA"
      ],
      [
        2006,
        "NA"
      ],
      [
        2007,
        "NA"
      ],
      [
        2008,
        "NA"
      ],
      [
        2009,
        "NA"
      ],
      [
        2010,
        "NA"
      ],
      [
        2011,
        "NA"
      ],
      [
        2012,
        18.3
      ],
      [
        2013,
        22.7
      ],
      [
        2014,
        "NA"
      ],
      [
        2015,
        "NA"
      ],
      [
        2016,
        "NA"
      ],
      [
        2017,
        17.1
      ],
      [
        2018,
        "NA"
      ],
      [
        2019,
        "NA"
      ]
    ],
    "pop_rurale": [
      [
        1960,
        49.675
      ],
      [
        1961,
        48.552
      ],
      [
        1962,
        47.381
      ],
      [
        1963,
        46.213
      ],
      [
        1964,
        45.048
      ],
      [
        1965,
        43.891000000000005
      ],
      [
        1966,
        42.74
      ],
      [
        1967,
        41.596000000000004
      ],
      [
        1968,
        40.46
      ],
      [
        1969,
        39.336
      ],
      [
        1970,
        38.223
      ],
      [
        1971,
        37.122
      ],
      [
        1972,
        36.032
      ],
      [
        1973,
        34.96
      ],
      [
        1974,
        33.900999999999996
      ],
      [
        1975,
        32.858000000000004
      ],
      [
        1976,
        31.83
      ],
      [
        1977,
        30.822
      ],
      [
        1978,
        29.831
      ],
      [
        1979,
        28.859
      ],
      [
        1980,
        27.904
      ],
      [
        1981,
        26.971999999999998
      ],
      [
        1982,
        26.058000000000003
      ],
      [
        1983,
        25.496
      ],
      [
        1984,
        25.285
      ],
      [
        1985,
        25.075
      ],
      [
        1986,
        24.866
      ],
      [
        1987,
        24.659000000000002
      ],
      [
        1988,
        24.451999999999998
      ],
      [
        1989,
        24.247
      ],
      [
        1990,
        24.043000000000003
      ],
      [
        1991,
        23.886
      ],
      [
        1992,
        23.839000000000002
      ],
      [
        1993,
        23.793000000000003
      ],
      [
        1994,
        23.746
      ],
      [
        1995,
        23.7
      ],
      [
        1996,
        23.653000000000002
      ],
      [
        1997,
        23.607
      ],
      [
        1998,
        23.561
      ],
      [
        1999,
        23.515
      ],
      [
        2000,
        23.468000000000004
      ],
      [
        2001,
        23.421999999999997
      ],
      [
        2002,
        23.375999999999998
      ],
      [
        2003,
        23.33
      ],
      [
        2004,
        23.284000000000002
      ],
      [
        2005,
        23.239
      ],
      [
        2006,
        23.193
      ],
      [
        2007,
        23.147
      ],
      [
        2008,
        23.101
      ],
      [
        2009,
        23.055999999999997
      ],
      [
        2010,
        23.000999999999998
      ],
      [
        2011,
        22.936
      ],
      [
        2012,
        22.862
      ],
      [
        2013,
        22.778000000000002
      ],
      [
        2014,
        22.686
      ],
      [
        2015,
        22.583000000000002
      ],
      [
        2016,
        22.471999999999998
      ],
      [
        2017,
        22.351999999999997
      ],
      [
        2018,
        22.223000000000003
      ],
      [
        2019,
        "NA"
      ]
    ],
    "pop_tot": [
      [
        1950,
        0.062001
      ],
      [
        1951,
        0.063306
      ],
      [
        1952,
        0.06475
      ],
      [
        1953,
        0.06626900000000001
      ],
      [
        1954,
        0.067872
      ],
      [
        1955,
        0.069589
      ],
      [
        1956,
        0.071497
      ],
      [
        1957,
        0.073702
      ],
      [
        1958,
        0.07635299999999999
      ],
      [
        1959,
        0.07961199999999999
      ],
      [
        1960,
        0.083636
      ],
      [
        1961,
        0.08849800000000001
      ],
      [
        1962,
        0.094204
      ],
      [
        1963,
        0.100628
      ],
      [
        1964,
        0.107583
      ],
      [
        1965,
        0.11496300000000001
      ],
      [
        1966,
        0.122866
      ],
      [
        1967,
        0.131397
      ],
      [
        1968,
        0.14046199999999998
      ],
      [
        1969,
        0.149887
      ],
      [
        1970,
        0.159659
      ],
      [
        1971,
        0.16937200000000002
      ],
      [
        1972,
        0.179224
      ],
      [
        1973,
        0.190568
      ],
      [
        1974,
        0.205181
      ],
      [
        1975,
        0.224183
      ],
      [
        1976,
        0.248556
      ],
      [
        1977,
        0.277479
      ],
      [
        1978,
        0.308008
      ],
      [
        1979,
        0.336085
      ],
      [
        1980,
        0.35896
      ],
      [
        1981,
        0.37493699999999996
      ],
      [
        1982,
        0.385271
      ],
      [
        1983,
        0.393802
      ],
      [
        1984,
        0.406017
      ],
      [
        1985,
        0.425613
      ],
      [
        1986,
        0.45436099999999996
      ],
      [
        1987,
        0.49033000000000004
      ],
      [
        1988,
        0.528999
      ],
      [
        1989,
        0.563864
      ],
      [
        1990,
        0.590398
      ],
      [
        1991,
        0.6068439999999999
      ],
      [
        1992,
        0.615054
      ],
      [
        1993,
        0.618495
      ],
      [
        1994,
        0.622366
      ],
      [
        1995,
        0.6303880000000001
      ],
      [
        1996,
        0.643654
      ],
      [
        1997,
        0.6608630000000001
      ],
      [
        1998,
        0.6804629999999999
      ],
      [
        1999,
        0.699975
      ],
      [
        2000,
        0.717584
      ],
      [
        2001,
        0.733015
      ],
      [
        2002,
        0.746942
      ],
      [
        2003,
        0.759641
      ],
      [
        2004,
        0.7716029999999999
      ],
      [
        2005,
        0.783254
      ],
      [
        2006,
        0.794563
      ],
      [
        2007,
        0.805451
      ],
      [
        2008,
        0.8163579999999999
      ],
      [
        2009,
        0.827823
      ],
      [
        2010,
        0.840198
      ],
      [
        2011,
        0.8536739999999999
      ],
      [
        2012,
        0.8681369999999999
      ],
      [
        2013,
        0.883293
      ],
      [
        2014,
        0.898695
      ],
      [
        2015,
        0.913993
      ],
      [
        2016,
        0.929112
      ],
      [
        2017,
        0.944099
      ],
      [
        2018,
        0.958923
      ],
      [
        2019,
        0.97356
      ],
      [
        2020,
        0.988
      ],
      [
        2021,
        1.0021870000000002
      ],
      [
        2022,
        1.016097
      ],
      [
        2023,
        1.029695
      ],
      [
        2024,
        1.0430190000000001
      ],
      [
        2025,
        1.0560610000000001
      ],
      [
        2026,
        1.0688
      ],
      [
        2027,
        1.081243
      ],
      [
        2028,
        1.0933730000000002
      ],
      [
        2029,
        1.1051959999999998
      ],
      [
        2030,
        1.1167239999999998
      ],
      [
        2031,
        1.127944
      ],
      [
        2032,
        1.138863
      ],
      [
        2033,
        1.149505
      ],
      [
        2034,
        1.1598680000000001
      ],
      [
        2035,
        1.169978
      ],
      [
        2036,
        1.179845
      ],
      [
        2037,
        1.189448
      ],
      [
        2038,
        1.1988230000000002
      ],
      [
        2039,
        1.207979
      ],
      [
        2040,
        1.216929
      ],
      [
        2041,
        1.225673
      ],
      [
        2042,
        1.2342149999999998
      ],
      [
        2043,
        1.24256
      ],
      [
        2044,
        1.250712
      ],
      [
        2045,
        1.258679
      ],
      [
        2046,
        1.266469
      ],
      [
        2047,
        1.2740559999999999
      ],
      [
        2048,
        1.2814219999999998
      ],
      [
        2049,
        1.288533
      ],
      [
        2050,
        1.2953729999999999
      ],
      [
        2051,
        1.301922
      ],
      [
        2052,
        1.308167
      ],
      [
        2053,
        1.314099
      ],
      [
        2054,
        1.3197020000000002
      ],
      [
        2055,
        1.324935
      ],
      [
        2056,
        1.329826
      ],
      [
        2057,
        1.33435
      ],
      [
        2058,
        1.3385209999999998
      ],
      [
        2059,
        1.3423409999999998
      ],
      [
        2060,
        1.345823
      ],
      [
        2061,
        1.348974
      ],
      [
        2062,
        1.351792
      ],
      [
        2063,
        1.354298
      ],
      [
        2064,
        1.3564949999999998
      ],
      [
        2065,
        1.358411
      ],
      [
        2066,
        1.360039
      ],
      [
        2067,
        1.361415
      ],
      [
        2068,
        1.362535
      ],
      [
        2069,
        1.363441
      ],
      [
        2070,
        1.3641530000000002
      ],
      [
        2071,
        1.36467
      ],
      [
        2072,
        1.3650200000000001
      ],
      [
        2073,
        1.365207
      ],
      [
        2074,
        1.365271
      ],
      [
        2075,
        1.365214
      ],
      [
        2076,
        1.365053
      ],
      [
        2077,
        1.36479
      ],
      [
        2078,
        1.3644319999999999
      ],
      [
        2079,
        1.363972
      ],
      [
        2080,
        1.36342
      ],
      [
        2081,
        1.362781
      ],
      [
        2082,
        1.3620409999999998
      ],
      [
        2083,
        1.361221
      ],
      [
        2084,
        1.360291
      ],
      [
        2085,
        1.3592639999999998
      ],
      [
        2086,
        1.358135
      ],
      [
        2087,
        1.356908
      ],
      [
        2088,
        1.355571
      ],
      [
        2089,
        1.3541370000000001
      ],
      [
        2090,
        1.352578
      ],
      [
        2091,
        1.350933
      ],
      [
        2092,
        1.349174
      ],
      [
        2093,
        1.347314
      ],
      [
        2094,
        1.345359
      ],
      [
        2095,
        1.3433
      ],
      [
        2096,
        1.341146
      ],
      [
        2097,
        1.338905
      ],
      [
        2098,
        1.3365740000000002
      ],
      [
        2099,
        1.334155
      ],
      [
        2100,
        1.331655
      ]
    ],
    "pop_urbaine": [
      [
        1960,
        50.325
      ],
      [
        1961,
        51.448
      ],
      [
        1962,
        52.619
      ],
      [
        1963,
        53.787
      ],
      [
        1964,
        54.952
      ],
      [
        1965,
        56.108999999999995
      ],
      [
        1966,
        57.26
      ],
      [
        1967,
        58.403999999999996
      ],
      [
        1968,
        59.54
      ],
      [
        1969,
        60.663999999999994
      ],
      [
        1970,
        61.777
      ],
      [
        1971,
        62.878
      ],
      [
        1972,
        63.968
      ],
      [
        1973,
        65.04
      ],
      [
        1974,
        66.09899999999999
      ],
      [
        1975,
        67.142
      ],
      [
        1976,
        68.17
      ],
      [
        1977,
        69.178
      ],
      [
        1978,
        70.169
      ],
      [
        1979,
        71.141
      ],
      [
        1980,
        72.096
      ],
      [
        1981,
        73.028
      ],
      [
        1982,
        73.942
      ],
      [
        1983,
        74.50399999999999
      ],
      [
        1984,
        74.715
      ],
      [
        1985,
        74.925
      ],
      [
        1986,
        75.134
      ],
      [
        1987,
        75.34100000000001
      ],
      [
        1988,
        75.548
      ],
      [
        1989,
        75.753
      ],
      [
        1990,
        75.957
      ],
      [
        1991,
        76.11399999999999
      ],
      [
        1992,
        76.161
      ],
      [
        1993,
        76.207
      ],
      [
        1994,
        76.25399999999999
      ],
      [
        1995,
        76.3
      ],
      [
        1996,
        76.347
      ],
      [
        1997,
        76.393
      ],
      [
        1998,
        76.439
      ],
      [
        1999,
        76.485
      ],
      [
        2000,
        76.532
      ],
      [
        2001,
        76.578
      ],
      [
        2002,
        76.624
      ],
      [
        2003,
        76.67
      ],
      [
        2004,
        76.71600000000001
      ],
      [
        2005,
        76.76100000000001
      ],
      [
        2006,
        76.807
      ],
      [
        2007,
        76.85300000000001
      ],
      [
        2008,
        76.899
      ],
      [
        2009,
        76.944
      ],
      [
        2010,
        76.999
      ],
      [
        2011,
        77.064
      ],
      [
        2012,
        77.138
      ],
      [
        2013,
        77.222
      ],
      [
        2014,
        77.314
      ],
      [
        2015,
        77.417
      ],
      [
        2016,
        77.528
      ],
      [
        2017,
        77.648
      ],
      [
        2018,
        77.777
      ],
      [
        2019,
        "NA"
      ]
    ],
    "prod_elec_renouv": [
      [
        1960,
        "NA"
      ],
      [
        1961,
        "NA"
      ],
      [
        1962,
        "NA"
      ],
      [
        1963,
        "NA"
      ],
      [
        1964,
        "NA"
      ],
      [
        1965,
        "NA"
      ],
      [
        1966,
        "NA"
      ],
      [
        1967,
        "NA"
      ],
      [
        1968,
        "NA"
      ],
      [
        1969,
        "NA"
      ],
      [
        1970,
        "NA"
      ],
      [
        1971,
        "NA"
      ],
      [
        1972,
        "NA"
      ],
      [
        1973,
        "NA"
      ],
      [
        1974,
        "NA"
      ],
      [
        1975,
        "NA"
      ],
      [
        1976,
        "NA"
      ],
      [
        1977,
        "NA"
      ],
      [
        1978,
        "NA"
      ],
      [
        1979,
        "NA"
      ],
      [
        1980,
        "NA"
      ],
      [
        1981,
        "NA"
      ],
      [
        1982,
        "NA"
      ],
      [
        1983,
        "NA"
      ],
      [
        1984,
        "NA"
      ],
      [
        1985,
        "NA"
      ],
      [
        1986,
        "NA"
      ],
      [
        1987,
        "NA"
      ],
      [
        1988,
        "NA"
      ],
      [
        1989,
        "NA"
      ],
      [
        1990,
        "NA"
      ],
      [
        1991,
        "NA"
      ],
      [
        1992,
        "NA"
      ],
      [
        1993,
        "NA"
      ],
      [
        1994,
        "NA"
      ],
      [
        1995,
        "NA"
      ],
      [
        1996,
        "NA"
      ],
      [
        1997,
        "NA"
      ],
      [
        1998,
        "NA"
      ],
      [
        1999,
        "NA"
      ],
      [
        2000,
        "NA"
      ],
      [
        2001,
        "NA"
      ],
      [
        2002,
        "NA"
      ],
      [
        2003,
        "NA"
      ],
      [
        2004,
        "NA"
      ],
      [
        2005,
        "NA"
      ],
      [
        2006,
        "NA"
      ],
      [
        2007,
        "NA"
      ],
      [
        2008,
        "NA"
      ],
      [
        2009,
        "NA"
      ],
      [
        2010,
        "NA"
      ],
      [
        2011,
        "NA"
      ],
      [
        2012,
        "NA"
      ],
      [
        2013,
        "NA"
      ],
      [
        2014,
        "NA"
      ],
      [
        2015,
        "NA"
      ],
      [
        2016,
        "NA"
      ],
      [
        2017,
        "NA"
      ],
      [
        2018,
        "NA"
      ],
      [
        2019,
        "NA"
      ]
    ],
    "rdt_cerealier": [
      [
        1960,
        "NA"
      ],
      [
        1961,
        "NA"
      ],
      [
        1962,
        "NA"
      ],
      [
        1963,
        "NA"
      ],
      [
        1964,
        "NA"
      ],
      [
        1965,
        "NA"
      ],
      [
        1966,
        "NA"
      ],
      [
        1967,
        "NA"
      ],
      [
        1968,
        "NA"
      ],
      [
        1969,
        "NA"
      ],
      [
        1970,
        "NA"
      ],
      [
        1971,
        "NA"
      ],
      [
        1972,
        "NA"
      ],
      [
        1973,
        "NA"
      ],
      [
        1974,
        "NA"
      ],
      [
        1975,
        "NA"
      ],
      [
        1976,
        "NA"
      ],
      [
        1977,
        "NA"
      ],
      [
        1978,
        "NA"
      ],
      [
        1979,
        "NA"
      ],
      [
        1980,
        "NA"
      ],
      [
        1981,
        2500.0
      ],
      [
        1982,
        2500.0
      ],
      [
        1983,
        2500.0
      ],
      [
        1984,
        2333.3
      ],
      [
        1985,
        1750.0
      ],
      [
        1986,
        1666.7
      ],
      [
        1987,
        1500.0
      ],
      [
        1988,
        1538.5
      ],
      [
        1989,
        1333.3
      ],
      [
        1990,
        1666.7
      ],
      [
        1991,
        1643.3
      ],
      [
        1992,
        1647.3
      ],
      [
        1993,
        1651.9
      ],
      [
        1994,
        1657.5
      ],
      [
        1995,
        1666.7
      ],
      [
        1996,
        1683.3
      ],
      [
        1997,
        1704.7
      ],
      [
        1998,
        1726.0
      ],
      [
        1999,
        1769.4
      ],
      [
        2000,
        1833.3
      ],
      [
        2001,
        1714.3
      ],
      [
        2002,
        1666.7
      ],
      [
        2003,
        1666.7
      ],
      [
        2004,
        1658.7
      ],
      [
        2005,
        1500.0
      ],
      [
        2006,
        1666.7
      ],
      [
        2007,
        1738.2
      ],
      [
        2008,
        1780.6
      ],
      [
        2009,
        1816.7
      ],
      [
        2010,
        1848.3
      ],
      [
        2011,
        1879.3
      ],
      [
        2012,
        2000.0
      ],
      [
        2013,
        2000.0
      ],
      [
        2014,
        1933.0
      ],
      [
        2015,
        1904.7
      ],
      [
        2016,
        1921.8
      ],
      [
        2017,
        1935.0
      ],
      [
        2018,
        "NA"
      ],
      [
        2019,
        "NA"
      ]
    ],
    "recette_budg": [
      [
        1980,
        "NA"
      ],
      [
        1981,
        "NA"
      ],
      [
        1982,
        "NA"
      ],
      [
        1983,
        "NA"
      ],
      [
        1984,
        "NA"
      ],
      [
        1985,
        "NA"
      ],
      [
        1986,
        "NA"
      ],
      [
        1987,
        "NA"
      ],
      [
        1988,
        "NA"
      ],
      [
        1989,
        "NA"
      ],
      [
        1990,
        26.955
      ],
      [
        1991,
        26.840999999999998
      ],
      [
        1992,
        28.755
      ],
      [
        1993,
        28.233
      ],
      [
        1994,
        25.975
      ],
      [
        1995,
        21.883000000000003
      ],
      [
        1996,
        21.915
      ],
      [
        1997,
        22.153000000000002
      ],
      [
        1998,
        20.432000000000002
      ],
      [
        1999,
        18.34
      ],
      [
        2000,
        19.247
      ],
      [
        2001,
        17.366
      ],
      [
        2002,
        18.843
      ],
      [
        2003,
        21.728
      ],
      [
        2004,
        23.045
      ],
      [
        2005,
        25.054000000000002
      ],
      [
        2006,
        24.13
      ],
      [
        2007,
        24.709
      ],
      [
        2008,
        29.471999999999998
      ],
      [
        2009,
        27.143
      ],
      [
        2010,
        25.605
      ],
      [
        2011,
        24.112
      ],
      [
        2012,
        24.454
      ],
      [
        2013,
        22.586
      ],
      [
        2014,
        22.171999999999997
      ],
      [
        2015,
        26.281
      ],
      [
        2016,
        24.232
      ],
      [
        2017,
        23.618000000000002
      ],
      [
        2018,
        23.854
      ],
      [
        2019,
        23.107
      ],
      [
        2020,
        21.701999999999998
      ],
      [
        2021,
        20.684
      ],
      [
        2022,
        20.347
      ],
      [
        2023,
        19.61
      ],
      [
        2024,
        19.034000000000002
      ]
    ],
    "regime_pol": [
      [
        1816,
        -20.0
      ],
      [
        1817,
        -20.0
      ],
      [
        1818,
        -20.0
      ],
      [
        1819,
        -20.0
      ],
      [
        1820,
        -20.0
      ],
      [
        1821,
        -20.0
      ],
      [
        1822,
        -20.0
      ],
      [
        1823,
        -20.0
      ],
      [
        1824,
        -20.0
      ],
      [
        1825,
        -20.0
      ],
      [
        1826,
        -20.0
      ],
      [
        1827,
        -20.0
      ],
      [
        1828,
        -20.0
      ],
      [
        1829,
        -20.0
      ],
      [
        1830,
        -20.0
      ],
      [
        1831,
        -20.0
      ],
      [
        1832,
        -20.0
      ],
      [
        1833,
        -20.0
      ],
      [
        1834,
        -20.0
      ],
      [
        1835,
        -20.0
      ],
      [
        1836,
        -20.0
      ],
      [
        1837,
        -20.0
      ],
      [
        1838,
        -20.0
      ],
      [
        1839,
        -20.0
      ],
      [
        1840,
        -20.0
      ],
      [
        1841,
        -20.0
      ],
      [
        1842,
        -20.0
      ],
      [
        1843,
        -20.0
      ],
      [
        1844,
        -20.0
      ],
      [
        1845,
        -20.0
      ],
      [
        1846,
        -20.0
      ],
      [
        1847,
        -20.0
      ],
      [
        1848,
        -20.0
      ],
      [
        1849,
        -20.0
      ],
      [
        1850,
        -20.0
      ],
      [
        1851,
        -20.0
      ],
      [
        1852,
        -20.0
      ],
      [
        1853,
        -20.0
      ],
      [
        1854,
        -20.0
      ],
      [
        1855,
        -20.0
      ],
      [
        1856,
        -20.0
      ],
      [
        1857,
        -20.0
      ],
      [
        1858,
        -20.0
      ],
      [
        1859,
        -20.0
      ],
      [
        1860,
        -20.0
      ],
      [
        1861,
        -20.0
      ],
      [
        1862,
        -20.0
      ],
      [
        1863,
        -20.0
      ],
      [
        1864,
        -20.0
      ],
      [
        1865,
        -20.0
      ],
      [
        1866,
        -20.0
      ],
      [
        1867,
        -20.0
      ],
      [
        1868,
        -20.0
      ],
      [
        1869,
        -20.0
      ],
      [
        1870,
        -20.0
      ],
      [
        1871,
        -20.0
      ],
      [
        1872,
        -20.0
      ],
      [
        1873,
        -20.0
      ],
      [
        1874,
        -20.0
      ],
      [
        1875,
        -20.0
      ],
      [
        1876,
        -20.0
      ],
      [
        1877,
        -20.0
      ],
      [
        1878,
        -20.0
      ],
      [
        1879,
        -20.0
      ],
      [
        1880,
        -20.0
      ],
      [
        1881,
        -20.0
      ],
      [
        1882,
        -20.0
      ],
      [
        1883,
        -20.0
      ],
      [
        1884,
        -20.0
      ],
      [
        1885,
        -20.0
      ],
      [
        1886,
        -20.0
      ],
      [
        1887,
        -20.0
      ],
      [
        1888,
        -20.0
      ],
      [
        1889,
        -20.0
      ],
      [
        1890,
        -20.0
      ],
      [
        1891,
        -20.0
      ],
      [
        1892,
        -20.0
      ],
      [
        1893,
        -20.0
      ],
      [
        1894,
        -20.0
      ],
      [
        1895,
        -20.0
      ],
      [
        1896,
        -20.0
      ],
      [
        1897,
        -20.0
      ],
      [
        1898,
        -20.0
      ],
      [
        1899,
        -20.0
      ],
      [
        1900,
        -20.0
      ],
      [
        1901,
        -20.0
      ],
      [
        1902,
        -20.0
      ],
      [
        1903,
        -20.0
      ],
      [
        1904,
        -20.0
      ],
      [
        1905,
        -20.0
      ],
      [
        1906,
        -20.0
      ],
      [
        1907,
        -20.0
      ],
      [
        1908,
        -20.0
      ],
      [
        1909,
        -20.0
      ],
      [
        1910,
        -20.0
      ],
      [
        1911,
        -20.0
      ],
      [
        1912,
        -20.0
      ],
      [
        1913,
        -20.0
      ],
      [
        1914,
        -20.0
      ],
      [
        1915,
        -20.0
      ],
      [
        1916,
        -20.0
      ],
      [
        1917,
        -20.0
      ],
      [
        1918,
        -20.0
      ],
      [
        1919,
        -20.0
      ],
      [
        1920,
        -20.0
      ],
      [
        1921,
        -20.0
      ],
      [
        1922,
        -20.0
      ],
      [
        1923,
        -20.0
      ],
      [
        1924,
        -20.0
      ],
      [
        1925,
        -20.0
      ],
      [
        1926,
        -20.0
      ],
      [
        1927,
        -20.0
      ],
      [
        1928,
        -20.0
      ],
      [
        1929,
        -20.0
      ],
      [
        1930,
        -20.0
      ],
      [
        1931,
        -20.0
      ],
      [
        1932,
        -20.0
      ],
      [
        1933,
        -20.0
      ],
      [
        1934,
        -20.0
      ],
      [
        1935,
        -20.0
      ],
      [
        1936,
        -20.0
      ],
      [
        1937,
        -20.0
      ],
      [
        1938,
        -20.0
      ],
      [
        1939,
        -20.0
      ],
      [
        1940,
        -20.0
      ],
      [
        1941,
        -20.0
      ],
      [
        1942,
        -20.0
      ],
      [
        1943,
        -20.0
      ],
      [
        1944,
        -20.0
      ],
      [
        1945,
        -20.0
      ],
      [
        1946,
        -20.0
      ],
      [
        1947,
        -20.0
      ],
      [
        1948,
        -20.0
      ],
      [
        1949,
        -20.0
      ],
      [
        1950,
        -20.0
      ],
      [
        1951,
        -20.0
      ],
      [
        1952,
        -20.0
      ],
      [
        1953,
        -20.0
      ],
      [
        1954,
        -20.0
      ],
      [
        1955,
        -20.0
      ],
      [
        1956,
        -20.0
      ],
      [
        1957,
        -20.0
      ],
      [
        1958,
        -20.0
      ],
      [
        1959,
        -20.0
      ],
      [
        1960,
        -20.0
      ],
      [
        1961,
        -20.0
      ],
      [
        1962,
        -20.0
      ],
      [
        1963,
        -20.0
      ],
      [
        1964,
        -20.0
      ],
      [
        1965,
        -20.0
      ],
      [
        1966,
        -20.0
      ],
      [
        1967,
        -20.0
      ],
      [
        1968,
        -20.0
      ],
      [
        1969,
        -20.0
      ],
      [
        1970,
        -20.0
      ],
      [
        1971,
        -20.0
      ],
      [
        1972,
        -20.0
      ],
      [
        1973,
        -20.0
      ],
      [
        1974,
        -20.0
      ],
      [
        1975,
        -20.0
      ],
      [
        1976,
        -20.0
      ],
      [
        1977,
        -8.0
      ],
      [
        1978,
        -8.0
      ],
      [
        1979,
        -8.0
      ],
      [
        1980,
        -8.0
      ],
      [
        1981,
        -8.0
      ],
      [
        1982,
        -8.0
      ],
      [
        1983,
        -8.0
      ],
      [
        1984,
        -8.0
      ],
      [
        1985,
        -8.0
      ],
      [
        1986,
        -8.0
      ],
      [
        1987,
        -8.0
      ],
      [
        1988,
        -8.0
      ],
      [
        1989,
        -8.0
      ],
      [
        1990,
        -8.0
      ],
      [
        1991,
        -8.0
      ],
      [
        1992,
        -7.0
      ],
      [
        1993,
        -7.0
      ],
      [
        1994,
        -7.0
      ],
      [
        1995,
        -7.0
      ],
      [
        1996,
        -6.0
      ],
      [
        1997,
        -6.0
      ],
      [
        1998,
        -6.0
      ],
      [
        1999,
        2.0
      ],
      [
        2000,
        2.0
      ],
      [
        2001,
        2.0
      ],
      [
        2002,
        2.0
      ],
      [
        2003,
        2.0
      ],
      [
        2004,
        2.0
      ],
      [
        2005,
        2.0
      ],
      [
        2006,
        2.0
      ],
      [
        2007,
        2.0
      ],
      [
        2008,
        2.0
      ],
      [
        2009,
        2.0
      ],
      [
        2010,
        2.0
      ],
      [
        2011,
        2.0
      ],
      [
        2012,
        2.0
      ],
      [
        2013,
        4.0
      ],
      [
        2014,
        4.0
      ],
      [
        2015,
        4.0
      ]
    ],
    "sanitaire_primaire": [
      [
        2000,
        "NA"
      ],
      [
        2001,
        "NA"
      ],
      [
        2002,
        "NA"
      ],
      [
        2003,
        "NA"
      ],
      [
        2004,
        "NA"
      ],
      [
        2005,
        "NA"
      ],
      [
        2006,
        "NA"
      ],
      [
        2007,
        "NA"
      ],
      [
        2008,
        "NA"
      ],
      [
        2009,
        "NA"
      ],
      [
        2010,
        "NA"
      ],
      [
        2011,
        "NA"
      ],
      [
        2012,
        "NA"
      ],
      [
        2013,
        "NA"
      ],
      [
        2014,
        "NA"
      ],
      [
        2015,
        "NA"
      ],
      [
        2016,
        "NA"
      ],
      [
        2017,
        98.18182
      ],
      [
        2018,
        "NA"
      ],
      [
        2019,
        "NA"
      ]
    ],
    "sous_nutri": [
      [
        1960,
        "NA"
      ],
      [
        1961,
        "NA"
      ],
      [
        1962,
        "NA"
      ],
      [
        1963,
        "NA"
      ],
      [
        1964,
        "NA"
      ],
      [
        1965,
        "NA"
      ],
      [
        1966,
        "NA"
      ],
      [
        1967,
        "NA"
      ],
      [
        1968,
        "NA"
      ],
      [
        1969,
        "NA"
      ],
      [
        1970,
        "NA"
      ],
      [
        1971,
        "NA"
      ],
      [
        1972,
        "NA"
      ],
      [
        1973,
        "NA"
      ],
      [
        1974,
        "NA"
      ],
      [
        1975,
        "NA"
      ],
      [
        1976,
        172.6
      ],
      [
        1977,
        167.9
      ],
      [
        1978,
        163.2
      ],
      [
        1979,
        158.6
      ],
      [
        1980,
        154.2
      ],
      [
        1981,
        150.0
      ],
      [
        1982,
        145.8
      ],
      [
        1983,
        141.7
      ],
      [
        1984,
        137.7
      ],
      [
        1985,
        133.9
      ],
      [
        1986,
        130.2
      ],
      [
        1987,
        126.7
      ],
      [
        1988,
        123.7
      ],
      [
        1989,
        120.8
      ],
      [
        1990,
        118.3
      ],
      [
        1991,
        116.2
      ],
      [
        1992,
        114.3
      ],
      [
        1993,
        112.6
      ],
      [
        1994,
        111.3
      ],
      [
        1995,
        110.0
      ],
      [
        1996,
        108.6
      ],
      [
        1997,
        107.1
      ],
      [
        1998,
        105.4
      ],
      [
        1999,
        103.4
      ],
      [
        2000,
        101.3
      ],
      [
        2001,
        99.1
      ],
      [
        2002,
        96.5
      ],
      [
        2003,
        94.0
      ],
      [
        2004,
        91.5
      ],
      [
        2005,
        89.0
      ],
      [
        2006,
        86.4
      ],
      [
        2007,
        83.7
      ],
      [
        2008,
        81.2
      ],
      [
        2009,
        78.7
      ],
      [
        2010,
        76.4
      ],
      [
        2011,
        74.1
      ],
      [
        2012,
        71.8
      ],
      [
        2013,
        69.6
      ],
      [
        2014,
        67.4
      ],
      [
        2015,
        65.3
      ],
      [
        2016,
        63.2
      ],
      [
        2017,
        61.2
      ],
      [
        2018,
        59.3
      ],
      [
        2019,
        "NA"
      ]
    ],
    "volume_exp_biens": [
      [
        1980,
        "NA"
      ],
      [
        1981,
        "NA"
      ],
      [
        1982,
        "NA"
      ],
      [
        1983,
        "NA"
      ],
      [
        1984,
        "NA"
      ],
      [
        1985,
        "NA"
      ],
      [
        1986,
        "NA"
      ],
      [
        1987,
        "NA"
      ],
      [
        1988,
        "NA"
      ],
      [
        1989,
        "NA"
      ],
      [
        1990,
        21.7
      ],
      [
        1991,
        0.763
      ],
      [
        1992,
        -23.518
      ],
      [
        1993,
        15.26
      ],
      [
        1994,
        -1.771
      ],
      [
        1995,
        -35.935
      ],
      [
        1996,
        -12.044
      ],
      [
        1997,
        4.25
      ],
      [
        1998,
        -12.123
      ],
      [
        1999,
        -3.8489999999999998
      ],
      [
        2000,
        12.679
      ],
      [
        2001,
        -2.048
      ],
      [
        2002,
        12.671
      ],
      [
        2003,
        2.501
      ],
      [
        2004,
        -1.284
      ],
      [
        2005,
        0.79
      ],
      [
        2006,
        34.957
      ],
      [
        2007,
        0.265
      ],
      [
        2008,
        8.068999999999999
      ],
      [
        2009,
        10.708
      ],
      [
        2010,
        5.853
      ],
      [
        2011,
        3.6289999999999996
      ],
      [
        2012,
        22.139
      ],
      [
        2013,
        -0.997
      ],
      [
        2014,
        11.118
      ],
      [
        2015,
        -6.806
      ],
      [
        2016,
        -33.022
      ],
      [
        2017,
        81.539
      ],
      [
        2018,
        11.193
      ],
      [
        2019,
        3.471
      ],
      [
        2020,
        6.669
      ],
      [
        2021,
        6.815
      ],
      [
        2022,
        4.785
      ],
      [
        2023,
        4.785
      ],
      [
        2024,
        4.8580000000000005
      ]
    ],
    "volume_exp_bs": [
      [
        1980,
        "NA"
      ],
      [
        1981,
        "NA"
      ],
      [
        1982,
        "NA"
      ],
      [
        1983,
        "NA"
      ],
      [
        1984,
        "NA"
      ],
      [
        1985,
        "NA"
      ],
      [
        1986,
        "NA"
      ],
      [
        1987,
        "NA"
      ],
      [
        1988,
        "NA"
      ],
      [
        1989,
        "NA"
      ],
      [
        1990,
        5.4
      ],
      [
        1991,
        0.763
      ],
      [
        1992,
        -7.846
      ],
      [
        1993,
        6.475
      ],
      [
        1994,
        -5.968
      ],
      [
        1995,
        -9.89
      ],
      [
        1996,
        -5.274
      ],
      [
        1997,
        -0.428
      ],
      [
        1998,
        4.293
      ],
      [
        1999,
        -5.843
      ],
      [
        2000,
        -5.386
      ],
      [
        2001,
        8.252
      ],
      [
        2002,
        5.218999999999999
      ],
      [
        2003,
        10.407
      ],
      [
        2004,
        -4.052
      ],
      [
        2005,
        11.267999999999999
      ],
      [
        2006,
        4.828
      ],
      [
        2007,
        -2.051
      ],
      [
        2008,
        4.8069999999999995
      ],
      [
        2009,
        6.565
      ],
      [
        2010,
        1.368
      ],
      [
        2011,
        -5.103
      ],
      [
        2012,
        4.59
      ],
      [
        2013,
        3.642
      ],
      [
        2014,
        8.243
      ],
      [
        2015,
        -4.3580000000000005
      ],
      [
        2016,
        -23.912
      ],
      [
        2017,
        54.403
      ],
      [
        2018,
        10.335999999999999
      ],
      [
        2019,
        3.5380000000000003
      ],
      [
        2020,
        6.404
      ],
      [
        2021,
        6.5729999999999995
      ],
      [
        2022,
        4.51
      ],
      [
        2023,
        4.489
      ],
      [
        2024,
        4.6610000000000005
      ]
    ],
    "volume_import_biens": [
      [
        1980,
        "NA"
      ],
      [
        1981,
        "NA"
      ],
      [
        1982,
        "NA"
      ],
      [
        1983,
        "NA"
      ],
      [
        1984,
        "NA"
      ],
      [
        1985,
        "NA"
      ],
      [
        1986,
        "NA"
      ],
      [
        1987,
        "NA"
      ],
      [
        1988,
        "NA"
      ],
      [
        1989,
        "NA"
      ],
      [
        1990,
        15.0
      ],
      [
        1991,
        -44.208
      ],
      [
        1992,
        -0.75
      ],
      [
        1993,
        -9.79
      ],
      [
        1994,
        -8.876
      ],
      [
        1995,
        -11.288
      ],
      [
        1996,
        -7.207000000000001
      ],
      [
        1997,
        -0.7659999999999999
      ],
      [
        1998,
        8.713
      ],
      [
        1999,
        -2.991
      ],
      [
        2000,
        4.414
      ],
      [
        2001,
        -7.178999999999999
      ],
      [
        2002,
        0.722
      ],
      [
        2003,
        18.507
      ],
      [
        2004,
        6.257000000000001
      ],
      [
        2005,
        13.755
      ],
      [
        2006,
        23.410999999999998
      ],
      [
        2007,
        17.295
      ],
      [
        2008,
        8.477
      ],
      [
        2009,
        -22.699
      ],
      [
        2010,
        -20.199
      ],
      [
        2011,
        29.962
      ],
      [
        2012,
        27.095
      ],
      [
        2013,
        3.89
      ],
      [
        2014,
        -21.761999999999997
      ],
      [
        2015,
        -7.825
      ],
      [
        2016,
        -5.06
      ],
      [
        2017,
        52.825
      ],
      [
        2018,
        0.61
      ],
      [
        2019,
        17.245
      ],
      [
        2020,
        5.805
      ],
      [
        2021,
        6.435
      ],
      [
        2022,
        4.433
      ],
      [
        2023,
        4.363
      ],
      [
        2024,
        4.716
      ]
    ],
    "volume_import_bs": [
      [
        1980,
        "NA"
      ],
      [
        1981,
        "NA"
      ],
      [
        1982,
        "NA"
      ],
      [
        1983,
        "NA"
      ],
      [
        1984,
        "NA"
      ],
      [
        1985,
        "NA"
      ],
      [
        1986,
        "NA"
      ],
      [
        1987,
        "NA"
      ],
      [
        1988,
        "NA"
      ],
      [
        1989,
        "NA"
      ],
      [
        1990,
        10.1
      ],
      [
        1991,
        -30.175
      ],
      [
        1992,
        0.233
      ],
      [
        1993,
        -7.377000000000001
      ],
      [
        1994,
        -13.923
      ],
      [
        1995,
        -11.770999999999999
      ],
      [
        1996,
        -5.296
      ],
      [
        1997,
        -1.3219999999999998
      ],
      [
        1998,
        6.3229999999999995
      ],
      [
        1999,
        -7.6770000000000005
      ],
      [
        2000,
        3.548
      ],
      [
        2001,
        -7.496
      ],
      [
        2002,
        -1.3030000000000002
      ],
      [
        2003,
        18.344
      ],
      [
        2004,
        5.9910000000000005
      ],
      [
        2005,
        12.155999999999999
      ],
      [
        2006,
        20.938000000000002
      ],
      [
        2007,
        15.694
      ],
      [
        2008,
        8.079
      ],
      [
        2009,
        -19.070999999999998
      ],
      [
        2010,
        -17.986
      ],
      [
        2011,
        30.176
      ],
      [
        2012,
        18.99
      ],
      [
        2013,
        6.645
      ],
      [
        2014,
        -21.22
      ],
      [
        2015,
        -6.813
      ],
      [
        2016,
        -4.64
      ],
      [
        2017,
        50.396
      ],
      [
        2018,
        -2.8960000000000004
      ],
      [
        2019,
        15.321
      ],
      [
        2020,
        5.206
      ],
      [
        2021,
        5.941
      ],
      [
        2022,
        3.94
      ],
      [
        2023,
        3.845
      ],
      [
        2024,
        4.231
      ]
    ],
    "vuln_clim_ferdi": [
      [
        2018,
        63.850478491062795
      ]
    ],
    "vuln_clim_ndgain": [
      [
        1995,
        0.5174863046138221
      ],
      [
        1996,
        0.516509993292228
      ],
      [
        1997,
        0.518128878562056
      ],
      [
        1998,
        0.518529077394296
      ],
      [
        1999,
        0.519346901302934
      ],
      [
        2000,
        0.520061894654593
      ],
      [
        2001,
        0.520941348304306
      ],
      [
        2002,
        0.5239980532460179
      ],
      [
        2003,
        0.5051039606912671
      ],
      [
        2004,
        0.5030953661940379
      ],
      [
        2005,
        0.510052541044998
      ],
      [
        2006,
        0.5191316369379241
      ],
      [
        2007,
        0.517415865801795
      ],
      [
        2008,
        0.523120155415967
      ],
      [
        2009,
        0.518832205805505
      ],
      [
        2010,
        0.51287867600261
      ],
      [
        2011,
        0.508931802866284
      ],
      [
        2012,
        0.510989529484234
      ],
      [
        2013,
        0.515586346592916
      ],
      [
        2014,
        0.505745804993998
      ],
      [
        2015,
        0.502529819857325
      ],
      [
        2016,
        0.500717519225471
      ]
    ]
  }
}