{
  "dr": "DR_OCI",
  "dr_name": "Océan indien",
  "indicators": {
    "abo_mobile": [
      [
        1960,
        0.0
      ],
      [
        1961,
        "NA"
      ],
      [
        1962,
        "NA"
      ],
      [
        1963,
        "NA"
      ],
      [
        1964,
        "NA"
      ],
      [
        1965,
        0.0
      ],
      [
        1966,
        "NA"
      ],
      [
        1967,
        "NA"
      ],
      [
        1968,
        "NA"
      ],
      [
        1969,
        "NA"
      ],
      [
        1970,
        0.0
      ],
      [
        1971,
        "NA"
      ],
      [
        1972,
        "NA"
      ],
      [
        1973,
        "NA"
      ],
      [
        1974,
        "NA"
      ],
      [
        1975,
        0.0
      ],
      [
        1976,
        0.0
      ],
      [
        1977,
        0.0
      ],
      [
        1978,
        0.0
      ],
      [
        1979,
        0.0
      ],
      [
        1980,
        0.0
      ],
      [
        1981,
        0.0
      ],
      [
        1982,
        0.0
      ],
      [
        1983,
        0.0
      ],
      [
        1984,
        0.0
      ],
      [
        1985,
        0.0
      ],
      [
        1986,
        0.0
      ],
      [
        1987,
        0.0
      ],
      [
        1988,
        0.0
      ],
      [
        1989,
        0.0
      ],
      [
        1990,
        0.00055
      ],
      [
        1991,
        0.000625
      ],
      [
        1992,
        0.000728
      ],
      [
        1993,
        0.00100925
      ],
      [
        1994,
        0.0015015
      ],
      [
        1995,
        0.0032712499999999994
      ],
      [
        1996,
        0.006046500000000001
      ],
      [
        1997,
        0.0122155
      ],
      [
        1998,
        0.0196055
      ],
      [
        1999,
        0.03854675
      ],
      [
        2000,
        0.06726375
      ],
      [
        2001,
        0.11414975
      ],
      [
        2002,
        0.13881825
      ],
      [
        2003,
        0.199325
      ],
      [
        2004,
        0.236095
      ],
      [
        2005,
        0.3103565
      ],
      [
        2006,
        0.481375
      ],
      [
        2007,
        0.8214040000000001
      ],
      [
        2008,
        1.5134389999999998
      ],
      [
        2009,
        1.90095275
      ],
      [
        2010,
        2.2963715
      ],
      [
        2011,
        2.5794759999999997
      ],
      [
        2012,
        2.6710977500000004
      ],
      [
        2013,
        2.6197525
      ],
      [
        2014,
        2.97505475
      ],
      [
        2015,
        3.2572737499999995
      ],
      [
        2016,
        2.60462475
      ],
      [
        2017,
        2.80154875
      ],
      [
        2018,
        3.3126397500000007
      ],
      [
        2019,
        "NA"
      ]
    ],
    "acces_elec": [
      [
        1960,
        "NA"
      ],
      [
        1961,
        "NA"
      ],
      [
        1962,
        "NA"
      ],
      [
        1963,
        "NA"
      ],
      [
        1964,
        "NA"
      ],
      [
        1965,
        "NA"
      ],
      [
        1966,
        "NA"
      ],
      [
        1967,
        "NA"
      ],
      [
        1968,
        "NA"
      ],
      [
        1969,
        "NA"
      ],
      [
        1970,
        "NA"
      ],
      [
        1971,
        "NA"
      ],
      [
        1972,
        "NA"
      ],
      [
        1973,
        "NA"
      ],
      [
        1974,
        "NA"
      ],
      [
        1975,
        "NA"
      ],
      [
        1976,
        "NA"
      ],
      [
        1977,
        "NA"
      ],
      [
        1978,
        "NA"
      ],
      [
        1979,
        "NA"
      ],
      [
        1980,
        "NA"
      ],
      [
        1981,
        "NA"
      ],
      [
        1982,
        "NA"
      ],
      [
        1983,
        "NA"
      ],
      [
        1984,
        "NA"
      ],
      [
        1985,
        "NA"
      ],
      [
        1986,
        "NA"
      ],
      [
        1987,
        "NA"
      ],
      [
        1988,
        "NA"
      ],
      [
        1989,
        "NA"
      ],
      [
        1990,
        "NA"
      ],
      [
        1991,
        "NA"
      ],
      [
        1992,
        9.2
      ],
      [
        1993,
        10.310373306300002
      ],
      [
        1994,
        11.228038577267224
      ],
      [
        1995,
        11.695408584919939
      ],
      [
        1996,
        12.153442520915535
      ],
      [
        1997,
        11.340489285854654
      ],
      [
        1998,
        13.076020324632891
      ],
      [
        1999,
        13.53864136104477
      ],
      [
        2000,
        19.91196948579784
      ],
      [
        2001,
        20.937075136859985
      ],
      [
        2002,
        20.51924258539453
      ],
      [
        2003,
        25.776709696672484
      ],
      [
        2004,
        20.99728790038106
      ],
      [
        2005,
        22.116458867163814
      ],
      [
        2006,
        22.387900448308816
      ],
      [
        2007,
        22.632027586146172
      ],
      [
        2008,
        22.8994324549926
      ],
      [
        2009,
        23.42360462982289
      ],
      [
        2010,
        23.867832674924262
      ],
      [
        2011,
        20.741444610020288
      ],
      [
        2012,
        24.36708940748357
      ],
      [
        2013,
        19.124365665518607
      ],
      [
        2014,
        25.27897289363571
      ],
      [
        2015,
        25.814800570698424
      ],
      [
        2016,
        28.23648086494173
      ],
      [
        2017,
        29.32819590888925
      ],
      [
        2018,
        30.985095765743065
      ],
      [
        2019,
        "NA"
      ]
    ],
    "acces_elec_primaire": [
      [
        2000,
        "NA"
      ],
      [
        2001,
        "NA"
      ],
      [
        2002,
        "NA"
      ],
      [
        2003,
        "NA"
      ],
      [
        2004,
        "NA"
      ],
      [
        2005,
        "NA"
      ],
      [
        2006,
        "NA"
      ],
      [
        2007,
        "NA"
      ],
      [
        2008,
        "NA"
      ],
      [
        2009,
        "NA"
      ],
      [
        2010,
        100.0
      ],
      [
        2011,
        100.0
      ],
      [
        2012,
        97.5
      ],
      [
        2013,
        100.0
      ],
      [
        2014,
        100.0
      ],
      [
        2015,
        100.0
      ],
      [
        2016,
        13.257751025228796
      ],
      [
        2017,
        14.350872513054002
      ],
      [
        2018,
        12.84632997104348
      ],
      [
        2019,
        "NA"
      ]
    ],
    "alpha_adulte": [
      [
        1960,
        "NA"
      ],
      [
        1961,
        "NA"
      ],
      [
        1962,
        "NA"
      ],
      [
        1963,
        "NA"
      ],
      [
        1964,
        "NA"
      ],
      [
        1965,
        "NA"
      ],
      [
        1966,
        "NA"
      ],
      [
        1967,
        "NA"
      ],
      [
        1968,
        "NA"
      ],
      [
        1969,
        "NA"
      ],
      [
        1970,
        "NA"
      ],
      [
        1971,
        "NA"
      ],
      [
        1972,
        "NA"
      ],
      [
        1973,
        "NA"
      ],
      [
        1974,
        "NA"
      ],
      [
        1975,
        "NA"
      ],
      [
        1976,
        "NA"
      ],
      [
        1977,
        "NA"
      ],
      [
        1978,
        "NA"
      ],
      [
        1979,
        "NA"
      ],
      [
        1980,
        47.91923
      ],
      [
        1981,
        "NA"
      ],
      [
        1982,
        "NA"
      ],
      [
        1983,
        "NA"
      ],
      [
        1984,
        "NA"
      ],
      [
        1985,
        "NA"
      ],
      [
        1986,
        "NA"
      ],
      [
        1987,
        84.22922
      ],
      [
        1988,
        "NA"
      ],
      [
        1989,
        "NA"
      ],
      [
        1990,
        79.86865999999998
      ],
      [
        1991,
        "NA"
      ],
      [
        1992,
        "NA"
      ],
      [
        1993,
        "NA"
      ],
      [
        1994,
        87.81115
      ],
      [
        1995,
        "NA"
      ],
      [
        1996,
        "NA"
      ],
      [
        1997,
        "NA"
      ],
      [
        1998,
        "NA"
      ],
      [
        1999,
        "NA"
      ],
      [
        2000,
        71.54053353731854
      ],
      [
        2001,
        "NA"
      ],
      [
        2002,
        91.83646
      ],
      [
        2003,
        "NA"
      ],
      [
        2004,
        "NA"
      ],
      [
        2005,
        "NA"
      ],
      [
        2006,
        "NA"
      ],
      [
        2007,
        "NA"
      ],
      [
        2008,
        "NA"
      ],
      [
        2009,
        64.48091
      ],
      [
        2010,
        93.95423
      ],
      [
        2011,
        89.24984
      ],
      [
        2012,
        71.94733162602341
      ],
      [
        2013,
        91.49003
      ],
      [
        2014,
        92.47476
      ],
      [
        2015,
        92.7076
      ],
      [
        2016,
        93.15784
      ],
      [
        2017,
        "NA"
      ],
      [
        2018,
        75.1442430488185
      ],
      [
        2019,
        "NA"
      ]
    ],
    "alpha_jeune": [
      [
        1960,
        "NA"
      ],
      [
        1961,
        "NA"
      ],
      [
        1962,
        "NA"
      ],
      [
        1963,
        "NA"
      ],
      [
        1964,
        "NA"
      ],
      [
        1965,
        "NA"
      ],
      [
        1966,
        "NA"
      ],
      [
        1967,
        "NA"
      ],
      [
        1968,
        "NA"
      ],
      [
        1969,
        "NA"
      ],
      [
        1970,
        "NA"
      ],
      [
        1971,
        "NA"
      ],
      [
        1972,
        "NA"
      ],
      [
        1973,
        "NA"
      ],
      [
        1974,
        "NA"
      ],
      [
        1975,
        "NA"
      ],
      [
        1976,
        "NA"
      ],
      [
        1977,
        "NA"
      ],
      [
        1978,
        "NA"
      ],
      [
        1979,
        "NA"
      ],
      [
        1980,
        61.71301999999999
      ],
      [
        1981,
        "NA"
      ],
      [
        1982,
        "NA"
      ],
      [
        1983,
        "NA"
      ],
      [
        1984,
        "NA"
      ],
      [
        1985,
        "NA"
      ],
      [
        1986,
        "NA"
      ],
      [
        1987,
        97.64999
      ],
      [
        1988,
        "NA"
      ],
      [
        1989,
        "NA"
      ],
      [
        1990,
        91.19199
      ],
      [
        1991,
        "NA"
      ],
      [
        1992,
        "NA"
      ],
      [
        1993,
        "NA"
      ],
      [
        1994,
        98.81331
      ],
      [
        1995,
        "NA"
      ],
      [
        1996,
        "NA"
      ],
      [
        1997,
        "NA"
      ],
      [
        1998,
        "NA"
      ],
      [
        1999,
        "NA"
      ],
      [
        2000,
        72.19105430742617
      ],
      [
        2001,
        "NA"
      ],
      [
        2002,
        99.06476999999998
      ],
      [
        2003,
        "NA"
      ],
      [
        2004,
        "NA"
      ],
      [
        2005,
        "NA"
      ],
      [
        2006,
        "NA"
      ],
      [
        2007,
        "NA"
      ],
      [
        2008,
        "NA"
      ],
      [
        2009,
        64.94025
      ],
      [
        2010,
        98.97133999999998
      ],
      [
        2011,
        98.13035
      ],
      [
        2012,
        76.6644998171853
      ],
      [
        2013,
        "NA"
      ],
      [
        2014,
        "NA"
      ],
      [
        2015,
        "NA"
      ],
      [
        2016,
        "NA"
      ],
      [
        2017,
        "NA"
      ],
      [
        2018,
        81.9682327703887
      ],
      [
        2019,
        "NA"
      ]
    ],
    "bidonvilles": [
      [
        1960,
        "NA"
      ],
      [
        1961,
        "NA"
      ],
      [
        1962,
        "NA"
      ],
      [
        1963,
        "NA"
      ],
      [
        1964,
        "NA"
      ],
      [
        1965,
        "NA"
      ],
      [
        1966,
        "NA"
      ],
      [
        1967,
        "NA"
      ],
      [
        1968,
        "NA"
      ],
      [
        1969,
        "NA"
      ],
      [
        1970,
        "NA"
      ],
      [
        1971,
        "NA"
      ],
      [
        1972,
        "NA"
      ],
      [
        1973,
        "NA"
      ],
      [
        1974,
        "NA"
      ],
      [
        1975,
        "NA"
      ],
      [
        1976,
        "NA"
      ],
      [
        1977,
        "NA"
      ],
      [
        1978,
        "NA"
      ],
      [
        1979,
        "NA"
      ],
      [
        1980,
        "NA"
      ],
      [
        1981,
        "NA"
      ],
      [
        1982,
        "NA"
      ],
      [
        1983,
        "NA"
      ],
      [
        1984,
        "NA"
      ],
      [
        1985,
        "NA"
      ],
      [
        1986,
        "NA"
      ],
      [
        1987,
        "NA"
      ],
      [
        1988,
        "NA"
      ],
      [
        1989,
        "NA"
      ],
      [
        1990,
        92.05413990926235
      ],
      [
        1991,
        "NA"
      ],
      [
        1992,
        "NA"
      ],
      [
        1993,
        "NA"
      ],
      [
        1994,
        "NA"
      ],
      [
        1995,
        87.80942558538244
      ],
      [
        1996,
        "NA"
      ],
      [
        1997,
        "NA"
      ],
      [
        1998,
        "NA"
      ],
      [
        1999,
        "NA"
      ],
      [
        2000,
        83.47813633354451
      ],
      [
        2001,
        "NA"
      ],
      [
        2002,
        "NA"
      ],
      [
        2003,
        "NA"
      ],
      [
        2004,
        "NA"
      ],
      [
        2005,
        80.2223399123227
      ],
      [
        2006,
        "NA"
      ],
      [
        2007,
        77.7091557472796
      ],
      [
        2008,
        "NA"
      ],
      [
        2009,
        76.2
      ],
      [
        2010,
        "NA"
      ],
      [
        2011,
        "NA"
      ],
      [
        2012,
        "NA"
      ],
      [
        2013,
        "NA"
      ],
      [
        2014,
        76.9629759699651
      ],
      [
        2015,
        "NA"
      ],
      [
        2016,
        "NA"
      ],
      [
        2017,
        "NA"
      ],
      [
        2018,
        "NA"
      ],
      [
        2019,
        "NA"
      ]
    ],
    "compte_adulte": [
      [
        1960,
        "NA"
      ],
      [
        1961,
        "NA"
      ],
      [
        1962,
        "NA"
      ],
      [
        1963,
        "NA"
      ],
      [
        1964,
        "NA"
      ],
      [
        1965,
        "NA"
      ],
      [
        1966,
        "NA"
      ],
      [
        1967,
        "NA"
      ],
      [
        1968,
        "NA"
      ],
      [
        1969,
        "NA"
      ],
      [
        1970,
        "NA"
      ],
      [
        1971,
        "NA"
      ],
      [
        1972,
        "NA"
      ],
      [
        1973,
        "NA"
      ],
      [
        1974,
        "NA"
      ],
      [
        1975,
        "NA"
      ],
      [
        1976,
        "NA"
      ],
      [
        1977,
        "NA"
      ],
      [
        1978,
        "NA"
      ],
      [
        1979,
        "NA"
      ],
      [
        1980,
        "NA"
      ],
      [
        1981,
        "NA"
      ],
      [
        1982,
        "NA"
      ],
      [
        1983,
        "NA"
      ],
      [
        1984,
        "NA"
      ],
      [
        1985,
        "NA"
      ],
      [
        1986,
        "NA"
      ],
      [
        1987,
        "NA"
      ],
      [
        1988,
        "NA"
      ],
      [
        1989,
        "NA"
      ],
      [
        1990,
        "NA"
      ],
      [
        1991,
        "NA"
      ],
      [
        1992,
        "NA"
      ],
      [
        1993,
        "NA"
      ],
      [
        1994,
        "NA"
      ],
      [
        1995,
        "NA"
      ],
      [
        1996,
        "NA"
      ],
      [
        1997,
        "NA"
      ],
      [
        1998,
        "NA"
      ],
      [
        1999,
        "NA"
      ],
      [
        2000,
        "NA"
      ],
      [
        2001,
        "NA"
      ],
      [
        2002,
        "NA"
      ],
      [
        2003,
        "NA"
      ],
      [
        2004,
        "NA"
      ],
      [
        2005,
        "NA"
      ],
      [
        2006,
        "NA"
      ],
      [
        2007,
        "NA"
      ],
      [
        2008,
        "NA"
      ],
      [
        2009,
        "NA"
      ],
      [
        2010,
        "NA"
      ],
      [
        2011,
        39.05700333913333
      ],
      [
        2012,
        "NA"
      ],
      [
        2013,
        "NA"
      ],
      [
        2014,
        47.4757013321
      ],
      [
        2015,
        "NA"
      ],
      [
        2016,
        "NA"
      ],
      [
        2017,
        55.16353702545
      ],
      [
        2018,
        "NA"
      ],
      [
        2019,
        "NA"
      ]
    ],
    "compte_jeune": [
      [
        1960,
        "NA"
      ],
      [
        1961,
        "NA"
      ],
      [
        1962,
        "NA"
      ],
      [
        1963,
        "NA"
      ],
      [
        1964,
        "NA"
      ],
      [
        1965,
        "NA"
      ],
      [
        1966,
        "NA"
      ],
      [
        1967,
        "NA"
      ],
      [
        1968,
        "NA"
      ],
      [
        1969,
        "NA"
      ],
      [
        1970,
        "NA"
      ],
      [
        1971,
        "NA"
      ],
      [
        1972,
        "NA"
      ],
      [
        1973,
        "NA"
      ],
      [
        1974,
        "NA"
      ],
      [
        1975,
        "NA"
      ],
      [
        1976,
        "NA"
      ],
      [
        1977,
        "NA"
      ],
      [
        1978,
        "NA"
      ],
      [
        1979,
        "NA"
      ],
      [
        1980,
        "NA"
      ],
      [
        1981,
        "NA"
      ],
      [
        1982,
        "NA"
      ],
      [
        1983,
        "NA"
      ],
      [
        1984,
        "NA"
      ],
      [
        1985,
        "NA"
      ],
      [
        1986,
        "NA"
      ],
      [
        1987,
        "NA"
      ],
      [
        1988,
        "NA"
      ],
      [
        1989,
        "NA"
      ],
      [
        1990,
        "NA"
      ],
      [
        1991,
        "NA"
      ],
      [
        1992,
        "NA"
      ],
      [
        1993,
        "NA"
      ],
      [
        1994,
        "NA"
      ],
      [
        1995,
        "NA"
      ],
      [
        1996,
        "NA"
      ],
      [
        1997,
        "NA"
      ],
      [
        1998,
        "NA"
      ],
      [
        1999,
        "NA"
      ],
      [
        2000,
        "NA"
      ],
      [
        2001,
        "NA"
      ],
      [
        2002,
        "NA"
      ],
      [
        2003,
        "NA"
      ],
      [
        2004,
        "NA"
      ],
      [
        2005,
        "NA"
      ],
      [
        2006,
        "NA"
      ],
      [
        2007,
        "NA"
      ],
      [
        2008,
        "NA"
      ],
      [
        2009,
        "NA"
      ],
      [
        2010,
        "NA"
      ],
      [
        2011,
        27.984516541133328
      ],
      [
        2012,
        "NA"
      ],
      [
        2013,
        "NA"
      ],
      [
        2014,
        37.769469738000005
      ],
      [
        2015,
        "NA"
      ],
      [
        2016,
        "NA"
      ],
      [
        2017,
        48.5498008728
      ],
      [
        2018,
        "NA"
      ],
      [
        2019,
        "NA"
      ]
    ],
    "croissance_pib": [
      [
        1980,
        -1.157984502764308
      ],
      [
        1981,
        -6.316521548564357
      ],
      [
        1982,
        -0.07313688476298727
      ],
      [
        1983,
        0.8743082171261011
      ],
      [
        1984,
        2.4599206331292782
      ],
      [
        1985,
        2.672149233114481
      ],
      [
        1986,
        3.6223239876721993
      ],
      [
        1987,
        3.0988379669578494
      ],
      [
        1988,
        4.249536145670272
      ],
      [
        1989,
        4.130180859962024
      ],
      [
        1990,
        4.31867572674298
      ],
      [
        1991,
        -3.110765843766261
      ],
      [
        1992,
        3.114211566690217
      ],
      [
        1993,
        3.1106212940102327
      ],
      [
        1994,
        0.9637710532241556
      ],
      [
        1995,
        2.46228900214587
      ],
      [
        1996,
        3.1745740781371032
      ],
      [
        1997,
        4.614705641004747
      ],
      [
        1998,
        4.675245019711691
      ],
      [
        1999,
        3.8469362798492823
      ],
      [
        2000,
        5.913538519780081
      ],
      [
        2001,
        4.813668046414418
      ],
      [
        2002,
        -6.8301111518555375
      ],
      [
        2003,
        7.774727734077081
      ],
      [
        2004,
        4.615396102860356
      ],
      [
        2005,
        3.7558423033687633
      ],
      [
        2006,
        5.037923760602681
      ],
      [
        2007,
        6.0573756511920145
      ],
      [
        2008,
        5.944991593186605
      ],
      [
        2009,
        -1.216574408211664
      ],
      [
        2010,
        2.1782355226230083
      ],
      [
        2011,
        2.7312237300714792
      ],
      [
        2012,
        3.1313658643342763
      ],
      [
        2013,
        2.8639227373381955
      ],
      [
        2014,
        3.4852309389834386
      ],
      [
        2015,
        3.284684852718796
      ],
      [
        2016,
        3.93601286591496
      ],
      [
        2017,
        3.901293128558783
      ],
      [
        2018,
        4.220839952352172
      ],
      [
        2019,
        "NA"
      ]
    ],
    "eau_douce_agri": [
      [
        1960,
        "NA"
      ],
      [
        1961,
        "NA"
      ],
      [
        1962,
        "NA"
      ],
      [
        1963,
        "NA"
      ],
      [
        1964,
        "NA"
      ],
      [
        1965,
        "NA"
      ],
      [
        1966,
        "NA"
      ],
      [
        1967,
        "NA"
      ],
      [
        1968,
        "NA"
      ],
      [
        1969,
        "NA"
      ],
      [
        1970,
        "NA"
      ],
      [
        1971,
        "NA"
      ],
      [
        1972,
        "NA"
      ],
      [
        1973,
        "NA"
      ],
      [
        1974,
        "NA"
      ],
      [
        1975,
        76.89
      ],
      [
        1976,
        "NA"
      ],
      [
        1977,
        "NA"
      ],
      [
        1978,
        "NA"
      ],
      [
        1979,
        "NA"
      ],
      [
        1980,
        "NA"
      ],
      [
        1981,
        "NA"
      ],
      [
        1982,
        "NA"
      ],
      [
        1983,
        "NA"
      ],
      [
        1984,
        99.02
      ],
      [
        1985,
        "NA"
      ],
      [
        1986,
        "NA"
      ],
      [
        1987,
        "NA"
      ],
      [
        1988,
        "NA"
      ],
      [
        1989,
        7.563
      ],
      [
        1990,
        "NA"
      ],
      [
        1991,
        "NA"
      ],
      [
        1992,
        "NA"
      ],
      [
        1993,
        "NA"
      ],
      [
        1994,
        "NA"
      ],
      [
        1995,
        74.8
      ],
      [
        1996,
        "NA"
      ],
      [
        1997,
        "NA"
      ],
      [
        1998,
        "NA"
      ],
      [
        1999,
        47.0
      ],
      [
        2000,
        97.23
      ],
      [
        2001,
        "NA"
      ],
      [
        2002,
        "NA"
      ],
      [
        2003,
        67.72
      ],
      [
        2004,
        "NA"
      ],
      [
        2005,
        6.569
      ],
      [
        2006,
        95.87
      ],
      [
        2007,
        "NA"
      ],
      [
        2008,
        "NA"
      ],
      [
        2009,
        "NA"
      ],
      [
        2010,
        "NA"
      ],
      [
        2011,
        "NA"
      ],
      [
        2012,
        "NA"
      ],
      [
        2013,
        "NA"
      ],
      [
        2014,
        "NA"
      ],
      [
        2015,
        "NA"
      ],
      [
        2016,
        "NA"
      ],
      [
        2017,
        "NA"
      ],
      [
        2018,
        "NA"
      ],
      [
        2019,
        "NA"
      ]
    ],
    "eau_potable_primaire": [
      [
        2000,
        "NA"
      ],
      [
        2001,
        "NA"
      ],
      [
        2002,
        "NA"
      ],
      [
        2003,
        "NA"
      ],
      [
        2004,
        "NA"
      ],
      [
        2005,
        "NA"
      ],
      [
        2006,
        "NA"
      ],
      [
        2007,
        "NA"
      ],
      [
        2008,
        "NA"
      ],
      [
        2009,
        "NA"
      ],
      [
        2010,
        100.0
      ],
      [
        2011,
        100.0
      ],
      [
        2012,
        "NA"
      ],
      [
        2013,
        100.0
      ],
      [
        2014,
        100.0
      ],
      [
        2015,
        100.0
      ],
      [
        2016,
        100.0
      ],
      [
        2017,
        100.0
      ],
      [
        2018,
        100.0
      ],
      [
        2019,
        "NA"
      ]
    ],
    "emploi_agri": [
      [
        1960,
        "NA"
      ],
      [
        1961,
        "NA"
      ],
      [
        1962,
        "NA"
      ],
      [
        1963,
        "NA"
      ],
      [
        1964,
        "NA"
      ],
      [
        1965,
        "NA"
      ],
      [
        1966,
        "NA"
      ],
      [
        1967,
        "NA"
      ],
      [
        1968,
        "NA"
      ],
      [
        1969,
        "NA"
      ],
      [
        1970,
        "NA"
      ],
      [
        1971,
        "NA"
      ],
      [
        1972,
        "NA"
      ],
      [
        1973,
        "NA"
      ],
      [
        1974,
        "NA"
      ],
      [
        1975,
        "NA"
      ],
      [
        1976,
        "NA"
      ],
      [
        1977,
        "NA"
      ],
      [
        1978,
        "NA"
      ],
      [
        1979,
        "NA"
      ],
      [
        1980,
        "NA"
      ],
      [
        1981,
        "NA"
      ],
      [
        1982,
        "NA"
      ],
      [
        1983,
        "NA"
      ],
      [
        1984,
        "NA"
      ],
      [
        1985,
        "NA"
      ],
      [
        1986,
        "NA"
      ],
      [
        1987,
        "NA"
      ],
      [
        1988,
        "NA"
      ],
      [
        1989,
        "NA"
      ],
      [
        1990,
        "NA"
      ],
      [
        1991,
        69.95555222794664
      ],
      [
        1992,
        70.05107092173121
      ],
      [
        1993,
        70.13303901919001
      ],
      [
        1994,
        70.31594246861859
      ],
      [
        1995,
        70.50418020753173
      ],
      [
        1996,
        70.56981744447495
      ],
      [
        1997,
        70.70254546454584
      ],
      [
        1998,
        70.86065880674107
      ],
      [
        1999,
        71.01916184343851
      ],
      [
        2000,
        71.36218281629246
      ],
      [
        2001,
        71.9092444854896
      ],
      [
        2002,
        72.94165685975683
      ],
      [
        2003,
        73.17404025141906
      ],
      [
        2004,
        75.17071877160178
      ],
      [
        2005,
        76.79668246078894
      ],
      [
        2006,
        75.48580447756197
      ],
      [
        2007,
        73.99432709891269
      ],
      [
        2008,
        72.31649929015745
      ],
      [
        2009,
        70.9655128545769
      ],
      [
        2010,
        69.27103165565721
      ],
      [
        2011,
        67.35070516174264
      ],
      [
        2012,
        65.24301375347106
      ],
      [
        2013,
        64.40878464437809
      ],
      [
        2014,
        63.71104495444161
      ],
      [
        2015,
        63.11909094534951
      ],
      [
        2016,
        62.5728350698911
      ],
      [
        2017,
        62.126447541520264
      ],
      [
        2018,
        61.65140857385194
      ],
      [
        2019,
        61.278933021606825
      ]
    ],
    "enseignant_primaire": [
      [
        1960,
        "NA"
      ],
      [
        1961,
        "NA"
      ],
      [
        1962,
        "NA"
      ],
      [
        1963,
        "NA"
      ],
      [
        1964,
        "NA"
      ],
      [
        1965,
        "NA"
      ],
      [
        1966,
        "NA"
      ],
      [
        1967,
        "NA"
      ],
      [
        1968,
        "NA"
      ],
      [
        1969,
        "NA"
      ],
      [
        1970,
        "NA"
      ],
      [
        1971,
        "NA"
      ],
      [
        1972,
        "NA"
      ],
      [
        1973,
        "NA"
      ],
      [
        1974,
        "NA"
      ],
      [
        1975,
        "NA"
      ],
      [
        1976,
        "NA"
      ],
      [
        1977,
        "NA"
      ],
      [
        1978,
        "NA"
      ],
      [
        1979,
        "NA"
      ],
      [
        1980,
        "NA"
      ],
      [
        1981,
        "NA"
      ],
      [
        1982,
        "NA"
      ],
      [
        1983,
        "NA"
      ],
      [
        1984,
        "NA"
      ],
      [
        1985,
        "NA"
      ],
      [
        1986,
        "NA"
      ],
      [
        1987,
        "NA"
      ],
      [
        1988,
        "NA"
      ],
      [
        1989,
        "NA"
      ],
      [
        1990,
        "NA"
      ],
      [
        1991,
        "NA"
      ],
      [
        1992,
        "NA"
      ],
      [
        1993,
        "NA"
      ],
      [
        1994,
        "NA"
      ],
      [
        1995,
        "NA"
      ],
      [
        1996,
        "NA"
      ],
      [
        1997,
        "NA"
      ],
      [
        1998,
        98.96362403516059
      ],
      [
        1999,
        98.87091953523418
      ],
      [
        2000,
        98.79353388651026
      ],
      [
        2001,
        98.55803475396273
      ],
      [
        2002,
        100.0
      ],
      [
        2003,
        77.92593000000002
      ],
      [
        2004,
        100.0
      ],
      [
        2005,
        100.0
      ],
      [
        2006,
        100.0
      ],
      [
        2007,
        100.0
      ],
      [
        2008,
        85.24458618228086
      ],
      [
        2009,
        99.95639263461823
      ],
      [
        2010,
        100.0
      ],
      [
        2011,
        83.94477559558473
      ],
      [
        2012,
        25.38341711472832
      ],
      [
        2013,
        23.296070548655038
      ],
      [
        2014,
        21.070354028074465
      ],
      [
        2015,
        19.50722915497972
      ],
      [
        2016,
        19.214148900769068
      ],
      [
        2017,
        19.08366216363565
      ],
      [
        2018,
        18.86714502390776
      ],
      [
        2019,
        "NA"
      ]
    ],
    "enseignant_secondaire": [
      [
        1960,
        "NA"
      ],
      [
        1961,
        "NA"
      ],
      [
        1962,
        "NA"
      ],
      [
        1963,
        "NA"
      ],
      [
        1964,
        "NA"
      ],
      [
        1965,
        "NA"
      ],
      [
        1966,
        "NA"
      ],
      [
        1967,
        "NA"
      ],
      [
        1968,
        "NA"
      ],
      [
        1969,
        "NA"
      ],
      [
        1970,
        "NA"
      ],
      [
        1971,
        "NA"
      ],
      [
        1972,
        "NA"
      ],
      [
        1973,
        "NA"
      ],
      [
        1974,
        "NA"
      ],
      [
        1975,
        "NA"
      ],
      [
        1976,
        "NA"
      ],
      [
        1977,
        "NA"
      ],
      [
        1978,
        "NA"
      ],
      [
        1979,
        "NA"
      ],
      [
        1980,
        "NA"
      ],
      [
        1981,
        "NA"
      ],
      [
        1982,
        "NA"
      ],
      [
        1983,
        "NA"
      ],
      [
        1984,
        "NA"
      ],
      [
        1985,
        "NA"
      ],
      [
        1986,
        "NA"
      ],
      [
        1987,
        "NA"
      ],
      [
        1988,
        "NA"
      ],
      [
        1989,
        "NA"
      ],
      [
        1990,
        "NA"
      ],
      [
        1991,
        "NA"
      ],
      [
        1992,
        "NA"
      ],
      [
        1993,
        "NA"
      ],
      [
        1994,
        "NA"
      ],
      [
        1995,
        "NA"
      ],
      [
        1996,
        "NA"
      ],
      [
        1997,
        "NA"
      ],
      [
        1998,
        87.56756999999998
      ],
      [
        1999,
        85.54422
      ],
      [
        2000,
        86.26760999999998
      ],
      [
        2001,
        84.38095
      ],
      [
        2002,
        "NA"
      ],
      [
        2003,
        55.511705988795576
      ],
      [
        2004,
        "NA"
      ],
      [
        2005,
        "NA"
      ],
      [
        2006,
        "NA"
      ],
      [
        2007,
        "NA"
      ],
      [
        2008,
        98.53748
      ],
      [
        2009,
        93.28859
      ],
      [
        2010,
        "NA"
      ],
      [
        2011,
        "NA"
      ],
      [
        2012,
        46.78870417011926
      ],
      [
        2013,
        48.198516525788314
      ],
      [
        2014,
        21.494944745869713
      ],
      [
        2015,
        36.016976557469775
      ],
      [
        2016,
        88.71473
      ],
      [
        2017,
        22.703408460806152
      ],
      [
        2018,
        21.961733832211095
      ],
      [
        2019,
        "NA"
      ]
    ],
    "idh": [
      [
        1990,
        0.619
      ],
      [
        1991,
        0.626
      ],
      [
        1992,
        0.633
      ],
      [
        1993,
        0.638
      ],
      [
        1994,
        0.643
      ],
      [
        1995,
        0.648
      ],
      [
        1996,
        0.652
      ],
      [
        1997,
        0.6559999999999999
      ],
      [
        1998,
        0.662
      ],
      [
        1999,
        0.667
      ],
      [
        2000,
        0.6156666666666667
      ],
      [
        2001,
        0.6193333333333334
      ],
      [
        2002,
        0.62
      ],
      [
        2003,
        0.626
      ],
      [
        2004,
        0.585
      ],
      [
        2005,
        0.59425
      ],
      [
        2006,
        0.59625
      ],
      [
        2007,
        0.6065
      ],
      [
        2008,
        0.6112500000000001
      ],
      [
        2009,
        0.61525
      ],
      [
        2010,
        0.6205
      ],
      [
        2011,
        0.6225
      ],
      [
        2012,
        0.63425
      ],
      [
        2013,
        0.63975
      ],
      [
        2014,
        0.64525
      ],
      [
        2015,
        0.64725
      ],
      [
        2016,
        0.6499999999999999
      ],
      [
        2017,
        0.65225
      ]
    ],
    "migration": [
      [
        1955,
        3.4963333333333337
      ],
      [
        1960,
        -0.2756666666666661
      ],
      [
        1965,
        -1.0138333333333336
      ],
      [
        1970,
        -1.4476666666666669
      ],
      [
        1975,
        -2.8058333333333336
      ],
      [
        1980,
        -1.7041666666666666
      ],
      [
        1985,
        -0.5963333333333333
      ],
      [
        1990,
        -1.743166666666667
      ],
      [
        1995,
        3.5868333333333333
      ],
      [
        2000,
        0.8221666666666666
      ],
      [
        2005,
        -0.09183333333333324
      ],
      [
        2010,
        -2.7158333333333338
      ],
      [
        2015,
        -1.9238333333333333
      ],
      [
        2020,
        -0.9973333333333332
      ],
      [
        2025,
        -0.8216666666666667
      ],
      [
        2030,
        -0.7753333333333333
      ],
      [
        2035,
        -0.7373333333333334
      ],
      [
        2040,
        -0.706
      ],
      [
        2045,
        -0.6806666666666666
      ],
      [
        2050,
        -0.6615000000000001
      ],
      [
        2055,
        -0.6478333333333333
      ],
      [
        2060,
        -0.6383333333333333
      ],
      [
        2065,
        -0.6321666666666667
      ],
      [
        2070,
        -0.6281666666666667
      ],
      [
        2075,
        -0.626
      ],
      [
        2080,
        -0.6251666666666666
      ],
      [
        2085,
        -0.6265000000000001
      ],
      [
        2090,
        -0.6296666666666667
      ],
      [
        2095,
        -0.6353333333333333
      ],
      [
        2100,
        -0.6435
      ]
    ],
    "mortal_infant": [
      [
        1960,
        102.26009683221548
      ],
      [
        1961,
        98.78837391737015
      ],
      [
        1962,
        93.79798384922348
      ],
      [
        1963,
        87.85424349642895
      ],
      [
        1964,
        84.53578200932006
      ],
      [
        1965,
        86.92625342627557
      ],
      [
        1966,
        92.5941443667744
      ],
      [
        1967,
        95.49511275625194
      ],
      [
        1968,
        140.96393593930765
      ],
      [
        1969,
        141.76717762652837
      ],
      [
        1970,
        145.31079907426883
      ],
      [
        1971,
        146.6058769672381
      ],
      [
        1972,
        148.23281224091485
      ],
      [
        1973,
        149.92604018000608
      ],
      [
        1974,
        151.6805741895628
      ],
      [
        1975,
        153.11956292172874
      ],
      [
        1976,
        154.33030559184064
      ],
      [
        1977,
        155.58926189733273
      ],
      [
        1978,
        156.7197108353283
      ],
      [
        1979,
        158.17233109496772
      ],
      [
        1980,
        159.98839258413608
      ],
      [
        1981,
        162.09968878295868
      ],
      [
        1982,
        164.1106226365215
      ],
      [
        1983,
        165.42135751383498
      ],
      [
        1984,
        165.72274047629998
      ],
      [
        1985,
        165.16336709992524
      ],
      [
        1986,
        163.46907810772547
      ],
      [
        1987,
        160.50106357919628
      ],
      [
        1988,
        156.18536785953864
      ],
      [
        1989,
        151.4387061422464
      ],
      [
        1990,
        146.69756018746006
      ],
      [
        1991,
        142.14780554139375
      ],
      [
        1992,
        138.05581340629848
      ],
      [
        1993,
        134.1850036275849
      ],
      [
        1994,
        130.35911331920178
      ],
      [
        1995,
        126.39038080072756
      ],
      [
        1996,
        121.89231011468493
      ],
      [
        1997,
        116.91000911436684
      ],
      [
        1998,
        111.60004509756241
      ],
      [
        1999,
        106.08009235453078
      ],
      [
        2000,
        100.720750224292
      ],
      [
        2001,
        95.54303933571327
      ],
      [
        2002,
        90.8350207580522
      ],
      [
        2003,
        86.41080867118272
      ],
      [
        2004,
        82.51017355726542
      ],
      [
        2005,
        78.94880990682563
      ],
      [
        2006,
        75.73026942694713
      ],
      [
        2007,
        72.7637907004337
      ],
      [
        2008,
        69.9303959171399
      ],
      [
        2009,
        67.35677889895993
      ],
      [
        2010,
        64.86940228901373
      ],
      [
        2011,
        62.76047897368942
      ],
      [
        2012,
        60.90787777351703
      ],
      [
        2013,
        59.23221932229738
      ],
      [
        2014,
        57.74080858343663
      ],
      [
        2015,
        56.34677275755629
      ],
      [
        2016,
        54.94511413737968
      ],
      [
        2017,
        53.64432984213806
      ],
      [
        2018,
        52.17665252253458
      ],
      [
        2019,
        "NA"
      ]
    ],
    "pib": [
      [
        1980,
        5.6560000000000015
      ],
      [
        1981,
        5.1240000000000006
      ],
      [
        1982,
        4.9910000000000005
      ],
      [
        1983,
        5.0360000000000005
      ],
      [
        1984,
        4.372
      ],
      [
        1985,
        4.324999999999998
      ],
      [
        1986,
        5.218
      ],
      [
        1987,
        5.02
      ],
      [
        1988,
        5.257999999999999
      ],
      [
        1989,
        5.3870000000000005
      ],
      [
        1990,
        6.557
      ],
      [
        1991,
        6.428
      ],
      [
        1992,
        7.223
      ],
      [
        1993,
        7.727
      ],
      [
        1994,
        7.611999999999999
      ],
      [
        1995,
        8.440000000000001
      ],
      [
        1996,
        9.419
      ],
      [
        1997,
        8.724000000000002
      ],
      [
        1998,
        9.005
      ],
      [
        1999,
        9.252
      ],
      [
        2000,
        9.701
      ],
      [
        2001,
        10.342
      ],
      [
        2002,
        10.577
      ],
      [
        2003,
        12.8
      ],
      [
        2004,
        12.694
      ],
      [
        2005,
        13.389000000000001
      ],
      [
        2006,
        14.25
      ],
      [
        2007,
        17.323
      ],
      [
        2008,
        21.317000000000004
      ],
      [
        2009,
        19.43
      ],
      [
        2010,
        20.613000000000003
      ],
      [
        2011,
        23.452
      ],
      [
        2012,
        23.665
      ],
      [
        2013,
        25.176
      ],
      [
        2014,
        25.97
      ],
      [
        2015,
        23.761
      ],
      [
        2016,
        24.812
      ],
      [
        2017,
        27.307
      ],
      [
        2018,
        29.066999999999997
      ],
      [
        2019,
        29.764
      ],
      [
        2020,
        31.418000000000003
      ],
      [
        2021,
        33.68
      ],
      [
        2022,
        36.06
      ],
      [
        2023,
        38.50599999999999
      ],
      [
        2024,
        41.071000000000005
      ]
    ],
    "pib_hab": [
      [
        1980,
        558.6621192011422
      ],
      [
        1981,
        493.28708911827033
      ],
      [
        1982,
        468.6829737746595
      ],
      [
        1983,
        461.5733635969758
      ],
      [
        1984,
        390.92794734842215
      ],
      [
        1985,
        376.8769134422757
      ],
      [
        1986,
        442.4647650065218
      ],
      [
        1987,
        412.585903202532
      ],
      [
        1988,
        420.1973848387835
      ],
      [
        1989,
        419.0370147148332
      ],
      [
        1990,
        496.7715791182922
      ],
      [
        1991,
        475.21566829103705
      ],
      [
        1992,
        519.6669102103552
      ],
      [
        1993,
        541.0822442851287
      ],
      [
        1994,
        517.8888073435579
      ],
      [
        1995,
        558.8755925463357
      ],
      [
        1996,
        605.8256946675638
      ],
      [
        1997,
        544.3081439267213
      ],
      [
        1998,
        544.9061280831733
      ],
      [
        1999,
        542.2008545170048
      ],
      [
        2000,
        551.8969913757395
      ],
      [
        2001,
        572.1071945056449
      ],
      [
        2002,
        568.6464512258408
      ],
      [
        2003,
        669.288793737912
      ],
      [
        2004,
        646.2230529503313
      ],
      [
        2005,
        663.4230951180616
      ],
      [
        2006,
        686.6236989866986
      ],
      [
        2007,
        812.0562788095046
      ],
      [
        2008,
        971.5634848449147
      ],
      [
        2009,
        862.6303675211702
      ],
      [
        2010,
        890.5001689352423
      ],
      [
        2011,
        988.6498631859483
      ],
      [
        2012,
        971.3426040799201
      ],
      [
        2013,
        1006.2823656690767
      ],
      [
        2014,
        1010.6346839180168
      ],
      [
        2015,
        900.6542942692821
      ],
      [
        2016,
        917.0699820712697
      ],
      [
        2017,
        983.9259833142315
      ],
      [
        2018,
        1021.003837041474
      ],
      [
        2019,
        1019.2580875535845
      ],
      [
        2020,
        1049.1010647324922
      ],
      [
        2021,
        1096.961286624889
      ],
      [
        2022,
        1145.566305445843
      ],
      [
        2023,
        1193.1572157636585
      ],
      [
        2024,
        1241.3951233228695
      ]
    ],
    "pop_pauvrete": [
      [
        1960,
        "NA"
      ],
      [
        1961,
        "NA"
      ],
      [
        1962,
        "NA"
      ],
      [
        1963,
        "NA"
      ],
      [
        1964,
        "NA"
      ],
      [
        1965,
        "NA"
      ],
      [
        1966,
        "NA"
      ],
      [
        1967,
        "NA"
      ],
      [
        1968,
        "NA"
      ],
      [
        1969,
        "NA"
      ],
      [
        1970,
        "NA"
      ],
      [
        1971,
        "NA"
      ],
      [
        1972,
        "NA"
      ],
      [
        1973,
        "NA"
      ],
      [
        1974,
        "NA"
      ],
      [
        1975,
        "NA"
      ],
      [
        1976,
        "NA"
      ],
      [
        1977,
        "NA"
      ],
      [
        1978,
        "NA"
      ],
      [
        1979,
        "NA"
      ],
      [
        1980,
        46.1
      ],
      [
        1981,
        "NA"
      ],
      [
        1982,
        "NA"
      ],
      [
        1983,
        "NA"
      ],
      [
        1984,
        "NA"
      ],
      [
        1985,
        "NA"
      ],
      [
        1986,
        "NA"
      ],
      [
        1987,
        "NA"
      ],
      [
        1988,
        "NA"
      ],
      [
        1989,
        "NA"
      ],
      [
        1990,
        "NA"
      ],
      [
        1991,
        "NA"
      ],
      [
        1992,
        "NA"
      ],
      [
        1993,
        70.3
      ],
      [
        1994,
        "NA"
      ],
      [
        1995,
        "NA"
      ],
      [
        1996,
        "NA"
      ],
      [
        1997,
        66.8
      ],
      [
        1998,
        "NA"
      ],
      [
        1999,
        64.2
      ],
      [
        2000,
        "NA"
      ],
      [
        2001,
        68.7
      ],
      [
        2002,
        "NA"
      ],
      [
        2003,
        "NA"
      ],
      [
        2004,
        13.5
      ],
      [
        2005,
        72.0
      ],
      [
        2006,
        0.4
      ],
      [
        2007,
        "NA"
      ],
      [
        2008,
        "NA"
      ],
      [
        2009,
        "NA"
      ],
      [
        2010,
        78.5
      ],
      [
        2011,
        "NA"
      ],
      [
        2012,
        73.50494151876177
      ],
      [
        2013,
        1.1
      ],
      [
        2014,
        17.6
      ],
      [
        2015,
        "NA"
      ],
      [
        2016,
        "NA"
      ],
      [
        2017,
        0.2
      ],
      [
        2018,
        "NA"
      ],
      [
        2019,
        "NA"
      ]
    ],
    "pop_rurale": [
      [
        1960,
        86.48364276599933
      ],
      [
        1961,
        86.08160320539405
      ],
      [
        1962,
        85.67099514468894
      ],
      [
        1963,
        85.25281077470859
      ],
      [
        1964,
        84.82949438336696
      ],
      [
        1965,
        84.40379333464077
      ],
      [
        1966,
        83.97964683682206
      ],
      [
        1967,
        83.61655135401264
      ],
      [
        1968,
        83.25006106279015
      ],
      [
        1969,
        82.88286405325198
      ],
      [
        1970,
        82.51143191925017
      ],
      [
        1971,
        82.0764367000338
      ],
      [
        1972,
        81.63231482722549
      ],
      [
        1973,
        81.2854857647669
      ],
      [
        1974,
        80.92682430151919
      ],
      [
        1975,
        80.55908548835427
      ],
      [
        1976,
        80.22589724841005
      ],
      [
        1977,
        79.88332734555581
      ],
      [
        1978,
        79.54128036582574
      ],
      [
        1979,
        79.19422061514071
      ],
      [
        1980,
        78.84045779904795
      ],
      [
        1981,
        78.48055441726056
      ],
      [
        1982,
        78.11324905856411
      ],
      [
        1983,
        77.73770714069096
      ],
      [
        1984,
        77.30567092201494
      ],
      [
        1985,
        76.86611974650674
      ],
      [
        1986,
        76.41750010845733
      ],
      [
        1987,
        75.96133956560138
      ],
      [
        1988,
        75.4935598195629
      ],
      [
        1989,
        75.01716284462785
      ],
      [
        1990,
        74.5267396585054
      ],
      [
        1991,
        74.05944978405319
      ],
      [
        1992,
        73.59318243856163
      ],
      [
        1993,
        73.12054749324545
      ],
      [
        1994,
        72.90000693356754
      ],
      [
        1995,
        72.70254820278494
      ],
      [
        1996,
        72.5042695014758
      ],
      [
        1997,
        72.3053742369718
      ],
      [
        1998,
        72.10426117415538
      ],
      [
        1999,
        71.90018414463368
      ],
      [
        2000,
        71.6934660985665
      ],
      [
        2001,
        71.48236272239146
      ],
      [
        2002,
        71.26792867344754
      ],
      [
        2003,
        71.05109409700479
      ],
      [
        2004,
        70.83100655469049
      ],
      [
        2005,
        70.31221476472534
      ],
      [
        2006,
        69.78347229701595
      ],
      [
        2007,
        69.24555876830863
      ],
      [
        2008,
        68.69679429172349
      ],
      [
        2009,
        68.14153964732147
      ],
      [
        2010,
        67.57798124104124
      ],
      [
        2011,
        67.00710753386882
      ],
      [
        2012,
        66.42898671695046
      ],
      [
        2013,
        65.84432216408312
      ],
      [
        2014,
        65.25239899664011
      ],
      [
        2015,
        64.65505172983362
      ],
      [
        2016,
        64.05040280273948
      ],
      [
        2017,
        63.43955496679962
      ],
      [
        2018,
        62.822665608416
      ],
      [
        2019,
        "NA"
      ]
    ],
    "pop_tot": [
      [
        1950,
        5.035844
      ],
      [
        1951,
        5.149882000000002
      ],
      [
        1952,
        5.266895999999998
      ],
      [
        1953,
        5.3872990000000005
      ],
      [
        1954,
        5.5114449999999975
      ],
      [
        1955,
        5.639690999999999
      ],
      [
        1956,
        5.772343000000001
      ],
      [
        1957,
        5.909659
      ],
      [
        1958,
        6.051881
      ],
      [
        1959,
        6.19923
      ],
      [
        1960,
        6.351828
      ],
      [
        1961,
        6.5098600000000015
      ],
      [
        1962,
        6.673425
      ],
      [
        1963,
        6.842614000000001
      ],
      [
        1964,
        7.017465
      ],
      [
        1965,
        7.198010000000001
      ],
      [
        1966,
        7.384563999999999
      ],
      [
        1967,
        7.577122
      ],
      [
        1968,
        7.775111
      ],
      [
        1969,
        7.977617000000001
      ],
      [
        1970,
        8.184161999999999
      ],
      [
        1971,
        8.394434
      ],
      [
        1972,
        8.609051
      ],
      [
        1973,
        8.829475
      ],
      [
        1974,
        9.057762
      ],
      [
        1975,
        9.295372
      ],
      [
        1976,
        9.542908999999998
      ],
      [
        1977,
        9.800038999999998
      ],
      [
        1978,
        10.066130000000001
      ],
      [
        1979,
        10.340064000000002
      ],
      [
        1980,
        10.621058999999997
      ],
      [
        1981,
        10.909586999999998
      ],
      [
        1982,
        11.206077
      ],
      [
        1983,
        11.509742999999999
      ],
      [
        1984,
        11.819577
      ],
      [
        1985,
        12.135172
      ],
      [
        1986,
        12.456199
      ],
      [
        1987,
        12.783918
      ],
      [
        1988,
        13.121482
      ],
      [
        1989,
        13.473132
      ],
      [
        1990,
        13.842031
      ],
      [
        1991,
        14.22915
      ],
      [
        1992,
        14.634015
      ],
      [
        1993,
        15.056622
      ],
      [
        1994,
        15.496422
      ],
      [
        1995,
        15.952838000000002
      ],
      [
        1996,
        16.426078000000004
      ],
      [
        1997,
        16.915817
      ],
      [
        1998,
        17.420094
      ],
      [
        1999,
        17.936263999999994
      ],
      [
        2000,
        18.462345
      ],
      [
        2001,
        18.997563
      ],
      [
        2002,
        19.541948
      ],
      [
        2003,
        20.095261
      ],
      [
        2004,
        20.657497999999997
      ],
      [
        2005,
        21.228698
      ],
      [
        2006,
        21.80888
      ],
      [
        2007,
        22.397953000000005
      ],
      [
        2008,
        22.996005
      ],
      [
        2009,
        23.603183000000005
      ],
      [
        2010,
        24.219788
      ],
      [
        2011,
        24.845762
      ],
      [
        2012,
        25.481733
      ],
      [
        2013,
        26.129499
      ],
      [
        2014,
        26.791463
      ],
      [
        2015,
        27.469329
      ],
      [
        2016,
        28.163729999999997
      ],
      [
        2017,
        28.874412
      ],
      [
        2018,
        29.600973
      ],
      [
        2019,
        30.342677000000002
      ],
      [
        2020,
        31.098861000000007
      ],
      [
        2021,
        31.86932100000001
      ],
      [
        2022,
        32.653969000000004
      ],
      [
        2023,
        33.45212800000001
      ],
      [
        2024,
        34.262992
      ],
      [
        2025,
        35.08584999999999
      ],
      [
        2026,
        35.920293
      ],
      [
        2027,
        36.765865999999995
      ],
      [
        2028,
        37.621635
      ],
      [
        2029,
        38.486527
      ],
      [
        2030,
        39.359706
      ],
      [
        2031,
        40.240574
      ],
      [
        2032,
        41.128957
      ],
      [
        2033,
        42.02480299999999
      ],
      [
        2034,
        42.928236
      ],
      [
        2035,
        43.839391000000006
      ],
      [
        2036,
        44.757985
      ],
      [
        2037,
        45.683766999999996
      ],
      [
        2038,
        46.61658400000001
      ],
      [
        2039,
        47.55625
      ],
      [
        2040,
        48.50260400000001
      ],
      [
        2041,
        49.455428999999995
      ],
      [
        2042,
        50.41456
      ],
      [
        2043,
        51.380123
      ],
      [
        2044,
        52.35237199999999
      ],
      [
        2045,
        53.33133699999999
      ],
      [
        2046,
        54.316854000000006
      ],
      [
        2047,
        55.30849200000001
      ],
      [
        2048,
        56.305773
      ],
      [
        2049,
        57.30802099999998
      ],
      [
        2050,
        58.314674
      ],
      [
        2051,
        59.325355
      ],
      [
        2052,
        60.33964100000001
      ],
      [
        2053,
        61.356868999999996
      ],
      [
        2054,
        62.37627599999999
      ],
      [
        2055,
        63.39726099999999
      ],
      [
        2056,
        64.419285
      ],
      [
        2057,
        65.441953
      ],
      [
        2058,
        66.46493199999999
      ],
      [
        2059,
        67.487899
      ],
      [
        2060,
        68.510504
      ],
      [
        2061,
        69.53235699999998
      ],
      [
        2062,
        70.55306999999999
      ],
      [
        2063,
        71.57226700000001
      ],
      [
        2064,
        72.58964799999997
      ],
      [
        2065,
        73.60485600000001
      ],
      [
        2066,
        74.617521
      ],
      [
        2067,
        75.62724400000002
      ],
      [
        2068,
        76.633687
      ],
      [
        2069,
        77.63659099999998
      ],
      [
        2070,
        78.63559899999997
      ],
      [
        2071,
        79.63038499999998
      ],
      [
        2072,
        80.620471
      ],
      [
        2073,
        81.60522000000002
      ],
      [
        2074,
        82.583963
      ],
      [
        2075,
        83.556073
      ],
      [
        2076,
        84.52110400000001
      ],
      [
        2077,
        85.47872900000002
      ],
      [
        2078,
        86.42849700000002
      ],
      [
        2079,
        87.36998599999998
      ],
      [
        2080,
        88.30285199999999
      ],
      [
        2081,
        89.226615
      ],
      [
        2082,
        90.141009
      ],
      [
        2083,
        91.04587599999998
      ],
      [
        2084,
        91.941176
      ],
      [
        2085,
        92.82677
      ],
      [
        2086,
        93.702444
      ],
      [
        2087,
        94.567798
      ],
      [
        2088,
        95.422344
      ],
      [
        2089,
        96.26554300000001
      ],
      [
        2090,
        97.096913
      ],
      [
        2091,
        97.916109
      ],
      [
        2092,
        98.722882
      ],
      [
        2093,
        99.51707299999998
      ],
      [
        2094,
        100.298514
      ],
      [
        2095,
        101.067054
      ],
      [
        2096,
        101.822461
      ],
      [
        2097,
        102.564451
      ],
      [
        2098,
        103.292707
      ],
      [
        2099,
        104.006811
      ],
      [
        2100,
        104.70642
      ]
    ],
    "pop_urbaine": [
      [
        1960,
        13.516357234000651
      ],
      [
        1961,
        13.918396794605949
      ],
      [
        1962,
        14.329004855311034
      ],
      [
        1963,
        14.747189225291404
      ],
      [
        1964,
        15.17050561663305
      ],
      [
        1965,
        15.596206665359244
      ],
      [
        1966,
        16.0203531631779
      ],
      [
        1967,
        16.383448645987357
      ],
      [
        1968,
        16.74993893720984
      ],
      [
        1969,
        17.11713594674799
      ],
      [
        1970,
        17.488568080749832
      ],
      [
        1971,
        17.923563299966194
      ],
      [
        1972,
        18.367685172774497
      ],
      [
        1973,
        18.714514235233096
      ],
      [
        1974,
        19.07317569848081
      ],
      [
        1975,
        19.440914511645712
      ],
      [
        1976,
        19.77410275158997
      ],
      [
        1977,
        20.11667265444422
      ],
      [
        1978,
        20.458719634174265
      ],
      [
        1979,
        20.805779384859274
      ],
      [
        1980,
        21.15954220095207
      ],
      [
        1981,
        21.519445582739444
      ],
      [
        1982,
        21.88675094143588
      ],
      [
        1983,
        22.26229285930905
      ],
      [
        1984,
        22.69432907798507
      ],
      [
        1985,
        23.13388025349326
      ],
      [
        1986,
        23.58249989154268
      ],
      [
        1987,
        24.038660434398626
      ],
      [
        1988,
        24.50644018043711
      ],
      [
        1989,
        24.982837155372142
      ],
      [
        1990,
        25.47326034149459
      ],
      [
        1991,
        25.94055021594682
      ],
      [
        1992,
        26.40681756143837
      ],
      [
        1993,
        26.87945250675456
      ],
      [
        1994,
        27.099993066432443
      ],
      [
        1995,
        27.297451797215064
      ],
      [
        1996,
        27.495730498524203
      ],
      [
        1997,
        27.694625763028203
      ],
      [
        1998,
        27.89573882584465
      ],
      [
        1999,
        28.099815855366305
      ],
      [
        2000,
        28.30653390143351
      ],
      [
        2001,
        28.51763727760852
      ],
      [
        2002,
        28.732071326552447
      ],
      [
        2003,
        28.94890590299521
      ],
      [
        2004,
        29.16899344530953
      ],
      [
        2005,
        29.687785235274674
      ],
      [
        2006,
        30.216527702984045
      ],
      [
        2007,
        30.75444123169137
      ],
      [
        2008,
        31.30320570827651
      ],
      [
        2009,
        31.858460352678513
      ],
      [
        2010,
        32.42201875895875
      ],
      [
        2011,
        32.99289246613119
      ],
      [
        2012,
        33.571013283049524
      ],
      [
        2013,
        34.155677835916876
      ],
      [
        2014,
        34.74760100335988
      ],
      [
        2015,
        35.344948270166384
      ],
      [
        2016,
        35.94959719726052
      ],
      [
        2017,
        36.56044503320037
      ],
      [
        2018,
        37.177334391584
      ],
      [
        2019,
        "NA"
      ]
    ],
    "prod_elec_renouv": [
      [
        1960,
        "NA"
      ],
      [
        1961,
        "NA"
      ],
      [
        1962,
        "NA"
      ],
      [
        1963,
        "NA"
      ],
      [
        1964,
        "NA"
      ],
      [
        1965,
        "NA"
      ],
      [
        1966,
        "NA"
      ],
      [
        1967,
        "NA"
      ],
      [
        1968,
        "NA"
      ],
      [
        1969,
        "NA"
      ],
      [
        1970,
        "NA"
      ],
      [
        1971,
        16.891891891900002
      ],
      [
        1972,
        14.024390243900001
      ],
      [
        1973,
        12.8342245989
      ],
      [
        1974,
        11.538461538499998
      ],
      [
        1975,
        7.5892857143
      ],
      [
        1976,
        9.2592592593
      ],
      [
        1977,
        7.7922077922
      ],
      [
        1978,
        7.9365079365
      ],
      [
        1979,
        7.323943662
      ],
      [
        1980,
        7.6056338028
      ],
      [
        1981,
        8.563535911599999
      ],
      [
        1982,
        11.8457300275
      ],
      [
        1983,
        8.625336927200001
      ],
      [
        1984,
        7.6315789474
      ],
      [
        1985,
        14.7959183673
      ],
      [
        1986,
        16.6287015945
      ],
      [
        1987,
        15.1950718686
      ],
      [
        1988,
        13.090909090899999
      ],
      [
        1989,
        9.507640067899999
      ],
      [
        1990,
        20.256410256400002
      ],
      [
        1991,
        21.2368728121
      ],
      [
        1992,
        20.5376344086
      ],
      [
        1993,
        17.1890798787
      ],
      [
        1994,
        15.553435114500001
      ],
      [
        1995,
        15.2658662093
      ],
      [
        1996,
        17.6747839749
      ],
      [
        1997,
        17.869907076500002
      ],
      [
        1998,
        20.8062418726
      ],
      [
        1999,
        18.8643533123
      ],
      [
        2000,
        24.24071991
      ],
      [
        2001,
        25.0130821559
      ],
      [
        2002,
        23.179487179499997
      ],
      [
        2003,
        21.5658021134
      ],
      [
        2004,
        21.7090069284
      ],
      [
        2005,
        19.938380281700002
      ],
      [
        2006,
        18.978723404300002
      ],
      [
        2007,
        18.985801217
      ],
      [
        2008,
        19.0066484161
      ],
      [
        2009,
        18.897943345
      ],
      [
        2010,
        20.565265898099998
      ],
      [
        2011,
        18.1618454778
      ],
      [
        2012,
        18.0550589918
      ],
      [
        2013,
        17.3130193906
      ],
      [
        2014,
        17.1944160708
      ],
      [
        2015,
        18.6519853187
      ],
      [
        2016,
        "NA"
      ],
      [
        2017,
        "NA"
      ],
      [
        2018,
        "NA"
      ],
      [
        2019,
        "NA"
      ]
    ],
    "rdt_cerealier": [
      [
        1960,
        "NA"
      ],
      [
        1961,
        1468.4
      ],
      [
        1962,
        1553.6999999999996
      ],
      [
        1963,
        1377.1333333333332
      ],
      [
        1964,
        1322.9333333333334
      ],
      [
        1965,
        1494.7333333333333
      ],
      [
        1966,
        1732.3666666666668
      ],
      [
        1967,
        1491.9666666666665
      ],
      [
        1968,
        1761.5
      ],
      [
        1969,
        1908.8666666666666
      ],
      [
        1970,
        1910.333333333333
      ],
      [
        1971,
        2106.7333333333336
      ],
      [
        1972,
        1987.166666666667
      ],
      [
        1973,
        2007.0
      ],
      [
        1974,
        1898.8666666666668
      ],
      [
        1975,
        1724.666666666667
      ],
      [
        1976,
        1929.5
      ],
      [
        1977,
        1891.5666666666668
      ],
      [
        1978,
        1761.4666666666665
      ],
      [
        1979,
        1763.8666666666668
      ],
      [
        1980,
        1731.4666666666665
      ],
      [
        1981,
        1762.8666666666668
      ],
      [
        1982,
        1731.0333333333335
      ],
      [
        1983,
        1964.4
      ],
      [
        1984,
        2431.433333333333
      ],
      [
        1985,
        2526.2333333333336
      ],
      [
        1986,
        2435.833333333333
      ],
      [
        1987,
        2194.5666666666666
      ],
      [
        1988,
        2275.366666666667
      ],
      [
        1989,
        2325.133333333333
      ],
      [
        1990,
        2467.7000000000007
      ],
      [
        1991,
        2317.866666666667
      ],
      [
        1992,
        2553.6666666666665
      ],
      [
        1993,
        2486.1
      ],
      [
        1994,
        2316.0
      ],
      [
        1995,
        2372.0
      ],
      [
        1996,
        2723.2000000000007
      ],
      [
        1997,
        2779.0333333333333
      ],
      [
        1998,
        2778.133333333333
      ],
      [
        1999,
        2721.933333333333
      ],
      [
        2000,
        4037.7333333333336
      ],
      [
        2001,
        3512.0
      ],
      [
        2002,
        3680.133333333333
      ],
      [
        2003,
        3356.0333333333333
      ],
      [
        2004,
        3379.3
      ],
      [
        2005,
        3788.1
      ],
      [
        2006,
        3878.4666666666667
      ],
      [
        2007,
        4469.433333333333
      ],
      [
        2008,
        3432.166666666666
      ],
      [
        2009,
        2828.433333333333
      ],
      [
        2010,
        3113.0333333333333
      ],
      [
        2011,
        2849.800000000001
      ],
      [
        2012,
        2684.7000000000007
      ],
      [
        2013,
        2685.933333333333
      ],
      [
        2014,
        2918.9666666666667
      ],
      [
        2015,
        2601.7333333333336
      ],
      [
        2016,
        2905.1
      ],
      [
        2017,
        3456.8666666666663
      ],
      [
        2018,
        "NA"
      ],
      [
        2019,
        "NA"
      ]
    ],
    "recette_budg": [
      [
        1980,
        15.094
      ],
      [
        1981,
        10.862
      ],
      [
        1982,
        9.925
      ],
      [
        1983,
        11.274189122711125
      ],
      [
        1984,
        12.4158480780964
      ],
      [
        1985,
        14.887990677439404
      ],
      [
        1986,
        14.425917808219175
      ],
      [
        1987,
        14.607713783178765
      ],
      [
        1988,
        18.665676681907254
      ],
      [
        1989,
        20.06583264132865
      ],
      [
        1990,
        20.67764476759284
      ],
      [
        1991,
        16.607022602144305
      ],
      [
        1992,
        19.21184551795401
      ],
      [
        1993,
        18.263672986891386
      ],
      [
        1994,
        17.62595737357691
      ],
      [
        1995,
        16.59574778325123
      ],
      [
        1996,
        16.567550102249488
      ],
      [
        1997,
        19.10004585104004
      ],
      [
        1998,
        17.404853896793377
      ],
      [
        1999,
        18.770055979643764
      ],
      [
        2000,
        17.7292967735285
      ],
      [
        2001,
        16.481122703538972
      ],
      [
        2002,
        15.63255469414768
      ],
      [
        2003,
        18.168938125
      ],
      [
        2004,
        19.8671856782732
      ],
      [
        2005,
        19.23912420643812
      ],
      [
        2006,
        19.96494512280702
      ],
      [
        2007,
        17.55356866593546
      ],
      [
        2008,
        18.649503494863254
      ],
      [
        2009,
        17.40871121976325
      ],
      [
        2010,
        17.95359952457187
      ],
      [
        2011,
        17.245420390585025
      ],
      [
        2012,
        17.18237033593915
      ],
      [
        2013,
        17.584198919605974
      ],
      [
        2014,
        17.470524605313827
      ],
      [
        2015,
        17.9621445646227
      ],
      [
        2016,
        19.089751249395462
      ],
      [
        2017,
        19.804644816347455
      ],
      [
        2018,
        19.851666529053567
      ],
      [
        2019,
        20.666283698427637
      ],
      [
        2020,
        19.746855910624486
      ],
      [
        2021,
        19.417877256532066
      ],
      [
        2022,
        19.163496117581808
      ],
      [
        2023,
        19.180820028047577
      ],
      [
        2024,
        19.08929315088505
      ]
    ],
    "sanitaire_primaire": [
      [
        2000,
        "NA"
      ],
      [
        2001,
        "NA"
      ],
      [
        2002,
        "NA"
      ],
      [
        2003,
        "NA"
      ],
      [
        2004,
        "NA"
      ],
      [
        2005,
        "NA"
      ],
      [
        2006,
        "NA"
      ],
      [
        2007,
        "NA"
      ],
      [
        2008,
        "NA"
      ],
      [
        2009,
        "NA"
      ],
      [
        2010,
        "NA"
      ],
      [
        2011,
        "NA"
      ],
      [
        2012,
        "NA"
      ],
      [
        2013,
        100.0
      ],
      [
        2014,
        100.0
      ],
      [
        2015,
        100.0
      ],
      [
        2016,
        100.0
      ],
      [
        2017,
        100.0
      ],
      [
        2018,
        100.0
      ],
      [
        2019,
        "NA"
      ]
    ],
    "sous_nutri": [
      [
        1960,
        102.26009683221548
      ],
      [
        1961,
        98.78837391737015
      ],
      [
        1962,
        93.79798384922348
      ],
      [
        1963,
        87.85424349642895
      ],
      [
        1964,
        84.53578200932006
      ],
      [
        1965,
        86.92625342627557
      ],
      [
        1966,
        92.5941443667744
      ],
      [
        1967,
        95.49511275625194
      ],
      [
        1968,
        140.96393593930765
      ],
      [
        1969,
        141.76717762652837
      ],
      [
        1970,
        145.31079907426883
      ],
      [
        1971,
        146.6058769672381
      ],
      [
        1972,
        148.23281224091485
      ],
      [
        1973,
        149.92604018000608
      ],
      [
        1974,
        151.6805741895628
      ],
      [
        1975,
        153.11956292172874
      ],
      [
        1976,
        154.33030559184064
      ],
      [
        1977,
        155.58926189733273
      ],
      [
        1978,
        156.7197108353283
      ],
      [
        1979,
        158.17233109496772
      ],
      [
        1980,
        159.98839258413608
      ],
      [
        1981,
        162.09968878295868
      ],
      [
        1982,
        164.1106226365215
      ],
      [
        1983,
        165.42135751383498
      ],
      [
        1984,
        165.72274047629998
      ],
      [
        1985,
        165.16336709992524
      ],
      [
        1986,
        163.46907810772547
      ],
      [
        1987,
        160.50106357919628
      ],
      [
        1988,
        156.18536785953864
      ],
      [
        1989,
        151.4387061422464
      ],
      [
        1990,
        146.69756018746006
      ],
      [
        1991,
        142.14780554139375
      ],
      [
        1992,
        138.05581340629848
      ],
      [
        1993,
        134.1850036275849
      ],
      [
        1994,
        130.35911331920178
      ],
      [
        1995,
        126.39038080072756
      ],
      [
        1996,
        121.89231011468493
      ],
      [
        1997,
        116.91000911436684
      ],
      [
        1998,
        111.60004509756241
      ],
      [
        1999,
        106.08009235453078
      ],
      [
        2000,
        100.720750224292
      ],
      [
        2001,
        95.54303933571327
      ],
      [
        2002,
        90.8350207580522
      ],
      [
        2003,
        86.41080867118272
      ],
      [
        2004,
        82.51017355726542
      ],
      [
        2005,
        78.94880990682563
      ],
      [
        2006,
        75.73026942694713
      ],
      [
        2007,
        72.7637907004337
      ],
      [
        2008,
        69.9303959171399
      ],
      [
        2009,
        67.35677889895993
      ],
      [
        2010,
        64.86940228901373
      ],
      [
        2011,
        62.76047897368942
      ],
      [
        2012,
        60.90787777351703
      ],
      [
        2013,
        59.23221932229738
      ],
      [
        2014,
        57.74080858343663
      ],
      [
        2015,
        56.34677275755629
      ],
      [
        2016,
        54.94511413737968
      ],
      [
        2017,
        53.64432984213806
      ],
      [
        2018,
        52.17665252253458
      ],
      [
        2019,
        "NA"
      ]
    ],
    "volume_exp_biens": [
      [
        1980,
        -19.084666666666667
      ],
      [
        1981,
        -0.601
      ],
      [
        1982,
        8.31175
      ],
      [
        1983,
        3.9579999999999993
      ],
      [
        1984,
        -17.94175
      ],
      [
        1985,
        55.523999999999994
      ],
      [
        1986,
        16.8015
      ],
      [
        1987,
        55.69200000000001
      ],
      [
        1988,
        52.88325
      ],
      [
        1989,
        2.8035000000000005
      ],
      [
        1990,
        -5.016
      ],
      [
        1991,
        10.970999999999998
      ],
      [
        1992,
        -6.015249999999999
      ],
      [
        1993,
        7.677499999999998
      ],
      [
        1994,
        0.27950000000000097
      ],
      [
        1995,
        6.026750000000002
      ],
      [
        1996,
        13.095750000000002
      ],
      [
        1997,
        11.775250000000002
      ],
      [
        1998,
        16.0635
      ],
      [
        1999,
        7.06025
      ],
      [
        2000,
        11.41275
      ],
      [
        2001,
        10.17475
      ],
      [
        2002,
        5.814
      ],
      [
        2003,
        -9.40425
      ],
      [
        2004,
        -6.65275
      ],
      [
        2005,
        21.406
      ],
      [
        2006,
        5.81175
      ],
      [
        2007,
        2.376750000000001
      ],
      [
        2008,
        -10.001
      ],
      [
        2009,
        3.4825000000000004
      ],
      [
        2010,
        0.6549999999999985
      ],
      [
        2011,
        1.0732499999999998
      ],
      [
        2012,
        -1.4062500000000009
      ],
      [
        2013,
        13.73675
      ],
      [
        2014,
        12.2315
      ],
      [
        2015,
        -8.16925
      ],
      [
        2016,
        0.8407499999999999
      ],
      [
        2017,
        0.6755
      ],
      [
        2018,
        -0.6905
      ],
      [
        2019,
        6.3130000000000015
      ],
      [
        2020,
        3.13925
      ],
      [
        2021,
        7.06575
      ],
      [
        2022,
        4.10875
      ],
      [
        2023,
        3.829
      ],
      [
        2024,
        4.28625
      ]
    ],
    "volume_exp_bs": [
      [
        1980,
        -15.527666666666667
      ],
      [
        1981,
        0.8812499999999992
      ],
      [
        1982,
        6.92
      ],
      [
        1983,
        -25.969
      ],
      [
        1984,
        -16.97425
      ],
      [
        1985,
        34.806
      ],
      [
        1986,
        8.72325
      ],
      [
        1987,
        55.4725
      ],
      [
        1988,
        53.2395
      ],
      [
        1989,
        2.3877500000000005
      ],
      [
        1990,
        -2.0985
      ],
      [
        1991,
        11.746250000000002
      ],
      [
        1992,
        2.3047500000000003
      ],
      [
        1993,
        15.401
      ],
      [
        1994,
        0.9039999999999992
      ],
      [
        1995,
        6.935750000000001
      ],
      [
        1996,
        2.1695
      ],
      [
        1997,
        6.4685000000000015
      ],
      [
        1998,
        5.560500000000001
      ],
      [
        1999,
        11.7145
      ],
      [
        2000,
        9.977
      ],
      [
        2001,
        8.071
      ],
      [
        2002,
        6.3957500000000005
      ],
      [
        2003,
        -10.28325
      ],
      [
        2004,
        2.8372499999999987
      ],
      [
        2005,
        14.69325
      ],
      [
        2006,
        4.9075000000000015
      ],
      [
        2007,
        8.19575
      ],
      [
        2008,
        0.9810000000000004
      ],
      [
        2009,
        -6.95175
      ],
      [
        2010,
        1.2945000000000009
      ],
      [
        2011,
        5.376
      ],
      [
        2012,
        1.99125
      ],
      [
        2013,
        5.82025
      ],
      [
        2014,
        10.14825
      ],
      [
        2015,
        -1.5099999999999998
      ],
      [
        2016,
        -4.7669999999999995
      ],
      [
        2017,
        0.9342500000000002
      ],
      [
        2018,
        0.99025
      ],
      [
        2019,
        7.665
      ],
      [
        2020,
        5.4625
      ],
      [
        2021,
        6.505000000000001
      ],
      [
        2022,
        4.8347500000000005
      ],
      [
        2023,
        4.533
      ],
      [
        2024,
        4.48375
      ]
    ],
    "volume_import_biens": [
      [
        1980,
        -1.6185000000000005
      ],
      [
        1981,
        1.3627499999999986
      ],
      [
        1982,
        -6.977499999999999
      ],
      [
        1983,
        4.936499999999999
      ],
      [
        1984,
        16.13775
      ],
      [
        1985,
        7.32675
      ],
      [
        1986,
        4.5154999999999985
      ],
      [
        1987,
        1.7365000000000006
      ],
      [
        1988,
        21.50575
      ],
      [
        1989,
        -2.547250000000001
      ],
      [
        1990,
        21.54475
      ],
      [
        1991,
        -1.7222499999999996
      ],
      [
        1992,
        9.1555
      ],
      [
        1993,
        12.9325
      ],
      [
        1994,
        -5.308
      ],
      [
        1995,
        5.395
      ],
      [
        1996,
        8.751999999999999
      ],
      [
        1997,
        12.1315
      ],
      [
        1998,
        15.232000000000001
      ],
      [
        1999,
        0.7282499999999997
      ],
      [
        2000,
        -5.36075
      ],
      [
        2001,
        18.26375
      ],
      [
        2002,
        4.47475
      ],
      [
        2003,
        -4.5139999999999985
      ],
      [
        2004,
        9.4665
      ],
      [
        2005,
        21.677000000000003
      ],
      [
        2006,
        3.82575
      ],
      [
        2007,
        30.81025000000001
      ],
      [
        2008,
        10.01875
      ],
      [
        2009,
        -7.846000000000001
      ],
      [
        2010,
        -2.4019999999999992
      ],
      [
        2011,
        3.6335000000000006
      ],
      [
        2012,
        8.848749999999997
      ],
      [
        2013,
        8.165000000000001
      ],
      [
        2014,
        4.217500000000001
      ],
      [
        2015,
        -2.43
      ],
      [
        2016,
        9.78575
      ],
      [
        2017,
        10.675
      ],
      [
        2018,
        3.12175
      ],
      [
        2019,
        10.861999999999998
      ],
      [
        2020,
        4.8075
      ],
      [
        2021,
        5.26725
      ],
      [
        2022,
        2.819
      ],
      [
        2023,
        4.45725
      ],
      [
        2024,
        4.83325
      ]
    ],
    "volume_import_bs": [
      [
        1980,
        1.218
      ],
      [
        1981,
        4.528750000000001
      ],
      [
        1982,
        -5.68725
      ],
      [
        1983,
        -9.28075
      ],
      [
        1984,
        15.23075
      ],
      [
        1985,
        15.694
      ],
      [
        1986,
        5.56425
      ],
      [
        1987,
        20.7875
      ],
      [
        1988,
        9.51775
      ],
      [
        1989,
        -4.646250000000001
      ],
      [
        1990,
        16.61175
      ],
      [
        1991,
        1.69525
      ],
      [
        1992,
        9.41025
      ],
      [
        1993,
        8.63025
      ],
      [
        1994,
        -2.60225
      ],
      [
        1995,
        5.92825
      ],
      [
        1996,
        4.933999999999998
      ],
      [
        1997,
        12.41525
      ],
      [
        1998,
        15.02375
      ],
      [
        1999,
        2.2075000000000005
      ],
      [
        2000,
        -5.81875
      ],
      [
        2001,
        14.12375
      ],
      [
        2002,
        10.0735
      ],
      [
        2003,
        -3.19975
      ],
      [
        2004,
        4.363
      ],
      [
        2005,
        14.51875
      ],
      [
        2006,
        4.4357500000000005
      ],
      [
        2007,
        9.2635
      ],
      [
        2008,
        9.457
      ],
      [
        2009,
        -1.1309999999999996
      ],
      [
        2010,
        -3.6657499999999987
      ],
      [
        2011,
        2.93725
      ],
      [
        2012,
        8.488750000000001
      ],
      [
        2013,
        7.31975
      ],
      [
        2014,
        5.449
      ],
      [
        2015,
        -0.2552500000000002
      ],
      [
        2016,
        9.421
      ],
      [
        2017,
        8.0335
      ],
      [
        2018,
        1.92625
      ],
      [
        2019,
        9.7605
      ],
      [
        2020,
        4.7785
      ],
      [
        2021,
        5.163499999999999
      ],
      [
        2022,
        2.9185
      ],
      [
        2023,
        4.3282500000000015
      ],
      [
        2024,
        4.59475
      ]
    ]
  }
}