{
  "country": "SDN",
  "country_name": "Soudan",
  "indicators": {
    "abo_mobile": [
      [
        1960,
        0.0
      ],
      [
        1961,
        "NA"
      ],
      [
        1962,
        "NA"
      ],
      [
        1963,
        "NA"
      ],
      [
        1964,
        "NA"
      ],
      [
        1965,
        0.0
      ],
      [
        1966,
        "NA"
      ],
      [
        1967,
        "NA"
      ],
      [
        1968,
        "NA"
      ],
      [
        1969,
        "NA"
      ],
      [
        1970,
        0.0
      ],
      [
        1971,
        "NA"
      ],
      [
        1972,
        "NA"
      ],
      [
        1973,
        "NA"
      ],
      [
        1974,
        "NA"
      ],
      [
        1975,
        0.0
      ],
      [
        1976,
        0.0
      ],
      [
        1977,
        0.0
      ],
      [
        1978,
        0.0
      ],
      [
        1979,
        0.0
      ],
      [
        1980,
        0.0
      ],
      [
        1981,
        0.0
      ],
      [
        1982,
        0.0
      ],
      [
        1983,
        0.0
      ],
      [
        1984,
        0.0
      ],
      [
        1985,
        0.0
      ],
      [
        1986,
        0.0
      ],
      [
        1987,
        0.0
      ],
      [
        1988,
        0.0
      ],
      [
        1989,
        0.0
      ],
      [
        1990,
        0.0
      ],
      [
        1991,
        0.0
      ],
      [
        1992,
        0.0
      ],
      [
        1993,
        0.0
      ],
      [
        1994,
        0.0
      ],
      [
        1995,
        0.0
      ],
      [
        1996,
        0.0022
      ],
      [
        1997,
        0.0038
      ],
      [
        1998,
        0.0086
      ],
      [
        1999,
        0.013000000000000001
      ],
      [
        2000,
        0.023
      ],
      [
        2001,
        0.10384600000000001
      ],
      [
        2002,
        0.190778
      ],
      [
        2003,
        0.527233
      ],
      [
        2004,
        1.048558
      ],
      [
        2005,
        1.8279400000000001
      ],
      [
        2006,
        4.683127
      ],
      [
        2007,
        8.218092
      ],
      [
        2008,
        11.991469
      ],
      [
        2009,
        15.339895
      ],
      [
        2010,
        18.093231
      ],
      [
        2011,
        25.056185
      ],
      [
        2012,
        27.658595000000002
      ],
      [
        2013,
        27.657875
      ],
      [
        2014,
        27.796611
      ],
      [
        2015,
        27.938507
      ],
      [
        2016,
        27.807292999999998
      ],
      [
        2017,
        28.644139000000003
      ],
      [
        2018,
        30.100412
      ],
      [
        2019,
        "NA"
      ]
    ],
    "acces_elec": [
      [
        1960,
        "NA"
      ],
      [
        1961,
        "NA"
      ],
      [
        1962,
        "NA"
      ],
      [
        1963,
        "NA"
      ],
      [
        1964,
        "NA"
      ],
      [
        1965,
        "NA"
      ],
      [
        1966,
        "NA"
      ],
      [
        1967,
        "NA"
      ],
      [
        1968,
        "NA"
      ],
      [
        1969,
        "NA"
      ],
      [
        1970,
        "NA"
      ],
      [
        1971,
        "NA"
      ],
      [
        1972,
        "NA"
      ],
      [
        1973,
        "NA"
      ],
      [
        1974,
        "NA"
      ],
      [
        1975,
        "NA"
      ],
      [
        1976,
        "NA"
      ],
      [
        1977,
        "NA"
      ],
      [
        1978,
        "NA"
      ],
      [
        1979,
        "NA"
      ],
      [
        1980,
        "NA"
      ],
      [
        1981,
        "NA"
      ],
      [
        1982,
        "NA"
      ],
      [
        1983,
        "NA"
      ],
      [
        1984,
        "NA"
      ],
      [
        1985,
        "NA"
      ],
      [
        1986,
        "NA"
      ],
      [
        1987,
        "NA"
      ],
      [
        1988,
        "NA"
      ],
      [
        1989,
        "NA"
      ],
      [
        1990,
        32.8
      ],
      [
        1991,
        24.554763793899998
      ],
      [
        1992,
        25.428442001300002
      ],
      [
        1993,
        26.3027210236
      ],
      [
        1994,
        27.178195953400003
      ],
      [
        1995,
        28.0554695129
      ],
      [
        1996,
        28.935136795
      ],
      [
        1997,
        29.8177967072
      ],
      [
        1998,
        30.703207016
      ],
      [
        1999,
        31.5877380371
      ],
      [
        2000,
        23.0
      ],
      [
        2001,
        33.3362960815
      ],
      [
        2002,
        34.1913795471
      ],
      [
        2003,
        35.0277137756
      ],
      [
        2004,
        35.8408203125
      ],
      [
        2005,
        36.6289100647
      ],
      [
        2006,
        37.4008903503
      ],
      [
        2007,
        38.168346405
      ],
      [
        2008,
        38.9428634644
      ],
      [
        2009,
        29.0
      ],
      [
        2010,
        40.5594100952
      ],
      [
        2011,
        41.4246101379
      ],
      [
        2012,
        42.339790344200004
      ],
      [
        2013,
        43.299472808800004
      ],
      [
        2014,
        44.9
      ],
      [
        2015,
        49.3679237366
      ],
      [
        2016,
        53.048137664799995
      ],
      [
        2017,
        56.5
      ],
      [
        2018,
        59.783535003699996
      ],
      [
        2019,
        "NA"
      ]
    ],
    "acces_elec_primaire": [
      [
        2000,
        "NA"
      ],
      [
        2001,
        "NA"
      ],
      [
        2002,
        "NA"
      ],
      [
        2003,
        "NA"
      ],
      [
        2004,
        "NA"
      ],
      [
        2005,
        "NA"
      ],
      [
        2006,
        "NA"
      ],
      [
        2007,
        "NA"
      ],
      [
        2008,
        "NA"
      ],
      [
        2009,
        "NA"
      ],
      [
        2010,
        "NA"
      ],
      [
        2011,
        "NA"
      ],
      [
        2012,
        "NA"
      ],
      [
        2013,
        "NA"
      ],
      [
        2014,
        "NA"
      ],
      [
        2015,
        "NA"
      ],
      [
        2016,
        54.08344
      ],
      [
        2017,
        "NA"
      ],
      [
        2018,
        "NA"
      ],
      [
        2019,
        "NA"
      ]
    ],
    "alpha_adulte": [
      [
        1960,
        "NA"
      ],
      [
        1961,
        "NA"
      ],
      [
        1962,
        "NA"
      ],
      [
        1963,
        "NA"
      ],
      [
        1964,
        "NA"
      ],
      [
        1965,
        "NA"
      ],
      [
        1966,
        "NA"
      ],
      [
        1967,
        "NA"
      ],
      [
        1968,
        "NA"
      ],
      [
        1969,
        "NA"
      ],
      [
        1970,
        "NA"
      ],
      [
        1971,
        "NA"
      ],
      [
        1972,
        "NA"
      ],
      [
        1973,
        "NA"
      ],
      [
        1974,
        "NA"
      ],
      [
        1975,
        "NA"
      ],
      [
        1976,
        "NA"
      ],
      [
        1977,
        "NA"
      ],
      [
        1978,
        "NA"
      ],
      [
        1979,
        "NA"
      ],
      [
        1980,
        "NA"
      ],
      [
        1981,
        "NA"
      ],
      [
        1982,
        "NA"
      ],
      [
        1983,
        "NA"
      ],
      [
        1984,
        "NA"
      ],
      [
        1985,
        "NA"
      ],
      [
        1986,
        "NA"
      ],
      [
        1987,
        "NA"
      ],
      [
        1988,
        "NA"
      ],
      [
        1989,
        "NA"
      ],
      [
        1990,
        "NA"
      ],
      [
        1991,
        "NA"
      ],
      [
        1992,
        "NA"
      ],
      [
        1993,
        "NA"
      ],
      [
        1994,
        "NA"
      ],
      [
        1995,
        "NA"
      ],
      [
        1996,
        "NA"
      ],
      [
        1997,
        "NA"
      ],
      [
        1998,
        "NA"
      ],
      [
        1999,
        "NA"
      ],
      [
        2000,
        61.34587
      ],
      [
        2001,
        "NA"
      ],
      [
        2002,
        "NA"
      ],
      [
        2003,
        "NA"
      ],
      [
        2004,
        "NA"
      ],
      [
        2005,
        "NA"
      ],
      [
        2006,
        "NA"
      ],
      [
        2007,
        "NA"
      ],
      [
        2008,
        53.51738
      ],
      [
        2009,
        "NA"
      ],
      [
        2010,
        "NA"
      ],
      [
        2011,
        "NA"
      ],
      [
        2012,
        "NA"
      ],
      [
        2013,
        "NA"
      ],
      [
        2014,
        "NA"
      ],
      [
        2015,
        "NA"
      ],
      [
        2016,
        "NA"
      ],
      [
        2017,
        "NA"
      ],
      [
        2018,
        60.69718
      ],
      [
        2019,
        "NA"
      ]
    ],
    "alpha_jeune": [
      [
        1960,
        "NA"
      ],
      [
        1961,
        "NA"
      ],
      [
        1962,
        "NA"
      ],
      [
        1963,
        "NA"
      ],
      [
        1964,
        "NA"
      ],
      [
        1965,
        "NA"
      ],
      [
        1966,
        "NA"
      ],
      [
        1967,
        "NA"
      ],
      [
        1968,
        "NA"
      ],
      [
        1969,
        "NA"
      ],
      [
        1970,
        "NA"
      ],
      [
        1971,
        "NA"
      ],
      [
        1972,
        "NA"
      ],
      [
        1973,
        "NA"
      ],
      [
        1974,
        "NA"
      ],
      [
        1975,
        "NA"
      ],
      [
        1976,
        "NA"
      ],
      [
        1977,
        "NA"
      ],
      [
        1978,
        "NA"
      ],
      [
        1979,
        "NA"
      ],
      [
        1980,
        "NA"
      ],
      [
        1981,
        "NA"
      ],
      [
        1982,
        "NA"
      ],
      [
        1983,
        "NA"
      ],
      [
        1984,
        "NA"
      ],
      [
        1985,
        "NA"
      ],
      [
        1986,
        "NA"
      ],
      [
        1987,
        "NA"
      ],
      [
        1988,
        "NA"
      ],
      [
        1989,
        "NA"
      ],
      [
        1990,
        "NA"
      ],
      [
        1991,
        "NA"
      ],
      [
        1992,
        "NA"
      ],
      [
        1993,
        "NA"
      ],
      [
        1994,
        "NA"
      ],
      [
        1995,
        "NA"
      ],
      [
        1996,
        "NA"
      ],
      [
        1997,
        "NA"
      ],
      [
        1998,
        "NA"
      ],
      [
        1999,
        "NA"
      ],
      [
        2000,
        78.15559
      ],
      [
        2001,
        "NA"
      ],
      [
        2002,
        "NA"
      ],
      [
        2003,
        "NA"
      ],
      [
        2004,
        "NA"
      ],
      [
        2005,
        "NA"
      ],
      [
        2006,
        "NA"
      ],
      [
        2007,
        "NA"
      ],
      [
        2008,
        65.80535
      ],
      [
        2009,
        "NA"
      ],
      [
        2010,
        "NA"
      ],
      [
        2011,
        "NA"
      ],
      [
        2012,
        "NA"
      ],
      [
        2013,
        "NA"
      ],
      [
        2014,
        "NA"
      ],
      [
        2015,
        "NA"
      ],
      [
        2016,
        "NA"
      ],
      [
        2017,
        "NA"
      ],
      [
        2018,
        73.0
      ],
      [
        2019,
        "NA"
      ]
    ],
    "bidonvilles": [
      [
        1960,
        "NA"
      ],
      [
        1961,
        "NA"
      ],
      [
        1962,
        "NA"
      ],
      [
        1963,
        "NA"
      ],
      [
        1964,
        "NA"
      ],
      [
        1965,
        "NA"
      ],
      [
        1966,
        "NA"
      ],
      [
        1967,
        "NA"
      ],
      [
        1968,
        "NA"
      ],
      [
        1969,
        "NA"
      ],
      [
        1970,
        "NA"
      ],
      [
        1971,
        "NA"
      ],
      [
        1972,
        "NA"
      ],
      [
        1973,
        "NA"
      ],
      [
        1974,
        "NA"
      ],
      [
        1975,
        "NA"
      ],
      [
        1976,
        "NA"
      ],
      [
        1977,
        "NA"
      ],
      [
        1978,
        "NA"
      ],
      [
        1979,
        "NA"
      ],
      [
        1980,
        "NA"
      ],
      [
        1981,
        "NA"
      ],
      [
        1982,
        "NA"
      ],
      [
        1983,
        "NA"
      ],
      [
        1984,
        "NA"
      ],
      [
        1985,
        "NA"
      ],
      [
        1986,
        "NA"
      ],
      [
        1987,
        "NA"
      ],
      [
        1988,
        "NA"
      ],
      [
        1989,
        "NA"
      ],
      [
        1990,
        "NA"
      ],
      [
        1991,
        "NA"
      ],
      [
        1992,
        "NA"
      ],
      [
        1993,
        "NA"
      ],
      [
        1994,
        "NA"
      ],
      [
        1995,
        "NA"
      ],
      [
        1996,
        "NA"
      ],
      [
        1997,
        "NA"
      ],
      [
        1998,
        "NA"
      ],
      [
        1999,
        "NA"
      ],
      [
        2000,
        "NA"
      ],
      [
        2001,
        "NA"
      ],
      [
        2002,
        "NA"
      ],
      [
        2003,
        "NA"
      ],
      [
        2004,
        "NA"
      ],
      [
        2005,
        "NA"
      ],
      [
        2006,
        "NA"
      ],
      [
        2007,
        "NA"
      ],
      [
        2008,
        "NA"
      ],
      [
        2009,
        "NA"
      ],
      [
        2010,
        "NA"
      ],
      [
        2011,
        "NA"
      ],
      [
        2012,
        "NA"
      ],
      [
        2013,
        "NA"
      ],
      [
        2014,
        91.6
      ],
      [
        2015,
        "NA"
      ],
      [
        2016,
        "NA"
      ],
      [
        2017,
        "NA"
      ],
      [
        2018,
        "NA"
      ],
      [
        2019,
        "NA"
      ]
    ],
    "compte_adulte": [
      [
        1960,
        "NA"
      ],
      [
        1961,
        "NA"
      ],
      [
        1962,
        "NA"
      ],
      [
        1963,
        "NA"
      ],
      [
        1964,
        "NA"
      ],
      [
        1965,
        "NA"
      ],
      [
        1966,
        "NA"
      ],
      [
        1967,
        "NA"
      ],
      [
        1968,
        "NA"
      ],
      [
        1969,
        "NA"
      ],
      [
        1970,
        "NA"
      ],
      [
        1971,
        "NA"
      ],
      [
        1972,
        "NA"
      ],
      [
        1973,
        "NA"
      ],
      [
        1974,
        "NA"
      ],
      [
        1975,
        "NA"
      ],
      [
        1976,
        "NA"
      ],
      [
        1977,
        "NA"
      ],
      [
        1978,
        "NA"
      ],
      [
        1979,
        "NA"
      ],
      [
        1980,
        "NA"
      ],
      [
        1981,
        "NA"
      ],
      [
        1982,
        "NA"
      ],
      [
        1983,
        "NA"
      ],
      [
        1984,
        "NA"
      ],
      [
        1985,
        "NA"
      ],
      [
        1986,
        "NA"
      ],
      [
        1987,
        "NA"
      ],
      [
        1988,
        "NA"
      ],
      [
        1989,
        "NA"
      ],
      [
        1990,
        "NA"
      ],
      [
        1991,
        "NA"
      ],
      [
        1992,
        "NA"
      ],
      [
        1993,
        "NA"
      ],
      [
        1994,
        "NA"
      ],
      [
        1995,
        "NA"
      ],
      [
        1996,
        "NA"
      ],
      [
        1997,
        "NA"
      ],
      [
        1998,
        "NA"
      ],
      [
        1999,
        "NA"
      ],
      [
        2000,
        "NA"
      ],
      [
        2001,
        "NA"
      ],
      [
        2002,
        "NA"
      ],
      [
        2003,
        "NA"
      ],
      [
        2004,
        "NA"
      ],
      [
        2005,
        "NA"
      ],
      [
        2006,
        "NA"
      ],
      [
        2007,
        "NA"
      ],
      [
        2008,
        "NA"
      ],
      [
        2009,
        "NA"
      ],
      [
        2010,
        "NA"
      ],
      [
        2011,
        7.8565015793
      ],
      [
        2012,
        "NA"
      ],
      [
        2013,
        "NA"
      ],
      [
        2014,
        17.0081825256
      ],
      [
        2015,
        "NA"
      ],
      [
        2016,
        "NA"
      ],
      [
        2017,
        "NA"
      ],
      [
        2018,
        "NA"
      ],
      [
        2019,
        "NA"
      ]
    ],
    "compte_jeune": [
      [
        1960,
        "NA"
      ],
      [
        1961,
        "NA"
      ],
      [
        1962,
        "NA"
      ],
      [
        1963,
        "NA"
      ],
      [
        1964,
        "NA"
      ],
      [
        1965,
        "NA"
      ],
      [
        1966,
        "NA"
      ],
      [
        1967,
        "NA"
      ],
      [
        1968,
        "NA"
      ],
      [
        1969,
        "NA"
      ],
      [
        1970,
        "NA"
      ],
      [
        1971,
        "NA"
      ],
      [
        1972,
        "NA"
      ],
      [
        1973,
        "NA"
      ],
      [
        1974,
        "NA"
      ],
      [
        1975,
        "NA"
      ],
      [
        1976,
        "NA"
      ],
      [
        1977,
        "NA"
      ],
      [
        1978,
        "NA"
      ],
      [
        1979,
        "NA"
      ],
      [
        1980,
        "NA"
      ],
      [
        1981,
        "NA"
      ],
      [
        1982,
        "NA"
      ],
      [
        1983,
        "NA"
      ],
      [
        1984,
        "NA"
      ],
      [
        1985,
        "NA"
      ],
      [
        1986,
        "NA"
      ],
      [
        1987,
        "NA"
      ],
      [
        1988,
        "NA"
      ],
      [
        1989,
        "NA"
      ],
      [
        1990,
        "NA"
      ],
      [
        1991,
        "NA"
      ],
      [
        1992,
        "NA"
      ],
      [
        1993,
        "NA"
      ],
      [
        1994,
        "NA"
      ],
      [
        1995,
        "NA"
      ],
      [
        1996,
        "NA"
      ],
      [
        1997,
        "NA"
      ],
      [
        1998,
        "NA"
      ],
      [
        1999,
        "NA"
      ],
      [
        2000,
        "NA"
      ],
      [
        2001,
        "NA"
      ],
      [
        2002,
        "NA"
      ],
      [
        2003,
        "NA"
      ],
      [
        2004,
        "NA"
      ],
      [
        2005,
        "NA"
      ],
      [
        2006,
        "NA"
      ],
      [
        2007,
        "NA"
      ],
      [
        2008,
        "NA"
      ],
      [
        2009,
        "NA"
      ],
      [
        2010,
        "NA"
      ],
      [
        2011,
        4.3183588982
      ],
      [
        2012,
        "NA"
      ],
      [
        2013,
        "NA"
      ],
      [
        2014,
        10.1231689453
      ],
      [
        2015,
        "NA"
      ],
      [
        2016,
        "NA"
      ],
      [
        2017,
        "NA"
      ],
      [
        2018,
        "NA"
      ],
      [
        2019,
        "NA"
      ]
    ],
    "croissance_pib": [
      [
        1960,
        "NA"
      ],
      [
        1961,
        0.022391334
      ],
      [
        1962,
        6.9158421542
      ],
      [
        1963,
        -2.8469716799
      ],
      [
        1964,
        -1.1204491183
      ],
      [
        1965,
        6.7770740728
      ],
      [
        1966,
        -3.5751474857999996
      ],
      [
        1967,
        1.4240812824000002
      ],
      [
        1968,
        1.9632208237
      ],
      [
        1969,
        1.3893504919
      ],
      [
        1970,
        5.925074714500001
      ],
      [
        1971,
        2.2473141006
      ],
      [
        1972,
        -5.070986480299999
      ],
      [
        1973,
        0.6321952507
      ],
      [
        1974,
        11.4452891429
      ],
      [
        1975,
        15.7134664496
      ],
      [
        1976,
        16.6652197369
      ],
      [
        1977,
        6.223853781900001
      ],
      [
        1978,
        -5.9309867223
      ],
      [
        1979,
        -5.018599329100001
      ],
      [
        1980,
        1.5243101483000001
      ],
      [
        1981,
        7.437563655
      ],
      [
        1982,
        5.9586664335
      ],
      [
        1983,
        2.0625016940000003
      ],
      [
        1984,
        -5.0089067689
      ],
      [
        1985,
        -6.2810435796
      ],
      [
        1986,
        5.413811011799999
      ],
      [
        1987,
        14.2208845978
      ],
      [
        1988,
        -0.3310918183
      ],
      [
        1989,
        8.931393687
      ],
      [
        1990,
        -5.4700537762
      ],
      [
        1991,
        7.5109106259
      ],
      [
        1992,
        6.577861385
      ],
      [
        1993,
        4.5687491895
      ],
      [
        1994,
        1.0062282426
      ],
      [
        1995,
        5.9970923202
      ],
      [
        1996,
        5.9191247579
      ],
      [
        1997,
        10.5667363096
      ],
      [
        1998,
        4.3085041036
      ],
      [
        1999,
        3.10409568
      ],
      [
        2000,
        6.3458677687
      ],
      [
        2001,
        6.500360420700001
      ],
      [
        2002,
        6.4272739013999995
      ],
      [
        2003,
        7.734591717000001
      ],
      [
        2004,
        3.8833072911
      ],
      [
        2005,
        7.4897381422
      ],
      [
        2006,
        10.064308001699999
      ],
      [
        2007,
        11.5219100334
      ],
      [
        2008,
        7.801963334400001
      ],
      [
        2009,
        3.2418475722
      ],
      [
        2010,
        3.4693350925999997
      ],
      [
        2011,
        -1.9677289787999999
      ],
      [
        2012,
        0.5215592666
      ],
      [
        2013,
        4.3947111322
      ],
      [
        2014,
        2.6794118128
      ],
      [
        2015,
        4.9060451745
      ],
      [
        2016,
        4.700000042
      ],
      [
        2017,
        4.283071004
      ],
      [
        2018,
        -2.3208273208000003
      ],
      [
        2019,
        "NA"
      ]
    ],
    "eau_douce_agri": [
      [
        1960,
        "NA"
      ],
      [
        1961,
        "NA"
      ],
      [
        1962,
        "NA"
      ],
      [
        1963,
        "NA"
      ],
      [
        1964,
        "NA"
      ],
      [
        1965,
        "NA"
      ],
      [
        1966,
        "NA"
      ],
      [
        1967,
        "NA"
      ],
      [
        1968,
        "NA"
      ],
      [
        1969,
        "NA"
      ],
      [
        1970,
        "NA"
      ],
      [
        1971,
        "NA"
      ],
      [
        1972,
        "NA"
      ],
      [
        1973,
        "NA"
      ],
      [
        1974,
        "NA"
      ],
      [
        1975,
        "NA"
      ],
      [
        1976,
        "NA"
      ],
      [
        1977,
        "NA"
      ],
      [
        1978,
        "NA"
      ],
      [
        1979,
        "NA"
      ],
      [
        1980,
        "NA"
      ],
      [
        1981,
        "NA"
      ],
      [
        1982,
        "NA"
      ],
      [
        1983,
        "NA"
      ],
      [
        1984,
        "NA"
      ],
      [
        1985,
        "NA"
      ],
      [
        1986,
        "NA"
      ],
      [
        1987,
        "NA"
      ],
      [
        1988,
        "NA"
      ],
      [
        1989,
        "NA"
      ],
      [
        1990,
        "NA"
      ],
      [
        1991,
        "NA"
      ],
      [
        1992,
        "NA"
      ],
      [
        1993,
        "NA"
      ],
      [
        1994,
        "NA"
      ],
      [
        1995,
        "NA"
      ],
      [
        1996,
        "NA"
      ],
      [
        1997,
        "NA"
      ],
      [
        1998,
        "NA"
      ],
      [
        1999,
        "NA"
      ],
      [
        2000,
        "NA"
      ],
      [
        2001,
        "NA"
      ],
      [
        2002,
        "NA"
      ],
      [
        2003,
        "NA"
      ],
      [
        2004,
        "NA"
      ],
      [
        2005,
        "NA"
      ],
      [
        2006,
        "NA"
      ],
      [
        2007,
        "NA"
      ],
      [
        2008,
        "NA"
      ],
      [
        2009,
        "NA"
      ],
      [
        2010,
        "NA"
      ],
      [
        2011,
        96.21
      ],
      [
        2012,
        "NA"
      ],
      [
        2013,
        "NA"
      ],
      [
        2014,
        "NA"
      ],
      [
        2015,
        "NA"
      ],
      [
        2016,
        "NA"
      ],
      [
        2017,
        "NA"
      ],
      [
        2018,
        "NA"
      ],
      [
        2019,
        "NA"
      ]
    ],
    "eau_potable_primaire": [
      [
        2000,
        "NA"
      ],
      [
        2001,
        "NA"
      ],
      [
        2002,
        "NA"
      ],
      [
        2003,
        "NA"
      ],
      [
        2004,
        "NA"
      ],
      [
        2005,
        "NA"
      ],
      [
        2006,
        "NA"
      ],
      [
        2007,
        "NA"
      ],
      [
        2008,
        "NA"
      ],
      [
        2009,
        "NA"
      ],
      [
        2010,
        "NA"
      ],
      [
        2011,
        "NA"
      ],
      [
        2012,
        "NA"
      ],
      [
        2013,
        "NA"
      ],
      [
        2014,
        "NA"
      ],
      [
        2015,
        "NA"
      ],
      [
        2016,
        93.43653
      ],
      [
        2017,
        "NA"
      ],
      [
        2018,
        "NA"
      ],
      [
        2019,
        "NA"
      ]
    ],
    "emploi_agri": [
      [
        1960,
        "NA"
      ],
      [
        1961,
        "NA"
      ],
      [
        1962,
        "NA"
      ],
      [
        1963,
        "NA"
      ],
      [
        1964,
        "NA"
      ],
      [
        1965,
        "NA"
      ],
      [
        1966,
        "NA"
      ],
      [
        1967,
        "NA"
      ],
      [
        1968,
        "NA"
      ],
      [
        1969,
        "NA"
      ],
      [
        1970,
        "NA"
      ],
      [
        1971,
        "NA"
      ],
      [
        1972,
        "NA"
      ],
      [
        1973,
        "NA"
      ],
      [
        1974,
        "NA"
      ],
      [
        1975,
        "NA"
      ],
      [
        1976,
        "NA"
      ],
      [
        1977,
        "NA"
      ],
      [
        1978,
        "NA"
      ],
      [
        1979,
        "NA"
      ],
      [
        1980,
        "NA"
      ],
      [
        1981,
        "NA"
      ],
      [
        1982,
        "NA"
      ],
      [
        1983,
        "NA"
      ],
      [
        1984,
        "NA"
      ],
      [
        1985,
        "NA"
      ],
      [
        1986,
        "NA"
      ],
      [
        1987,
        "NA"
      ],
      [
        1988,
        "NA"
      ],
      [
        1989,
        "NA"
      ],
      [
        1990,
        "NA"
      ],
      [
        1991,
        53.2910003662
      ],
      [
        1992,
        53.3899993896
      ],
      [
        1993,
        53.186000824
      ],
      [
        1994,
        52.6489982605
      ],
      [
        1995,
        52.8510017395
      ],
      [
        1996,
        53.077999115
      ],
      [
        1997,
        52.9510002136
      ],
      [
        1998,
        52.236000061000006
      ],
      [
        1999,
        52.2410011292
      ],
      [
        2000,
        52.0279998779
      ],
      [
        2001,
        51.4210014343
      ],
      [
        2002,
        51.1150016785
      ],
      [
        2003,
        50.548000335699996
      ],
      [
        2004,
        49.909999847399995
      ],
      [
        2005,
        49.3569984436
      ],
      [
        2006,
        48.4780006409
      ],
      [
        2007,
        48.1279983521
      ],
      [
        2008,
        47.6829986572
      ],
      [
        2009,
        46.4090003967
      ],
      [
        2010,
        45.562000274700004
      ],
      [
        2011,
        44.602001190200006
      ],
      [
        2012,
        43.473999023400005
      ],
      [
        2013,
        42.638999939
      ],
      [
        2014,
        42.2220001221
      ],
      [
        2015,
        41.4850006104
      ],
      [
        2016,
        40.858001709
      ],
      [
        2017,
        40.287998199499995
      ],
      [
        2018,
        40.1069984436
      ],
      [
        2019,
        39.938999175999996
      ]
    ],
    "enseignant_primaire": [
      [
        1960,
        "NA"
      ],
      [
        1961,
        "NA"
      ],
      [
        1962,
        "NA"
      ],
      [
        1963,
        "NA"
      ],
      [
        1964,
        "NA"
      ],
      [
        1965,
        "NA"
      ],
      [
        1966,
        "NA"
      ],
      [
        1967,
        "NA"
      ],
      [
        1968,
        "NA"
      ],
      [
        1969,
        "NA"
      ],
      [
        1970,
        "NA"
      ],
      [
        1971,
        "NA"
      ],
      [
        1972,
        "NA"
      ],
      [
        1973,
        "NA"
      ],
      [
        1974,
        "NA"
      ],
      [
        1975,
        "NA"
      ],
      [
        1976,
        "NA"
      ],
      [
        1977,
        "NA"
      ],
      [
        1978,
        "NA"
      ],
      [
        1979,
        "NA"
      ],
      [
        1980,
        "NA"
      ],
      [
        1981,
        "NA"
      ],
      [
        1982,
        "NA"
      ],
      [
        1983,
        "NA"
      ],
      [
        1984,
        "NA"
      ],
      [
        1985,
        "NA"
      ],
      [
        1986,
        "NA"
      ],
      [
        1987,
        "NA"
      ],
      [
        1988,
        "NA"
      ],
      [
        1989,
        "NA"
      ],
      [
        1990,
        "NA"
      ],
      [
        1991,
        "NA"
      ],
      [
        1992,
        "NA"
      ],
      [
        1993,
        "NA"
      ],
      [
        1994,
        "NA"
      ],
      [
        1995,
        "NA"
      ],
      [
        1996,
        "NA"
      ],
      [
        1997,
        "NA"
      ],
      [
        1998,
        "NA"
      ],
      [
        1999,
        "NA"
      ],
      [
        2000,
        "NA"
      ],
      [
        2001,
        "NA"
      ],
      [
        2002,
        "NA"
      ],
      [
        2003,
        "NA"
      ],
      [
        2004,
        "NA"
      ],
      [
        2005,
        "NA"
      ],
      [
        2006,
        "NA"
      ],
      [
        2007,
        "NA"
      ],
      [
        2008,
        "NA"
      ],
      [
        2009,
        "NA"
      ],
      [
        2010,
        "NA"
      ],
      [
        2011,
        "NA"
      ],
      [
        2012,
        "NA"
      ],
      [
        2013,
        "NA"
      ],
      [
        2014,
        "NA"
      ],
      [
        2015,
        "NA"
      ],
      [
        2016,
        "NA"
      ],
      [
        2017,
        "NA"
      ],
      [
        2018,
        "NA"
      ],
      [
        2019,
        "NA"
      ]
    ],
    "enseignant_secondaire": [
      [
        1960,
        "NA"
      ],
      [
        1961,
        "NA"
      ],
      [
        1962,
        "NA"
      ],
      [
        1963,
        "NA"
      ],
      [
        1964,
        "NA"
      ],
      [
        1965,
        "NA"
      ],
      [
        1966,
        "NA"
      ],
      [
        1967,
        "NA"
      ],
      [
        1968,
        "NA"
      ],
      [
        1969,
        "NA"
      ],
      [
        1970,
        "NA"
      ],
      [
        1971,
        "NA"
      ],
      [
        1972,
        "NA"
      ],
      [
        1973,
        "NA"
      ],
      [
        1974,
        "NA"
      ],
      [
        1975,
        "NA"
      ],
      [
        1976,
        "NA"
      ],
      [
        1977,
        "NA"
      ],
      [
        1978,
        "NA"
      ],
      [
        1979,
        "NA"
      ],
      [
        1980,
        "NA"
      ],
      [
        1981,
        "NA"
      ],
      [
        1982,
        "NA"
      ],
      [
        1983,
        "NA"
      ],
      [
        1984,
        "NA"
      ],
      [
        1985,
        "NA"
      ],
      [
        1986,
        "NA"
      ],
      [
        1987,
        "NA"
      ],
      [
        1988,
        "NA"
      ],
      [
        1989,
        "NA"
      ],
      [
        1990,
        "NA"
      ],
      [
        1991,
        "NA"
      ],
      [
        1992,
        "NA"
      ],
      [
        1993,
        "NA"
      ],
      [
        1994,
        "NA"
      ],
      [
        1995,
        "NA"
      ],
      [
        1996,
        "NA"
      ],
      [
        1997,
        "NA"
      ],
      [
        1998,
        "NA"
      ],
      [
        1999,
        "NA"
      ],
      [
        2000,
        "NA"
      ],
      [
        2001,
        "NA"
      ],
      [
        2002,
        "NA"
      ],
      [
        2003,
        "NA"
      ],
      [
        2004,
        "NA"
      ],
      [
        2005,
        "NA"
      ],
      [
        2006,
        "NA"
      ],
      [
        2007,
        "NA"
      ],
      [
        2008,
        "NA"
      ],
      [
        2009,
        "NA"
      ],
      [
        2010,
        "NA"
      ],
      [
        2011,
        "NA"
      ],
      [
        2012,
        "NA"
      ],
      [
        2013,
        "NA"
      ],
      [
        2014,
        "NA"
      ],
      [
        2015,
        "NA"
      ],
      [
        2016,
        "NA"
      ],
      [
        2017,
        "NA"
      ],
      [
        2018,
        "NA"
      ],
      [
        2019,
        "NA"
      ]
    ],
    "frag_pol": [
      [
        2006,
        1.0
      ],
      [
        2007,
        1.0
      ],
      [
        2008,
        1.0
      ],
      [
        2009,
        1.0
      ],
      [
        2010,
        1.0
      ],
      [
        2011,
        1.0
      ],
      [
        2012,
        1.0
      ],
      [
        2013,
        1.0
      ],
      [
        2014,
        1.0
      ],
      [
        2015,
        1.0
      ],
      [
        2016,
        1.0
      ],
      [
        2017,
        1.0
      ]
    ],
    "idh": [
      [
        1990,
        0.331
      ],
      [
        1991,
        0.336
      ],
      [
        1992,
        0.345
      ],
      [
        1993,
        0.35200000000000004
      ],
      [
        1994,
        0.359
      ],
      [
        1995,
        0.366
      ],
      [
        1996,
        0.375
      ],
      [
        1997,
        0.384
      ],
      [
        1998,
        0.39
      ],
      [
        1999,
        0.396
      ],
      [
        2000,
        0.402
      ],
      [
        2001,
        0.408
      ],
      [
        2002,
        0.414
      ],
      [
        2003,
        0.42
      ],
      [
        2004,
        0.429
      ],
      [
        2005,
        0.436
      ],
      [
        2006,
        0.446
      ],
      [
        2007,
        0.451
      ],
      [
        2008,
        0.463
      ],
      [
        2009,
        0.468
      ],
      [
        2010,
        0.47
      ],
      [
        2011,
        0.474
      ],
      [
        2012,
        0.485
      ],
      [
        2013,
        0.475
      ],
      [
        2014,
        0.4920000000000001
      ],
      [
        2015,
        0.4970000000000001
      ],
      [
        2016,
        0.499
      ],
      [
        2017,
        0.502
      ]
    ],
    "lib_monde": [
      [
        2013,
        1.0
      ],
      [
        2014,
        1.0
      ],
      [
        2015,
        1.0
      ],
      [
        2016,
        1.0
      ],
      [
        2017,
        1.0
      ],
      [
        2018,
        1.0
      ]
    ],
    "migration": [
      [
        1955,
        0.0
      ],
      [
        1960,
        0.0
      ],
      [
        1965,
        0.0
      ],
      [
        1970,
        0.0
      ],
      [
        1975,
        0.35700000000000004
      ],
      [
        1980,
        2.702
      ],
      [
        1985,
        2.7739999999999996
      ],
      [
        1990,
        1.6059999999999999
      ],
      [
        1995,
        5.8389999999999995
      ],
      [
        2000,
        -4.6930000000000005
      ],
      [
        2005,
        -3.7510000000000003
      ],
      [
        2010,
        -6.002000000000001
      ],
      [
        2015,
        -2.931
      ],
      [
        2020,
        -1.208
      ],
      [
        2025,
        -0.215
      ],
      [
        2030,
        -0.191
      ],
      [
        2035,
        -0.171
      ],
      [
        2040,
        -0.155
      ],
      [
        2045,
        -0.14
      ],
      [
        2050,
        -0.128
      ],
      [
        2055,
        -0.11800000000000001
      ],
      [
        2060,
        -0.109
      ],
      [
        2065,
        -0.102
      ],
      [
        2070,
        -0.095
      ],
      [
        2075,
        -0.09
      ],
      [
        2080,
        -0.085
      ],
      [
        2085,
        -0.081
      ],
      [
        2090,
        -0.077
      ],
      [
        2095,
        -0.07400000000000001
      ],
      [
        2100,
        -0.071
      ]
    ],
    "mortal_infant": [
      [
        1960,
        176.7
      ],
      [
        1961,
        173.7
      ],
      [
        1962,
        170.9
      ],
      [
        1963,
        168.3
      ],
      [
        1964,
        165.8
      ],
      [
        1965,
        163.6
      ],
      [
        1966,
        161.6
      ],
      [
        1967,
        159.8
      ],
      [
        1968,
        158.3
      ],
      [
        1969,
        157.0
      ],
      [
        1970,
        155.9
      ],
      [
        1971,
        155.0
      ],
      [
        1972,
        154.1
      ],
      [
        1973,
        153.3
      ],
      [
        1974,
        152.4
      ],
      [
        1975,
        151.4
      ],
      [
        1976,
        150.2
      ],
      [
        1977,
        149.1
      ],
      [
        1978,
        148.0
      ],
      [
        1979,
        147.0
      ],
      [
        1980,
        146.0
      ],
      [
        1981,
        145.1
      ],
      [
        1982,
        144.1
      ],
      [
        1983,
        143.2
      ],
      [
        1984,
        142.1
      ],
      [
        1985,
        140.8
      ],
      [
        1986,
        139.4
      ],
      [
        1987,
        137.7
      ],
      [
        1988,
        135.8
      ],
      [
        1989,
        133.7
      ],
      [
        1990,
        131.6
      ],
      [
        1991,
        129.4
      ],
      [
        1992,
        127.1
      ],
      [
        1993,
        124.7
      ],
      [
        1994,
        122.3
      ],
      [
        1995,
        119.6
      ],
      [
        1996,
        117.0
      ],
      [
        1997,
        114.1
      ],
      [
        1998,
        111.0
      ],
      [
        1999,
        107.7
      ],
      [
        2000,
        104.3
      ],
      [
        2001,
        100.9
      ],
      [
        2002,
        97.5
      ],
      [
        2003,
        94.2
      ],
      [
        2004,
        91.1
      ],
      [
        2005,
        88.2
      ],
      [
        2006,
        85.4
      ],
      [
        2007,
        82.8
      ],
      [
        2008,
        80.4
      ],
      [
        2009,
        78.1
      ],
      [
        2010,
        75.9
      ],
      [
        2011,
        73.9
      ],
      [
        2012,
        72.0
      ],
      [
        2013,
        70.1
      ],
      [
        2014,
        68.2
      ],
      [
        2015,
        66.3
      ],
      [
        2016,
        64.4
      ],
      [
        2017,
        62.4
      ],
      [
        2018,
        60.5
      ],
      [
        2019,
        "NA"
      ]
    ],
    "pib": [
      [
        1980,
        9.095
      ],
      [
        1981,
        6.53
      ],
      [
        1982,
        4.748
      ],
      [
        1983,
        6.485
      ],
      [
        1984,
        7.992000000000001
      ],
      [
        1985,
        5.547000000000001
      ],
      [
        1986,
        7.4
      ],
      [
        1987,
        11.964
      ],
      [
        1988,
        9.551
      ],
      [
        1989,
        16.852999999999998
      ],
      [
        1990,
        2.245
      ],
      [
        1991,
        2.528
      ],
      [
        1992,
        3.1
      ],
      [
        1993,
        5.246
      ],
      [
        1994,
        5.961
      ],
      [
        1995,
        6.694
      ],
      [
        1996,
        8.377
      ],
      [
        1997,
        10.241
      ],
      [
        1998,
        10.924000000000001
      ],
      [
        1999,
        10.714
      ],
      [
        2000,
        13.134
      ],
      [
        2001,
        15.716
      ],
      [
        2002,
        18.137
      ],
      [
        2003,
        21.355
      ],
      [
        2004,
        26.646
      ],
      [
        2005,
        35.183
      ],
      [
        2006,
        45.263999999999996
      ],
      [
        2007,
        59.44
      ],
      [
        2008,
        64.833
      ],
      [
        2009,
        54.812
      ],
      [
        2010,
        65.71600000000001
      ],
      [
        2011,
        66.44800000000001
      ],
      [
        2012,
        48.948
      ],
      [
        2013,
        52.891999999999996
      ],
      [
        2014,
        60.726000000000006
      ],
      [
        2015,
        65.266
      ],
      [
        2016,
        55.563
      ],
      [
        2017,
        45.943999999999996
      ],
      [
        2018,
        34.282
      ],
      [
        2019,
        30.873
      ],
      [
        2020,
        33.69
      ],
      [
        2021,
        33.929
      ],
      [
        2022,
        34.343
      ],
      [
        2023,
        34.887
      ],
      [
        2024,
        35.48
      ]
    ],
    "pib_hab": [
      [
        1980,
        486.908
      ],
      [
        1981,
        339.389
      ],
      [
        1982,
        239.80700000000002
      ],
      [
        1983,
        318.513
      ],
      [
        1984,
        375.019
      ],
      [
        1985,
        253.18400000000003
      ],
      [
        1986,
        328.588
      ],
      [
        1987,
        516.781
      ],
      [
        1988,
        404.705
      ],
      [
        1989,
        696.3910000000001
      ],
      [
        1990,
        87.197
      ],
      [
        1991,
        95.292
      ],
      [
        1992,
        113.476
      ],
      [
        1993,
        186.50599999999997
      ],
      [
        1994,
        205.922
      ],
      [
        1995,
        239.507
      ],
      [
        1996,
        292.909
      ],
      [
        1997,
        350.723
      ],
      [
        1998,
        366.582
      ],
      [
        1999,
        352.44199999999995
      ],
      [
        2000,
        422.316
      ],
      [
        2001,
        492.676
      ],
      [
        2002,
        554.6519999999999
      ],
      [
        2003,
        635.575
      ],
      [
        2004,
        772.939
      ],
      [
        2005,
        996.677
      ],
      [
        2006,
        1249.767
      ],
      [
        2007,
        1599.596
      ],
      [
        2008,
        1700.513
      ],
      [
        2009,
        1401.244
      ],
      [
        2010,
        1637.4189999999999
      ],
      [
        2011,
        2034.461
      ],
      [
        2012,
        1396.2920000000001
      ],
      [
        2013,
        1462.582
      ],
      [
        2014,
        1628.497
      ],
      [
        2015,
        1698.0770000000002
      ],
      [
        2016,
        1403.152
      ],
      [
        2017,
        1126.5510000000002
      ],
      [
        2018,
        816.543
      ],
      [
        2019,
        714.295
      ],
      [
        2020,
        759.706
      ],
      [
        2021,
        745.7280000000001
      ],
      [
        2022,
        735.699
      ],
      [
        2023,
        728.4119999999999
      ],
      [
        2024,
        722.0169999999999
      ]
    ],
    "pib_ppa": [
      [
        1980,
        20.756999999999998
      ],
      [
        1981,
        24.156999999999996
      ],
      [
        1982,
        26.708000000000002
      ],
      [
        1983,
        27.335
      ],
      [
        1984,
        26.728
      ],
      [
        1985,
        27.401
      ],
      [
        1986,
        30.729
      ],
      [
        1987,
        33.524
      ],
      [
        1988,
        36.22
      ],
      [
        1989,
        38.175
      ],
      [
        1990,
        38.93
      ],
      [
        1991,
        43.074
      ],
      [
        1992,
        46.497
      ],
      [
        1993,
        48.908
      ],
      [
        1994,
        51.707
      ],
      [
        1995,
        57.468999999999994
      ],
      [
        1996,
        61.72
      ],
      [
        1997,
        66.587
      ],
      [
        1998,
        72.88600000000001
      ],
      [
        1999,
        77.07
      ],
      [
        2000,
        85.399
      ],
      [
        2001,
        96.757
      ],
      [
        2002,
        104.12700000000001
      ],
      [
        2003,
        112.73100000000001
      ],
      [
        2004,
        121.711
      ],
      [
        2005,
        132.591
      ],
      [
        2006,
        145.526
      ],
      [
        2007,
        158.005
      ],
      [
        2008,
        167.275
      ],
      [
        2009,
        163.885
      ],
      [
        2010,
        172.192
      ],
      [
        2011,
        170.822
      ],
      [
        2012,
        144.494
      ],
      [
        2013,
        149.915
      ],
      [
        2014,
        159.822
      ],
      [
        2015,
        164.575
      ],
      [
        2016,
        172.045
      ],
      [
        2017,
        176.528
      ],
      [
        2018,
        176.68
      ],
      [
        2019,
        175.22799999999998
      ],
      [
        2020,
        163.606
      ],
      [
        2021,
        161.732
      ]
    ],
    "pop_pauvrete": [
      [
        1960,
        "NA"
      ],
      [
        1961,
        "NA"
      ],
      [
        1962,
        "NA"
      ],
      [
        1963,
        "NA"
      ],
      [
        1964,
        "NA"
      ],
      [
        1965,
        "NA"
      ],
      [
        1966,
        "NA"
      ],
      [
        1967,
        "NA"
      ],
      [
        1968,
        "NA"
      ],
      [
        1969,
        "NA"
      ],
      [
        1970,
        "NA"
      ],
      [
        1971,
        "NA"
      ],
      [
        1972,
        "NA"
      ],
      [
        1973,
        "NA"
      ],
      [
        1974,
        "NA"
      ],
      [
        1975,
        "NA"
      ],
      [
        1976,
        "NA"
      ],
      [
        1977,
        "NA"
      ],
      [
        1978,
        "NA"
      ],
      [
        1979,
        "NA"
      ],
      [
        1980,
        "NA"
      ],
      [
        1981,
        "NA"
      ],
      [
        1982,
        "NA"
      ],
      [
        1983,
        "NA"
      ],
      [
        1984,
        "NA"
      ],
      [
        1985,
        "NA"
      ],
      [
        1986,
        "NA"
      ],
      [
        1987,
        "NA"
      ],
      [
        1988,
        "NA"
      ],
      [
        1989,
        "NA"
      ],
      [
        1990,
        "NA"
      ],
      [
        1991,
        "NA"
      ],
      [
        1992,
        "NA"
      ],
      [
        1993,
        "NA"
      ],
      [
        1994,
        "NA"
      ],
      [
        1995,
        "NA"
      ],
      [
        1996,
        "NA"
      ],
      [
        1997,
        "NA"
      ],
      [
        1998,
        "NA"
      ],
      [
        1999,
        "NA"
      ],
      [
        2000,
        "NA"
      ],
      [
        2001,
        "NA"
      ],
      [
        2002,
        "NA"
      ],
      [
        2003,
        "NA"
      ],
      [
        2004,
        "NA"
      ],
      [
        2005,
        "NA"
      ],
      [
        2006,
        "NA"
      ],
      [
        2007,
        "NA"
      ],
      [
        2008,
        "NA"
      ],
      [
        2009,
        16.2
      ],
      [
        2010,
        "NA"
      ],
      [
        2011,
        "NA"
      ],
      [
        2012,
        "NA"
      ],
      [
        2013,
        "NA"
      ],
      [
        2014,
        12.7
      ],
      [
        2015,
        "NA"
      ],
      [
        2016,
        "NA"
      ],
      [
        2017,
        "NA"
      ],
      [
        2018,
        "NA"
      ],
      [
        2019,
        "NA"
      ]
    ],
    "pop_rurale": [
      [
        1960,
        89.25399999999999
      ],
      [
        1961,
        88.76799999999999
      ],
      [
        1962,
        88.26299999999999
      ],
      [
        1963,
        87.738
      ],
      [
        1964,
        87.19200000000001
      ],
      [
        1965,
        86.62700000000001
      ],
      [
        1966,
        86.041
      ],
      [
        1967,
        85.43299999999999
      ],
      [
        1968,
        84.803
      ],
      [
        1969,
        84.152
      ],
      [
        1970,
        83.477
      ],
      [
        1971,
        82.78
      ],
      [
        1972,
        82.059
      ],
      [
        1973,
        81.452
      ],
      [
        1974,
        81.256
      ],
      [
        1975,
        81.057
      ],
      [
        1976,
        80.857
      ],
      [
        1977,
        80.656
      ],
      [
        1978,
        80.453
      ],
      [
        1979,
        80.248
      ],
      [
        1980,
        80.041
      ],
      [
        1981,
        79.834
      ],
      [
        1982,
        79.624
      ],
      [
        1983,
        79.09899999999999
      ],
      [
        1984,
        78.097
      ],
      [
        1985,
        77.063
      ],
      [
        1986,
        75.995
      ],
      [
        1987,
        74.893
      ],
      [
        1988,
        73.756
      ],
      [
        1989,
        72.59
      ],
      [
        1990,
        71.39
      ],
      [
        1991,
        70.16
      ],
      [
        1992,
        68.89699999999999
      ],
      [
        1993,
        67.873
      ],
      [
        1994,
        67.821
      ],
      [
        1995,
        67.768
      ],
      [
        1996,
        67.71600000000001
      ],
      [
        1997,
        67.663
      ],
      [
        1998,
        67.61
      ],
      [
        1999,
        67.558
      ],
      [
        2000,
        67.505
      ],
      [
        2001,
        67.452
      ],
      [
        2002,
        67.399
      ],
      [
        2003,
        67.346
      ],
      [
        2004,
        67.293
      ],
      [
        2005,
        67.24
      ],
      [
        2006,
        67.187
      ],
      [
        2007,
        67.134
      ],
      [
        2008,
        67.081
      ],
      [
        2009,
        67.007
      ],
      [
        2010,
        66.911
      ],
      [
        2011,
        66.793
      ],
      [
        2012,
        66.654
      ],
      [
        2013,
        66.493
      ],
      [
        2014,
        66.311
      ],
      [
        2015,
        66.10600000000001
      ],
      [
        2016,
        65.87899999999999
      ],
      [
        2017,
        65.63
      ],
      [
        2018,
        65.358
      ],
      [
        2019,
        "NA"
      ]
    ],
    "pop_tot": [
      [
        1950,
        5.733789
      ],
      [
        1951,
        5.884664
      ],
      [
        1952,
        6.041325
      ],
      [
        1953,
        6.204098999999999
      ],
      [
        1954,
        6.373308
      ],
      [
        1955,
        6.5492979999999985
      ],
      [
        1956,
        6.732436999999999
      ],
      [
        1957,
        6.923114999999999
      ],
      [
        1958,
        7.121741
      ],
      [
        1959,
        7.328717999999999
      ],
      [
        1960,
        7.544491000000001
      ],
      [
        1961,
        7.769482000000001
      ],
      [
        1962,
        8.004121000000001
      ],
      [
        1963,
        8.248812
      ],
      [
        1964,
        8.503994
      ],
      [
        1965,
        8.770097
      ],
      [
        1966,
        9.047798
      ],
      [
        1967,
        9.337657
      ],
      [
        1968,
        9.63984
      ],
      [
        1969,
        9.954410000000001
      ],
      [
        1970,
        10.2817
      ],
      [
        1971,
        10.621472
      ],
      [
        1972,
        10.974622
      ],
      [
        1973,
        11.343926
      ],
      [
        1974,
        11.732958
      ],
      [
        1975,
        12.144135
      ],
      [
        1976,
        12.578407
      ],
      [
        1977,
        13.034625
      ],
      [
        1978,
        13.510421
      ],
      [
        1979,
        14.002303
      ],
      [
        1980,
        14.507468
      ],
      [
        1981,
        15.027248
      ],
      [
        1982,
        15.562125
      ],
      [
        1983,
        16.10762
      ],
      [
        1984,
        16.657958999999998
      ],
      [
        1985,
        17.210187
      ],
      [
        1986,
        17.757491
      ],
      [
        1987,
        18.303435
      ],
      [
        1988,
        18.86756
      ],
      [
        1989,
        19.476647
      ],
      [
        1990,
        20.14759
      ],
      [
        1991,
        20.891441
      ],
      [
        1992,
        21.696244
      ],
      [
        1993,
        22.527834
      ],
      [
        1994,
        23.338464000000002
      ],
      [
        1995,
        24.094747
      ],
      [
        1996,
        24.782383000000006
      ],
      [
        1997,
        25.413917
      ],
      [
        1998,
        26.015521
      ],
      [
        1999,
        26.626520000000003
      ],
      [
        2000,
        27.275015000000003
      ],
      [
        2001,
        27.971082
      ],
      [
        2002,
        28.704778
      ],
      [
        2003,
        29.460519
      ],
      [
        2004,
        30.214193
      ],
      [
        2005,
        30.949516
      ],
      [
        2006,
        31.661823
      ],
      [
        2007,
        32.360621
      ],
      [
        2008,
        33.060837
      ],
      [
        2009,
        33.783788
      ],
      [
        2010,
        34.545013
      ],
      [
        2011,
        35.349681
      ],
      [
        2012,
        36.193783
      ],
      [
        2013,
        37.07255
      ],
      [
        2014,
        37.977655
      ],
      [
        2015,
        38.90295
      ],
      [
        2016,
        39.847439
      ],
      [
        2017,
        40.813397
      ],
      [
        2018,
        41.801533000000006
      ],
      [
        2019,
        42.813238
      ],
      [
        2020,
        43.84926
      ],
      [
        2021,
        44.909353
      ],
      [
        2022,
        45.992020000000004
      ],
      [
        2023,
        47.095240999999994
      ],
      [
        2024,
        48.216429999999995
      ],
      [
        2025,
        49.353479
      ],
      [
        2026,
        50.50523200000001
      ],
      [
        2027,
        51.671310999999996
      ],
      [
        2028,
        52.851422
      ],
      [
        2029,
        54.045563
      ],
      [
        2030,
        55.253529
      ],
      [
        2031,
        56.47467
      ],
      [
        2032,
        57.708034
      ],
      [
        2033,
        58.95280200000001
      ],
      [
        2034,
        60.20806700000001
      ],
      [
        2035,
        61.473011
      ],
      [
        2036,
        62.746981999999996
      ],
      [
        2037,
        64.02938900000001
      ],
      [
        2038,
        65.319428
      ],
      [
        2039,
        66.61630000000001
      ],
      [
        2040,
        67.919273
      ],
      [
        2041,
        69.22776800000001
      ],
      [
        2042,
        70.541332
      ],
      [
        2043,
        71.85959100000001
      ],
      [
        2044,
        73.18225
      ],
      [
        2045,
        74.50899100000001
      ],
      [
        2046,
        75.839519
      ],
      [
        2047,
        77.173479
      ],
      [
        2048,
        78.51055500000001
      ],
      [
        2049,
        79.85041700000002
      ],
      [
        2050,
        81.192823
      ],
      [
        2051,
        82.537312
      ],
      [
        2052,
        83.883753
      ],
      [
        2053,
        85.232579
      ],
      [
        2054,
        86.58446799999999
      ],
      [
        2055,
        87.939766
      ],
      [
        2056,
        89.298375
      ],
      [
        2057,
        90.659624
      ],
      [
        2058,
        92.022605
      ],
      [
        2059,
        93.386117
      ],
      [
        2060,
        94.749117
      ],
      [
        2061,
        96.11094200000001
      ],
      [
        2062,
        97.471146
      ],
      [
        2063,
        98.829195
      ],
      [
        2064,
        100.184546
      ],
      [
        2065,
        101.536622
      ],
      [
        2066,
        102.884823
      ],
      [
        2067,
        104.228367
      ],
      [
        2068,
        105.56635800000001
      ],
      [
        2069,
        106.89783999999999
      ],
      [
        2070,
        108.221906
      ],
      [
        2071,
        109.537897
      ],
      [
        2072,
        110.84521
      ],
      [
        2073,
        112.14308700000001
      ],
      [
        2074,
        113.430777
      ],
      [
        2075,
        114.707593
      ],
      [
        2076,
        115.97300700000001
      ],
      [
        2077,
        117.226577
      ],
      [
        2078,
        118.467858
      ],
      [
        2079,
        119.69648899999999
      ],
      [
        2080,
        120.912124
      ],
      [
        2081,
        122.114449
      ],
      [
        2082,
        123.303226
      ],
      [
        2083,
        124.47833500000002
      ],
      [
        2084,
        125.639777
      ],
      [
        2085,
        126.78751100000001
      ],
      [
        2086,
        127.92141299999999
      ],
      [
        2087,
        129.041371
      ],
      [
        2088,
        130.147435
      ],
      [
        2089,
        131.239698
      ],
      [
        2090,
        132.31823500000002
      ],
      [
        2091,
        133.38305499999998
      ],
      [
        2092,
        134.43410699999998
      ],
      [
        2093,
        135.471318
      ],
      [
        2094,
        136.49462
      ],
      [
        2095,
        137.50397099999998
      ],
      [
        2096,
        138.499349
      ],
      [
        2097,
        139.48078099999998
      ],
      [
        2098,
        140.448351
      ],
      [
        2099,
        141.40216
      ],
      [
        2100,
        142.34234899999996
      ]
    ],
    "pop_urbaine": [
      [
        1960,
        10.745999999999999
      ],
      [
        1961,
        11.232000000000001
      ],
      [
        1962,
        11.737
      ],
      [
        1963,
        12.262
      ],
      [
        1964,
        12.808
      ],
      [
        1965,
        13.373
      ],
      [
        1966,
        13.959000000000001
      ],
      [
        1967,
        14.567
      ],
      [
        1968,
        15.197000000000001
      ],
      [
        1969,
        15.847999999999999
      ],
      [
        1970,
        16.523
      ],
      [
        1971,
        17.22
      ],
      [
        1972,
        17.941
      ],
      [
        1973,
        18.548
      ],
      [
        1974,
        18.744
      ],
      [
        1975,
        18.942999999999998
      ],
      [
        1976,
        19.143
      ],
      [
        1977,
        19.344
      ],
      [
        1978,
        19.547
      ],
      [
        1979,
        19.752
      ],
      [
        1980,
        19.959
      ],
      [
        1981,
        20.166
      ],
      [
        1982,
        20.375999999999998
      ],
      [
        1983,
        20.901
      ],
      [
        1984,
        21.903000000000002
      ],
      [
        1985,
        22.936999999999998
      ],
      [
        1986,
        24.005
      ],
      [
        1987,
        25.107
      ],
      [
        1988,
        26.244
      ],
      [
        1989,
        27.41
      ],
      [
        1990,
        28.61
      ],
      [
        1991,
        29.84
      ],
      [
        1992,
        31.103
      ],
      [
        1993,
        32.126999999999995
      ],
      [
        1994,
        32.179
      ],
      [
        1995,
        32.232
      ],
      [
        1996,
        32.284
      ],
      [
        1997,
        32.336999999999996
      ],
      [
        1998,
        32.39
      ],
      [
        1999,
        32.442
      ],
      [
        2000,
        32.495
      ],
      [
        2001,
        32.548
      ],
      [
        2002,
        32.601
      ],
      [
        2003,
        32.654
      ],
      [
        2004,
        32.707
      ],
      [
        2005,
        32.76
      ],
      [
        2006,
        32.813
      ],
      [
        2007,
        32.866
      ],
      [
        2008,
        32.919000000000004
      ],
      [
        2009,
        32.993
      ],
      [
        2010,
        33.089
      ],
      [
        2011,
        33.207
      ],
      [
        2012,
        33.346
      ],
      [
        2013,
        33.507
      ],
      [
        2014,
        33.689
      ],
      [
        2015,
        33.894
      ],
      [
        2016,
        34.121
      ],
      [
        2017,
        34.37
      ],
      [
        2018,
        34.641999999999996
      ],
      [
        2019,
        "NA"
      ]
    ],
    "prod_elec_renouv": [
      [
        1960,
        "NA"
      ],
      [
        1961,
        "NA"
      ],
      [
        1962,
        "NA"
      ],
      [
        1963,
        "NA"
      ],
      [
        1964,
        "NA"
      ],
      [
        1965,
        "NA"
      ],
      [
        1966,
        "NA"
      ],
      [
        1967,
        "NA"
      ],
      [
        1968,
        "NA"
      ],
      [
        1969,
        "NA"
      ],
      [
        1970,
        "NA"
      ],
      [
        1971,
        0.0
      ],
      [
        1972,
        0.0
      ],
      [
        1973,
        0.0
      ],
      [
        1974,
        0.0
      ],
      [
        1975,
        0.0
      ],
      [
        1976,
        0.0
      ],
      [
        1977,
        0.0
      ],
      [
        1978,
        0.0
      ],
      [
        1979,
        0.0
      ],
      [
        1980,
        0.0
      ],
      [
        1981,
        0.0
      ],
      [
        1982,
        0.0
      ],
      [
        1983,
        0.0
      ],
      [
        1984,
        0.0
      ],
      [
        1985,
        0.0
      ],
      [
        1986,
        0.0
      ],
      [
        1987,
        0.0
      ],
      [
        1988,
        0.0
      ],
      [
        1989,
        0.0
      ],
      [
        1990,
        0.0
      ],
      [
        1991,
        0.0
      ],
      [
        1992,
        0.0
      ],
      [
        1993,
        0.0
      ],
      [
        1994,
        0.0
      ],
      [
        1995,
        0.0
      ],
      [
        1996,
        0.0
      ],
      [
        1997,
        0.0
      ],
      [
        1998,
        0.0
      ],
      [
        1999,
        0.0
      ],
      [
        2000,
        0.0
      ],
      [
        2001,
        0.0
      ],
      [
        2002,
        0.0
      ],
      [
        2003,
        0.0
      ],
      [
        2004,
        0.0
      ],
      [
        2005,
        0.0
      ],
      [
        2006,
        0.0
      ],
      [
        2007,
        0.0
      ],
      [
        2008,
        0.0
      ],
      [
        2009,
        0.0
      ],
      [
        2010,
        0.0
      ],
      [
        2011,
        0.0
      ],
      [
        2012,
        0.0
      ],
      [
        2013,
        0.0
      ],
      [
        2014,
        0.0
      ],
      [
        2015,
        0.0
      ],
      [
        2016,
        "NA"
      ],
      [
        2017,
        "NA"
      ],
      [
        2018,
        "NA"
      ],
      [
        2019,
        "NA"
      ]
    ],
    "rdt_cerealier": [
      [
        1960,
        "NA"
      ],
      [
        1961,
        "NA"
      ],
      [
        1962,
        "NA"
      ],
      [
        1963,
        "NA"
      ],
      [
        1964,
        "NA"
      ],
      [
        1965,
        "NA"
      ],
      [
        1966,
        "NA"
      ],
      [
        1967,
        "NA"
      ],
      [
        1968,
        "NA"
      ],
      [
        1969,
        "NA"
      ],
      [
        1970,
        "NA"
      ],
      [
        1971,
        "NA"
      ],
      [
        1972,
        "NA"
      ],
      [
        1973,
        "NA"
      ],
      [
        1974,
        "NA"
      ],
      [
        1975,
        "NA"
      ],
      [
        1976,
        "NA"
      ],
      [
        1977,
        "NA"
      ],
      [
        1978,
        "NA"
      ],
      [
        1979,
        "NA"
      ],
      [
        1980,
        "NA"
      ],
      [
        1981,
        "NA"
      ],
      [
        1982,
        "NA"
      ],
      [
        1983,
        "NA"
      ],
      [
        1984,
        "NA"
      ],
      [
        1985,
        "NA"
      ],
      [
        1986,
        "NA"
      ],
      [
        1987,
        "NA"
      ],
      [
        1988,
        "NA"
      ],
      [
        1989,
        "NA"
      ],
      [
        1990,
        "NA"
      ],
      [
        1991,
        "NA"
      ],
      [
        1992,
        "NA"
      ],
      [
        1993,
        "NA"
      ],
      [
        1994,
        "NA"
      ],
      [
        1995,
        "NA"
      ],
      [
        1996,
        "NA"
      ],
      [
        1997,
        "NA"
      ],
      [
        1998,
        "NA"
      ],
      [
        1999,
        "NA"
      ],
      [
        2000,
        "NA"
      ],
      [
        2001,
        "NA"
      ],
      [
        2002,
        "NA"
      ],
      [
        2003,
        "NA"
      ],
      [
        2004,
        "NA"
      ],
      [
        2005,
        "NA"
      ],
      [
        2006,
        "NA"
      ],
      [
        2007,
        "NA"
      ],
      [
        2008,
        "NA"
      ],
      [
        2009,
        "NA"
      ],
      [
        2010,
        "NA"
      ],
      [
        2011,
        "NA"
      ],
      [
        2012,
        537.3
      ],
      [
        2013,
        592.8
      ],
      [
        2014,
        682.7
      ],
      [
        2015,
        569.9
      ],
      [
        2016,
        684.8
      ],
      [
        2017,
        674.2
      ],
      [
        2018,
        "NA"
      ],
      [
        2019,
        "NA"
      ]
    ],
    "recette_budg": [
      [
        1980,
        "NA"
      ],
      [
        1981,
        "NA"
      ],
      [
        1982,
        "NA"
      ],
      [
        1983,
        "NA"
      ],
      [
        1984,
        "NA"
      ],
      [
        1985,
        "NA"
      ],
      [
        1986,
        "NA"
      ],
      [
        1987,
        "NA"
      ],
      [
        1988,
        "NA"
      ],
      [
        1989,
        "NA"
      ],
      [
        1990,
        14.758
      ],
      [
        1991,
        19.223
      ],
      [
        1992,
        25.904
      ],
      [
        1993,
        15.644
      ],
      [
        1994,
        16.519000000000002
      ],
      [
        1995,
        9.398
      ],
      [
        1996,
        6.695
      ],
      [
        1997,
        6.79
      ],
      [
        1998,
        7.228
      ],
      [
        1999,
        7.596
      ],
      [
        2000,
        9.664
      ],
      [
        2001,
        9.099
      ],
      [
        2002,
        9.855
      ],
      [
        2003,
        13.312000000000001
      ],
      [
        2004,
        16.668
      ],
      [
        2005,
        17.874000000000002
      ],
      [
        2006,
        17.5
      ],
      [
        2007,
        16.741
      ],
      [
        2008,
        20.203
      ],
      [
        2009,
        14.959000000000001
      ],
      [
        2010,
        17.462
      ],
      [
        2011,
        15.905999999999999
      ],
      [
        2012,
        9.113
      ],
      [
        2013,
        9.562999999999999
      ],
      [
        2014,
        8.792
      ],
      [
        2015,
        8.414
      ],
      [
        2016,
        7.075
      ],
      [
        2017,
        7.178
      ],
      [
        2018,
        7.471
      ],
      [
        2019,
        12.404000000000002
      ],
      [
        2020,
        5.745
      ],
      [
        2021,
        4.7330000000000005
      ],
      [
        2022,
        4.115
      ],
      [
        2023,
        3.7310000000000003
      ],
      [
        2024,
        3.43
      ]
    ],
    "regime_pol": [
      [
        1816,
        "NA"
      ],
      [
        1817,
        "NA"
      ],
      [
        1818,
        "NA"
      ],
      [
        1819,
        "NA"
      ],
      [
        1820,
        "NA"
      ],
      [
        1821,
        -20.0
      ],
      [
        1822,
        -20.0
      ],
      [
        1823,
        -20.0
      ],
      [
        1824,
        -20.0
      ],
      [
        1825,
        -20.0
      ],
      [
        1826,
        -20.0
      ],
      [
        1827,
        -20.0
      ],
      [
        1828,
        -20.0
      ],
      [
        1829,
        -20.0
      ],
      [
        1830,
        -20.0
      ],
      [
        1831,
        -20.0
      ],
      [
        1832,
        -20.0
      ],
      [
        1833,
        -20.0
      ],
      [
        1834,
        -20.0
      ],
      [
        1835,
        -20.0
      ],
      [
        1836,
        -20.0
      ],
      [
        1837,
        -20.0
      ],
      [
        1838,
        -20.0
      ],
      [
        1839,
        -20.0
      ],
      [
        1840,
        -20.0
      ],
      [
        1841,
        -20.0
      ],
      [
        1842,
        -20.0
      ],
      [
        1843,
        -20.0
      ],
      [
        1844,
        -20.0
      ],
      [
        1845,
        -20.0
      ],
      [
        1846,
        -20.0
      ],
      [
        1847,
        -20.0
      ],
      [
        1848,
        -20.0
      ],
      [
        1849,
        -20.0
      ],
      [
        1850,
        -20.0
      ],
      [
        1851,
        -20.0
      ],
      [
        1852,
        -20.0
      ],
      [
        1853,
        -20.0
      ],
      [
        1854,
        -20.0
      ],
      [
        1855,
        -20.0
      ],
      [
        1856,
        -20.0
      ],
      [
        1857,
        -20.0
      ],
      [
        1858,
        -20.0
      ],
      [
        1859,
        -20.0
      ],
      [
        1860,
        -20.0
      ],
      [
        1861,
        -20.0
      ],
      [
        1862,
        -20.0
      ],
      [
        1863,
        -20.0
      ],
      [
        1864,
        -20.0
      ],
      [
        1865,
        -20.0
      ],
      [
        1866,
        -20.0
      ],
      [
        1867,
        -20.0
      ],
      [
        1868,
        -20.0
      ],
      [
        1869,
        -20.0
      ],
      [
        1870,
        -20.0
      ],
      [
        1871,
        -20.0
      ],
      [
        1872,
        -20.0
      ],
      [
        1873,
        -20.0
      ],
      [
        1874,
        -20.0
      ],
      [
        1875,
        -20.0
      ],
      [
        1876,
        -20.0
      ],
      [
        1877,
        -20.0
      ],
      [
        1878,
        -20.0
      ],
      [
        1879,
        -20.0
      ],
      [
        1880,
        -20.0
      ],
      [
        1881,
        -20.0
      ],
      [
        1882,
        -20.0
      ],
      [
        1883,
        -20.0
      ],
      [
        1884,
        -20.0
      ],
      [
        1885,
        -20.0
      ],
      [
        1886,
        -20.0
      ],
      [
        1887,
        -20.0
      ],
      [
        1888,
        -20.0
      ],
      [
        1889,
        -20.0
      ],
      [
        1890,
        -20.0
      ],
      [
        1891,
        -20.0
      ],
      [
        1892,
        -20.0
      ],
      [
        1893,
        -20.0
      ],
      [
        1894,
        -20.0
      ],
      [
        1895,
        -20.0
      ],
      [
        1896,
        -20.0
      ],
      [
        1897,
        -20.0
      ],
      [
        1898,
        -20.0
      ],
      [
        1899,
        -20.0
      ],
      [
        1900,
        -20.0
      ],
      [
        1901,
        -20.0
      ],
      [
        1902,
        -20.0
      ],
      [
        1903,
        -20.0
      ],
      [
        1904,
        -20.0
      ],
      [
        1905,
        -20.0
      ],
      [
        1906,
        -20.0
      ],
      [
        1907,
        -20.0
      ],
      [
        1908,
        -20.0
      ],
      [
        1909,
        -20.0
      ],
      [
        1910,
        -20.0
      ],
      [
        1911,
        -20.0
      ],
      [
        1912,
        -20.0
      ],
      [
        1913,
        -20.0
      ],
      [
        1914,
        -20.0
      ],
      [
        1915,
        -20.0
      ],
      [
        1916,
        -20.0
      ],
      [
        1917,
        -20.0
      ],
      [
        1918,
        -20.0
      ],
      [
        1919,
        -20.0
      ],
      [
        1920,
        -20.0
      ],
      [
        1921,
        -20.0
      ],
      [
        1922,
        -20.0
      ],
      [
        1923,
        -20.0
      ],
      [
        1924,
        -20.0
      ],
      [
        1925,
        -20.0
      ],
      [
        1926,
        -20.0
      ],
      [
        1927,
        -20.0
      ],
      [
        1928,
        -20.0
      ],
      [
        1929,
        -20.0
      ],
      [
        1930,
        -20.0
      ],
      [
        1931,
        -20.0
      ],
      [
        1932,
        -20.0
      ],
      [
        1933,
        -20.0
      ],
      [
        1934,
        -20.0
      ],
      [
        1935,
        -20.0
      ],
      [
        1936,
        -20.0
      ],
      [
        1937,
        -20.0
      ],
      [
        1938,
        -20.0
      ],
      [
        1939,
        -20.0
      ],
      [
        1940,
        -20.0
      ],
      [
        1941,
        -20.0
      ],
      [
        1942,
        -20.0
      ],
      [
        1943,
        -20.0
      ],
      [
        1944,
        -20.0
      ],
      [
        1945,
        -20.0
      ],
      [
        1946,
        -20.0
      ],
      [
        1947,
        -20.0
      ],
      [
        1948,
        -20.0
      ],
      [
        1949,
        -20.0
      ],
      [
        1950,
        -20.0
      ],
      [
        1951,
        -20.0
      ],
      [
        1952,
        -20.0
      ],
      [
        1953,
        -20.0
      ],
      [
        1954,
        -20.0
      ],
      [
        1955,
        -20.0
      ],
      [
        1956,
        8.0
      ],
      [
        1957,
        8.0
      ],
      [
        1958,
        -7.0
      ],
      [
        1959,
        -7.0
      ],
      [
        1960,
        -7.0
      ],
      [
        1961,
        -7.0
      ],
      [
        1962,
        -7.0
      ],
      [
        1963,
        -7.0
      ],
      [
        1964,
        0.0
      ],
      [
        1965,
        7.0
      ],
      [
        1966,
        7.0
      ],
      [
        1967,
        7.0
      ],
      [
        1968,
        7.0
      ],
      [
        1969,
        2.0
      ],
      [
        1970,
        -2.0
      ],
      [
        1971,
        -7.0
      ],
      [
        1972,
        -7.0
      ],
      [
        1973,
        -7.0
      ],
      [
        1974,
        -7.0
      ],
      [
        1975,
        -7.0
      ],
      [
        1976,
        -7.0
      ],
      [
        1977,
        -7.0
      ],
      [
        1978,
        -7.0
      ],
      [
        1979,
        -7.0
      ],
      [
        1980,
        -7.0
      ],
      [
        1981,
        -7.0
      ],
      [
        1982,
        -7.0
      ],
      [
        1983,
        -7.0
      ],
      [
        1984,
        -7.0
      ],
      [
        1985,
        0.0
      ],
      [
        1986,
        7.0
      ],
      [
        1987,
        7.0
      ],
      [
        1988,
        7.0
      ],
      [
        1989,
        -7.0
      ],
      [
        1990,
        -7.0
      ],
      [
        1991,
        -7.0
      ],
      [
        1992,
        -7.0
      ],
      [
        1993,
        -7.0
      ],
      [
        1994,
        -7.0
      ],
      [
        1995,
        -7.0
      ],
      [
        1996,
        -7.0
      ],
      [
        1997,
        -7.0
      ],
      [
        1998,
        -7.0
      ],
      [
        1999,
        -7.0
      ],
      [
        2000,
        -7.0
      ],
      [
        2001,
        -7.0
      ],
      [
        2002,
        -6.0
      ],
      [
        2003,
        -6.0
      ],
      [
        2004,
        -6.0
      ],
      [
        2005,
        -4.0
      ],
      [
        2006,
        -4.0
      ],
      [
        2007,
        -4.0
      ],
      [
        2008,
        -4.0
      ],
      [
        2009,
        -4.0
      ],
      [
        2010,
        -2.0
      ],
      [
        2011,
        -2.0
      ],
      [
        2012,
        "NA"
      ],
      [
        2013,
        "NA"
      ],
      [
        2014,
        "NA"
      ],
      [
        2015,
        "NA"
      ]
    ],
    "sanitaire_primaire": [
      [
        2000,
        "NA"
      ],
      [
        2001,
        "NA"
      ],
      [
        2002,
        "NA"
      ],
      [
        2003,
        "NA"
      ],
      [
        2004,
        "NA"
      ],
      [
        2005,
        "NA"
      ],
      [
        2006,
        "NA"
      ],
      [
        2007,
        "NA"
      ],
      [
        2008,
        "NA"
      ],
      [
        2009,
        "NA"
      ],
      [
        2010,
        "NA"
      ],
      [
        2011,
        "NA"
      ],
      [
        2012,
        "NA"
      ],
      [
        2013,
        "NA"
      ],
      [
        2014,
        "NA"
      ],
      [
        2015,
        "NA"
      ],
      [
        2016,
        73.48535
      ],
      [
        2017,
        "NA"
      ],
      [
        2018,
        "NA"
      ],
      [
        2019,
        "NA"
      ]
    ],
    "sous_nutri": [
      [
        1960,
        176.7
      ],
      [
        1961,
        173.7
      ],
      [
        1962,
        170.9
      ],
      [
        1963,
        168.3
      ],
      [
        1964,
        165.8
      ],
      [
        1965,
        163.6
      ],
      [
        1966,
        161.6
      ],
      [
        1967,
        159.8
      ],
      [
        1968,
        158.3
      ],
      [
        1969,
        157.0
      ],
      [
        1970,
        155.9
      ],
      [
        1971,
        155.0
      ],
      [
        1972,
        154.1
      ],
      [
        1973,
        153.3
      ],
      [
        1974,
        152.4
      ],
      [
        1975,
        151.4
      ],
      [
        1976,
        150.2
      ],
      [
        1977,
        149.1
      ],
      [
        1978,
        148.0
      ],
      [
        1979,
        147.0
      ],
      [
        1980,
        146.0
      ],
      [
        1981,
        145.1
      ],
      [
        1982,
        144.1
      ],
      [
        1983,
        143.2
      ],
      [
        1984,
        142.1
      ],
      [
        1985,
        140.8
      ],
      [
        1986,
        139.4
      ],
      [
        1987,
        137.7
      ],
      [
        1988,
        135.8
      ],
      [
        1989,
        133.7
      ],
      [
        1990,
        131.6
      ],
      [
        1991,
        129.4
      ],
      [
        1992,
        127.1
      ],
      [
        1993,
        124.7
      ],
      [
        1994,
        122.3
      ],
      [
        1995,
        119.6
      ],
      [
        1996,
        117.0
      ],
      [
        1997,
        114.1
      ],
      [
        1998,
        111.0
      ],
      [
        1999,
        107.7
      ],
      [
        2000,
        104.3
      ],
      [
        2001,
        100.9
      ],
      [
        2002,
        97.5
      ],
      [
        2003,
        94.2
      ],
      [
        2004,
        91.1
      ],
      [
        2005,
        88.2
      ],
      [
        2006,
        85.4
      ],
      [
        2007,
        82.8
      ],
      [
        2008,
        80.4
      ],
      [
        2009,
        78.1
      ],
      [
        2010,
        75.9
      ],
      [
        2011,
        73.9
      ],
      [
        2012,
        72.0
      ],
      [
        2013,
        70.1
      ],
      [
        2014,
        68.2
      ],
      [
        2015,
        66.3
      ],
      [
        2016,
        64.4
      ],
      [
        2017,
        62.4
      ],
      [
        2018,
        60.5
      ],
      [
        2019,
        "NA"
      ]
    ],
    "volume_exp_biens": [
      [
        1980,
        -14.005
      ],
      [
        1981,
        1.875
      ],
      [
        1982,
        1.516
      ],
      [
        1983,
        23.98
      ],
      [
        1984,
        -4.129
      ],
      [
        1985,
        -20.192999999999998
      ],
      [
        1986,
        -32.585
      ],
      [
        1987,
        -8.154
      ],
      [
        1988,
        -46.841
      ],
      [
        1989,
        71.867
      ],
      [
        1990,
        6.5
      ],
      [
        1991,
        -55.7
      ],
      [
        1992,
        37.6
      ],
      [
        1993,
        39.0
      ],
      [
        1994,
        -12.892000000000001
      ],
      [
        1995,
        34.424
      ],
      [
        1996,
        22.586
      ],
      [
        1997,
        16.227
      ],
      [
        1998,
        4.075
      ],
      [
        1999,
        36.066
      ],
      [
        2000,
        149.67
      ],
      [
        2001,
        7.956
      ],
      [
        2002,
        11.145999999999999
      ],
      [
        2003,
        13.07
      ],
      [
        2004,
        14.749
      ],
      [
        2005,
        -7.8
      ],
      [
        2006,
        -0.9490000000000001
      ],
      [
        2007,
        40.373000000000005
      ],
      [
        2008,
        -4.136
      ],
      [
        2009,
        4.118
      ],
      [
        2010,
        6.43
      ],
      [
        2011,
        -33.658
      ],
      [
        2012,
        -64.907
      ],
      [
        2013,
        47.795
      ],
      [
        2014,
        -8.19
      ],
      [
        2015,
        -0.593
      ],
      [
        2016,
        -1.4480000000000002
      ],
      [
        2017,
        10.112
      ],
      [
        2018,
        -17.879
      ],
      [
        2019,
        -20.412
      ],
      [
        2020,
        4.015
      ],
      [
        2021,
        4.027
      ],
      [
        2022,
        4.419
      ],
      [
        2023,
        3.7439999999999998
      ],
      [
        2024,
        3.807
      ]
    ],
    "volume_exp_bs": [
      [
        1980,
        -3.924
      ],
      [
        1981,
        0.747
      ],
      [
        1982,
        0.46799999999999997
      ],
      [
        1983,
        13.647
      ],
      [
        1984,
        -6.117000000000001
      ],
      [
        1985,
        -15.699000000000002
      ],
      [
        1986,
        -26.16
      ],
      [
        1987,
        -12.377
      ],
      [
        1988,
        -47.541000000000004
      ],
      [
        1989,
        75.79899999999999
      ],
      [
        1990,
        6.5
      ],
      [
        1991,
        -55.7
      ],
      [
        1992,
        37.6
      ],
      [
        1993,
        39.0
      ],
      [
        1994,
        -12.892000000000001
      ],
      [
        1995,
        34.424
      ],
      [
        1996,
        22.586
      ],
      [
        1997,
        16.227
      ],
      [
        1998,
        4.075
      ],
      [
        1999,
        36.066
      ],
      [
        2000,
        149.67
      ],
      [
        2001,
        7.956
      ],
      [
        2002,
        11.145999999999999
      ],
      [
        2003,
        13.07
      ],
      [
        2004,
        14.749
      ],
      [
        2005,
        -7.8
      ],
      [
        2006,
        -0.9490000000000001
      ],
      [
        2007,
        40.373000000000005
      ],
      [
        2008,
        -4.136
      ],
      [
        2009,
        4.118
      ],
      [
        2010,
        6.43
      ],
      [
        2011,
        -33.658
      ],
      [
        2012,
        -64.907
      ],
      [
        2013,
        47.795
      ],
      [
        2014,
        -8.19
      ],
      [
        2015,
        -0.593
      ],
      [
        2016,
        -1.4480000000000002
      ],
      [
        2017,
        10.112
      ],
      [
        2018,
        -17.879
      ],
      [
        2019,
        -20.412
      ],
      [
        2020,
        4.015
      ],
      [
        2021,
        4.027
      ],
      [
        2022,
        4.419
      ],
      [
        2023,
        3.7439999999999998
      ],
      [
        2024,
        3.807
      ]
    ],
    "volume_import_biens": [
      [
        1980,
        8.392999999999999
      ],
      [
        1981,
        2.403
      ],
      [
        1982,
        -0.171
      ],
      [
        1983,
        -7.39
      ],
      [
        1984,
        -12.997
      ],
      [
        1985,
        -8.134
      ],
      [
        1986,
        25.296
      ],
      [
        1987,
        4.4319999999999995
      ],
      [
        1988,
        2.931
      ],
      [
        1989,
        -16.402
      ],
      [
        1990,
        -17.1
      ],
      [
        1991,
        -27.8
      ],
      [
        1992,
        -8.1
      ],
      [
        1993,
        -0.9
      ],
      [
        1994,
        -16.276
      ],
      [
        1995,
        11.77
      ],
      [
        1996,
        24.662
      ],
      [
        1997,
        13.325
      ],
      [
        1998,
        29.87
      ],
      [
        1999,
        -22.744
      ],
      [
        2000,
        20.05
      ],
      [
        2001,
        4.534
      ],
      [
        2002,
        54.24100000000001
      ],
      [
        2003,
        -3.295
      ],
      [
        2004,
        30.123
      ],
      [
        2005,
        62.50899999999999
      ],
      [
        2006,
        14.040999999999999
      ],
      [
        2007,
        -2.475
      ],
      [
        2008,
        -6.017
      ],
      [
        2009,
        11.505999999999998
      ],
      [
        2010,
        5.401
      ],
      [
        2011,
        -15.918
      ],
      [
        2012,
        4.563
      ],
      [
        2013,
        6.726
      ],
      [
        2014,
        -5.4270000000000005
      ],
      [
        2015,
        25.340999999999998
      ],
      [
        2016,
        -9.305
      ],
      [
        2017,
        7.353
      ],
      [
        2018,
        -19.3
      ],
      [
        2019,
        -3.219
      ],
      [
        2020,
        0.228
      ],
      [
        2021,
        -1.6980000000000002
      ],
      [
        2022,
        -0.998
      ],
      [
        2023,
        -0.5870000000000001
      ],
      [
        2024,
        -0.54
      ]
    ],
    "volume_import_bs": [
      [
        1980,
        7.3
      ],
      [
        1981,
        5.5329999999999995
      ],
      [
        1982,
        1.885
      ],
      [
        1983,
        -4.967
      ],
      [
        1984,
        -10.585
      ],
      [
        1985,
        -5.624
      ],
      [
        1986,
        29.5
      ],
      [
        1987,
        0.457
      ],
      [
        1988,
        0.8420000000000001
      ],
      [
        1989,
        -6.52
      ],
      [
        1990,
        -17.1
      ],
      [
        1991,
        -27.8
      ],
      [
        1992,
        -8.1
      ],
      [
        1993,
        -0.9
      ],
      [
        1994,
        -16.276
      ],
      [
        1995,
        11.77
      ],
      [
        1996,
        24.662
      ],
      [
        1997,
        13.325
      ],
      [
        1998,
        29.87
      ],
      [
        1999,
        -22.744
      ],
      [
        2000,
        20.05
      ],
      [
        2001,
        4.534
      ],
      [
        2002,
        54.24100000000001
      ],
      [
        2003,
        -3.295
      ],
      [
        2004,
        30.123
      ],
      [
        2005,
        62.50899999999999
      ],
      [
        2006,
        14.040999999999999
      ],
      [
        2007,
        -2.475
      ],
      [
        2008,
        -6.017
      ],
      [
        2009,
        11.505999999999998
      ],
      [
        2010,
        5.401
      ],
      [
        2011,
        -15.918
      ],
      [
        2012,
        4.563
      ],
      [
        2013,
        6.726
      ],
      [
        2014,
        -5.4270000000000005
      ],
      [
        2015,
        25.340999999999998
      ],
      [
        2016,
        -9.305
      ],
      [
        2017,
        7.353
      ],
      [
        2018,
        -19.3
      ],
      [
        2019,
        -3.219
      ],
      [
        2020,
        0.228
      ],
      [
        2021,
        -1.6980000000000002
      ],
      [
        2022,
        -0.998
      ],
      [
        2023,
        0.504
      ],
      [
        2024,
        -0.251
      ]
    ],
    "vuln_clim_ferdi": [
      [
        2018,
        65.862646586164
      ]
    ],
    "vuln_clim_ndgain": [
      [
        1995,
        0.629581198545803
      ],
      [
        1996,
        0.630332748998872
      ],
      [
        1997,
        0.630252733914176
      ],
      [
        1998,
        0.629174645602235
      ],
      [
        1999,
        0.628869015927345
      ],
      [
        2000,
        0.626784343876655
      ],
      [
        2001,
        0.625551042969083
      ],
      [
        2002,
        0.623838075442625
      ],
      [
        2003,
        0.621131093595754
      ],
      [
        2004,
        0.6191760512033221
      ],
      [
        2005,
        0.618038370043714
      ],
      [
        2006,
        0.6199704039852829
      ],
      [
        2007,
        0.613584316353604
      ],
      [
        2008,
        0.61465103918785
      ],
      [
        2009,
        0.619692067534107
      ],
      [
        2010,
        0.618208066094994
      ],
      [
        2011,
        0.618268625928059
      ],
      [
        2012,
        0.620762405575046
      ],
      [
        2013,
        0.6244198688301911
      ],
      [
        2014,
        0.620589786796557
      ],
      [
        2015,
        0.6198183260837651
      ],
      [
        2016,
        0.617802026448602
      ]
    ]
  }
}