{
  "country": "NER",
  "country_name": "Niger",
  "indicators": {
    "abo_mobile": [
      [
        1960,
        0.0
      ],
      [
        1961,
        "NA"
      ],
      [
        1962,
        "NA"
      ],
      [
        1963,
        "NA"
      ],
      [
        1964,
        "NA"
      ],
      [
        1965,
        0.0
      ],
      [
        1966,
        "NA"
      ],
      [
        1967,
        "NA"
      ],
      [
        1968,
        "NA"
      ],
      [
        1969,
        "NA"
      ],
      [
        1970,
        0.0
      ],
      [
        1971,
        "NA"
      ],
      [
        1972,
        "NA"
      ],
      [
        1973,
        "NA"
      ],
      [
        1974,
        "NA"
      ],
      [
        1975,
        0.0
      ],
      [
        1976,
        0.0
      ],
      [
        1977,
        0.0
      ],
      [
        1978,
        0.0
      ],
      [
        1979,
        0.0
      ],
      [
        1980,
        0.0
      ],
      [
        1981,
        0.0
      ],
      [
        1982,
        0.0
      ],
      [
        1983,
        0.0
      ],
      [
        1984,
        0.0
      ],
      [
        1985,
        0.0
      ],
      [
        1986,
        0.0
      ],
      [
        1987,
        0.0
      ],
      [
        1988,
        0.0
      ],
      [
        1989,
        0.0
      ],
      [
        1990,
        0.0
      ],
      [
        1991,
        0.0
      ],
      [
        1992,
        0.0
      ],
      [
        1993,
        0.0
      ],
      [
        1994,
        0.0
      ],
      [
        1995,
        0.0
      ],
      [
        1996,
        0.0
      ],
      [
        1997,
        0.000098
      ],
      [
        1998,
        0.001349
      ],
      [
        1999,
        0.0021920000000000004
      ],
      [
        2000,
        0.0020559999999999997
      ],
      [
        2001,
        0.0021260000000000003
      ],
      [
        2002,
        0.057540999999999995
      ],
      [
        2003,
        0.082365
      ],
      [
        2004,
        0.172421
      ],
      [
        2005,
        0.323853
      ],
      [
        2006,
        0.483
      ],
      [
        2007,
        0.9
      ],
      [
        2008,
        1.8976279999999999
      ],
      [
        2009,
        2.5989999999999998
      ],
      [
        2010,
        3.668625
      ],
      [
        2011,
        4.742879
      ],
      [
        2012,
        5.3955400000000004
      ],
      [
        2013,
        7.0063
      ],
      [
        2014,
        8.2364
      ],
      [
        2015,
        8.959
      ],
      [
        2016,
        7.471802
      ],
      [
        2017,
        8.778884
      ],
      [
        2018,
        "NA"
      ],
      [
        2019,
        "NA"
      ]
    ],
    "acces_elec": [
      [
        1960,
        "NA"
      ],
      [
        1961,
        "NA"
      ],
      [
        1962,
        "NA"
      ],
      [
        1963,
        "NA"
      ],
      [
        1964,
        "NA"
      ],
      [
        1965,
        "NA"
      ],
      [
        1966,
        "NA"
      ],
      [
        1967,
        "NA"
      ],
      [
        1968,
        "NA"
      ],
      [
        1969,
        "NA"
      ],
      [
        1970,
        "NA"
      ],
      [
        1971,
        "NA"
      ],
      [
        1972,
        "NA"
      ],
      [
        1973,
        "NA"
      ],
      [
        1974,
        "NA"
      ],
      [
        1975,
        "NA"
      ],
      [
        1976,
        "NA"
      ],
      [
        1977,
        "NA"
      ],
      [
        1978,
        "NA"
      ],
      [
        1979,
        "NA"
      ],
      [
        1980,
        "NA"
      ],
      [
        1981,
        "NA"
      ],
      [
        1982,
        "NA"
      ],
      [
        1983,
        "NA"
      ],
      [
        1984,
        "NA"
      ],
      [
        1985,
        "NA"
      ],
      [
        1986,
        "NA"
      ],
      [
        1987,
        "NA"
      ],
      [
        1988,
        "NA"
      ],
      [
        1989,
        "NA"
      ],
      [
        1990,
        "NA"
      ],
      [
        1991,
        "NA"
      ],
      [
        1992,
        4.4
      ],
      [
        1993,
        4.0444502831
      ],
      [
        1994,
        4.5891413689
      ],
      [
        1995,
        6.2
      ],
      [
        1996,
        7.0
      ],
      [
        1997,
        6.2363886833
      ],
      [
        1998,
        6.7
      ],
      [
        1999,
        7.3447608948
      ],
      [
        2000,
        6.4814814814999995
      ],
      [
        2001,
        8.4317483902
      ],
      [
        2002,
        8.956048965499999
      ],
      [
        2003,
        9.461595535299999
      ],
      [
        2004,
        9.9439191818
      ],
      [
        2005,
        7.1
      ],
      [
        2006,
        9.3
      ],
      [
        2007,
        11.279092788699998
      ],
      [
        2008,
        11.7228240967
      ],
      [
        2009,
        12.1851997375
      ],
      [
        2010,
        12.9348926544
      ],
      [
        2011,
        14.3
      ],
      [
        2012,
        14.4
      ],
      [
        2013,
        15.1423692703
      ],
      [
        2014,
        15.709527015699999
      ],
      [
        2015,
        16.6
      ],
      [
        2016,
        17.4946937561
      ],
      [
        2017,
        18.180929184
      ],
      [
        2018,
        17.6
      ],
      [
        2019,
        "NA"
      ]
    ],
    "acces_elec_primaire": [
      [
        2000,
        "NA"
      ],
      [
        2001,
        "NA"
      ],
      [
        2002,
        "NA"
      ],
      [
        2003,
        "NA"
      ],
      [
        2004,
        "NA"
      ],
      [
        2005,
        "NA"
      ],
      [
        2006,
        "NA"
      ],
      [
        2007,
        "NA"
      ],
      [
        2008,
        "NA"
      ],
      [
        2009,
        "NA"
      ],
      [
        2010,
        "NA"
      ],
      [
        2011,
        "NA"
      ],
      [
        2012,
        "NA"
      ],
      [
        2013,
        4.40503
      ],
      [
        2014,
        "NA"
      ],
      [
        2015,
        "NA"
      ],
      [
        2016,
        3.07238
      ],
      [
        2017,
        5.17659
      ],
      [
        2018,
        5.39538
      ],
      [
        2019,
        "NA"
      ]
    ],
    "alpha_adulte": [
      [
        1960,
        "NA"
      ],
      [
        1961,
        "NA"
      ],
      [
        1962,
        "NA"
      ],
      [
        1963,
        "NA"
      ],
      [
        1964,
        "NA"
      ],
      [
        1965,
        "NA"
      ],
      [
        1966,
        "NA"
      ],
      [
        1967,
        "NA"
      ],
      [
        1968,
        "NA"
      ],
      [
        1969,
        "NA"
      ],
      [
        1970,
        "NA"
      ],
      [
        1971,
        "NA"
      ],
      [
        1972,
        "NA"
      ],
      [
        1973,
        "NA"
      ],
      [
        1974,
        "NA"
      ],
      [
        1975,
        "NA"
      ],
      [
        1976,
        "NA"
      ],
      [
        1977,
        "NA"
      ],
      [
        1978,
        "NA"
      ],
      [
        1979,
        "NA"
      ],
      [
        1980,
        "NA"
      ],
      [
        1981,
        "NA"
      ],
      [
        1982,
        "NA"
      ],
      [
        1983,
        "NA"
      ],
      [
        1984,
        "NA"
      ],
      [
        1985,
        "NA"
      ],
      [
        1986,
        "NA"
      ],
      [
        1987,
        "NA"
      ],
      [
        1988,
        "NA"
      ],
      [
        1989,
        "NA"
      ],
      [
        1990,
        "NA"
      ],
      [
        1991,
        "NA"
      ],
      [
        1992,
        "NA"
      ],
      [
        1993,
        "NA"
      ],
      [
        1994,
        "NA"
      ],
      [
        1995,
        "NA"
      ],
      [
        1996,
        "NA"
      ],
      [
        1997,
        "NA"
      ],
      [
        1998,
        "NA"
      ],
      [
        1999,
        "NA"
      ],
      [
        2000,
        "NA"
      ],
      [
        2001,
        14.37604
      ],
      [
        2002,
        "NA"
      ],
      [
        2003,
        "NA"
      ],
      [
        2004,
        "NA"
      ],
      [
        2005,
        28.672420000000002
      ],
      [
        2006,
        "NA"
      ],
      [
        2007,
        "NA"
      ],
      [
        2008,
        "NA"
      ],
      [
        2009,
        "NA"
      ],
      [
        2010,
        "NA"
      ],
      [
        2011,
        "NA"
      ],
      [
        2012,
        30.56039
      ],
      [
        2013,
        "NA"
      ],
      [
        2014,
        "NA"
      ],
      [
        2015,
        "NA"
      ],
      [
        2016,
        "NA"
      ],
      [
        2017,
        "NA"
      ],
      [
        2018,
        "NA"
      ],
      [
        2019,
        "NA"
      ]
    ],
    "alpha_jeune": [
      [
        1960,
        "NA"
      ],
      [
        1961,
        "NA"
      ],
      [
        1962,
        "NA"
      ],
      [
        1963,
        "NA"
      ],
      [
        1964,
        "NA"
      ],
      [
        1965,
        "NA"
      ],
      [
        1966,
        "NA"
      ],
      [
        1967,
        "NA"
      ],
      [
        1968,
        "NA"
      ],
      [
        1969,
        "NA"
      ],
      [
        1970,
        "NA"
      ],
      [
        1971,
        "NA"
      ],
      [
        1972,
        "NA"
      ],
      [
        1973,
        "NA"
      ],
      [
        1974,
        "NA"
      ],
      [
        1975,
        "NA"
      ],
      [
        1976,
        "NA"
      ],
      [
        1977,
        "NA"
      ],
      [
        1978,
        "NA"
      ],
      [
        1979,
        "NA"
      ],
      [
        1980,
        "NA"
      ],
      [
        1981,
        "NA"
      ],
      [
        1982,
        "NA"
      ],
      [
        1983,
        "NA"
      ],
      [
        1984,
        "NA"
      ],
      [
        1985,
        "NA"
      ],
      [
        1986,
        "NA"
      ],
      [
        1987,
        "NA"
      ],
      [
        1988,
        "NA"
      ],
      [
        1989,
        "NA"
      ],
      [
        1990,
        "NA"
      ],
      [
        1991,
        "NA"
      ],
      [
        1992,
        "NA"
      ],
      [
        1993,
        "NA"
      ],
      [
        1994,
        "NA"
      ],
      [
        1995,
        "NA"
      ],
      [
        1996,
        "NA"
      ],
      [
        1997,
        "NA"
      ],
      [
        1998,
        "NA"
      ],
      [
        1999,
        "NA"
      ],
      [
        2000,
        "NA"
      ],
      [
        2001,
        19.79119
      ],
      [
        2002,
        "NA"
      ],
      [
        2003,
        "NA"
      ],
      [
        2004,
        "NA"
      ],
      [
        2005,
        36.54678
      ],
      [
        2006,
        "NA"
      ],
      [
        2007,
        "NA"
      ],
      [
        2008,
        "NA"
      ],
      [
        2009,
        "NA"
      ],
      [
        2010,
        "NA"
      ],
      [
        2011,
        "NA"
      ],
      [
        2012,
        39.787729999999996
      ],
      [
        2013,
        "NA"
      ],
      [
        2014,
        "NA"
      ],
      [
        2015,
        "NA"
      ],
      [
        2016,
        "NA"
      ],
      [
        2017,
        "NA"
      ],
      [
        2018,
        "NA"
      ],
      [
        2019,
        "NA"
      ]
    ],
    "bidonvilles": [
      [
        1960,
        "NA"
      ],
      [
        1961,
        "NA"
      ],
      [
        1962,
        "NA"
      ],
      [
        1963,
        "NA"
      ],
      [
        1964,
        "NA"
      ],
      [
        1965,
        "NA"
      ],
      [
        1966,
        "NA"
      ],
      [
        1967,
        "NA"
      ],
      [
        1968,
        "NA"
      ],
      [
        1969,
        "NA"
      ],
      [
        1970,
        "NA"
      ],
      [
        1971,
        "NA"
      ],
      [
        1972,
        "NA"
      ],
      [
        1973,
        "NA"
      ],
      [
        1974,
        "NA"
      ],
      [
        1975,
        "NA"
      ],
      [
        1976,
        "NA"
      ],
      [
        1977,
        "NA"
      ],
      [
        1978,
        "NA"
      ],
      [
        1979,
        "NA"
      ],
      [
        1980,
        "NA"
      ],
      [
        1981,
        "NA"
      ],
      [
        1982,
        "NA"
      ],
      [
        1983,
        "NA"
      ],
      [
        1984,
        "NA"
      ],
      [
        1985,
        "NA"
      ],
      [
        1986,
        "NA"
      ],
      [
        1987,
        "NA"
      ],
      [
        1988,
        "NA"
      ],
      [
        1989,
        "NA"
      ],
      [
        1990,
        83.6
      ],
      [
        1991,
        "NA"
      ],
      [
        1992,
        "NA"
      ],
      [
        1993,
        "NA"
      ],
      [
        1994,
        "NA"
      ],
      [
        1995,
        83.1
      ],
      [
        1996,
        "NA"
      ],
      [
        1997,
        "NA"
      ],
      [
        1998,
        "NA"
      ],
      [
        1999,
        "NA"
      ],
      [
        2000,
        82.6
      ],
      [
        2001,
        "NA"
      ],
      [
        2002,
        "NA"
      ],
      [
        2003,
        "NA"
      ],
      [
        2004,
        "NA"
      ],
      [
        2005,
        82.1
      ],
      [
        2006,
        "NA"
      ],
      [
        2007,
        81.9
      ],
      [
        2008,
        "NA"
      ],
      [
        2009,
        81.7
      ],
      [
        2010,
        "NA"
      ],
      [
        2011,
        "NA"
      ],
      [
        2012,
        "NA"
      ],
      [
        2013,
        "NA"
      ],
      [
        2014,
        70.1
      ],
      [
        2015,
        "NA"
      ],
      [
        2016,
        "NA"
      ],
      [
        2017,
        "NA"
      ],
      [
        2018,
        "NA"
      ],
      [
        2019,
        "NA"
      ]
    ],
    "compte_adulte": [
      [
        1960,
        "NA"
      ],
      [
        1961,
        "NA"
      ],
      [
        1962,
        "NA"
      ],
      [
        1963,
        "NA"
      ],
      [
        1964,
        "NA"
      ],
      [
        1965,
        "NA"
      ],
      [
        1966,
        "NA"
      ],
      [
        1967,
        "NA"
      ],
      [
        1968,
        "NA"
      ],
      [
        1969,
        "NA"
      ],
      [
        1970,
        "NA"
      ],
      [
        1971,
        "NA"
      ],
      [
        1972,
        "NA"
      ],
      [
        1973,
        "NA"
      ],
      [
        1974,
        "NA"
      ],
      [
        1975,
        "NA"
      ],
      [
        1976,
        "NA"
      ],
      [
        1977,
        "NA"
      ],
      [
        1978,
        "NA"
      ],
      [
        1979,
        "NA"
      ],
      [
        1980,
        "NA"
      ],
      [
        1981,
        "NA"
      ],
      [
        1982,
        "NA"
      ],
      [
        1983,
        "NA"
      ],
      [
        1984,
        "NA"
      ],
      [
        1985,
        "NA"
      ],
      [
        1986,
        "NA"
      ],
      [
        1987,
        "NA"
      ],
      [
        1988,
        "NA"
      ],
      [
        1989,
        "NA"
      ],
      [
        1990,
        "NA"
      ],
      [
        1991,
        "NA"
      ],
      [
        1992,
        "NA"
      ],
      [
        1993,
        "NA"
      ],
      [
        1994,
        "NA"
      ],
      [
        1995,
        "NA"
      ],
      [
        1996,
        "NA"
      ],
      [
        1997,
        "NA"
      ],
      [
        1998,
        "NA"
      ],
      [
        1999,
        "NA"
      ],
      [
        2000,
        "NA"
      ],
      [
        2001,
        "NA"
      ],
      [
        2002,
        "NA"
      ],
      [
        2003,
        "NA"
      ],
      [
        2004,
        "NA"
      ],
      [
        2005,
        "NA"
      ],
      [
        2006,
        "NA"
      ],
      [
        2007,
        "NA"
      ],
      [
        2008,
        "NA"
      ],
      [
        2009,
        "NA"
      ],
      [
        2010,
        "NA"
      ],
      [
        2011,
        2.0181255341
      ],
      [
        2012,
        "NA"
      ],
      [
        2013,
        "NA"
      ],
      [
        2014,
        6.991848945599999
      ],
      [
        2015,
        "NA"
      ],
      [
        2016,
        "NA"
      ],
      [
        2017,
        18.5995979309
      ],
      [
        2018,
        "NA"
      ],
      [
        2019,
        "NA"
      ]
    ],
    "compte_jeune": [
      [
        1960,
        "NA"
      ],
      [
        1961,
        "NA"
      ],
      [
        1962,
        "NA"
      ],
      [
        1963,
        "NA"
      ],
      [
        1964,
        "NA"
      ],
      [
        1965,
        "NA"
      ],
      [
        1966,
        "NA"
      ],
      [
        1967,
        "NA"
      ],
      [
        1968,
        "NA"
      ],
      [
        1969,
        "NA"
      ],
      [
        1970,
        "NA"
      ],
      [
        1971,
        "NA"
      ],
      [
        1972,
        "NA"
      ],
      [
        1973,
        "NA"
      ],
      [
        1974,
        "NA"
      ],
      [
        1975,
        "NA"
      ],
      [
        1976,
        "NA"
      ],
      [
        1977,
        "NA"
      ],
      [
        1978,
        "NA"
      ],
      [
        1979,
        "NA"
      ],
      [
        1980,
        "NA"
      ],
      [
        1981,
        "NA"
      ],
      [
        1982,
        "NA"
      ],
      [
        1983,
        "NA"
      ],
      [
        1984,
        "NA"
      ],
      [
        1985,
        "NA"
      ],
      [
        1986,
        "NA"
      ],
      [
        1987,
        "NA"
      ],
      [
        1988,
        "NA"
      ],
      [
        1989,
        "NA"
      ],
      [
        1990,
        "NA"
      ],
      [
        1991,
        "NA"
      ],
      [
        1992,
        "NA"
      ],
      [
        1993,
        "NA"
      ],
      [
        1994,
        "NA"
      ],
      [
        1995,
        "NA"
      ],
      [
        1996,
        "NA"
      ],
      [
        1997,
        "NA"
      ],
      [
        1998,
        "NA"
      ],
      [
        1999,
        "NA"
      ],
      [
        2000,
        "NA"
      ],
      [
        2001,
        "NA"
      ],
      [
        2002,
        "NA"
      ],
      [
        2003,
        "NA"
      ],
      [
        2004,
        "NA"
      ],
      [
        2005,
        "NA"
      ],
      [
        2006,
        "NA"
      ],
      [
        2007,
        "NA"
      ],
      [
        2008,
        "NA"
      ],
      [
        2009,
        "NA"
      ],
      [
        2010,
        "NA"
      ],
      [
        2011,
        0.6618494390999999
      ],
      [
        2012,
        "NA"
      ],
      [
        2013,
        "NA"
      ],
      [
        2014,
        6.201758384700001
      ],
      [
        2015,
        "NA"
      ],
      [
        2016,
        "NA"
      ],
      [
        2017,
        10.3436746597
      ],
      [
        2018,
        "NA"
      ],
      [
        2019,
        "NA"
      ]
    ],
    "croissance_pib": [
      [
        1960,
        "NA"
      ],
      [
        1961,
        4.5463930365
      ],
      [
        1962,
        10.2787134943
      ],
      [
        1963,
        9.428229321
      ],
      [
        1964,
        0.13103988960000001
      ],
      [
        1965,
        6.9197618187
      ],
      [
        1966,
        -0.3824971984
      ],
      [
        1967,
        0.12286867039999999
      ],
      [
        1968,
        0.38349466229999996
      ],
      [
        1969,
        -5.485945812100001
      ],
      [
        1970,
        3.0557789222000005
      ],
      [
        1971,
        5.6793206436000006
      ],
      [
        1972,
        -5.1662723062
      ],
      [
        1973,
        -17.047583571
      ],
      [
        1974,
        8.775238050499999
      ],
      [
        1975,
        -2.7931934356
      ],
      [
        1976,
        0.6782034023000001
      ],
      [
        1977,
        7.7645811191
      ],
      [
        1978,
        13.4726123314
      ],
      [
        1979,
        7.146996066
      ],
      [
        1980,
        -2.2324446911
      ],
      [
        1981,
        0.6089152391
      ],
      [
        1982,
        1.6231021999000002
      ],
      [
        1983,
        -4.7509432293
      ],
      [
        1984,
        -16.8253549955
      ],
      [
        1985,
        7.722543884299999
      ],
      [
        1986,
        6.3600268046
      ],
      [
        1987,
        0.0745562452
      ],
      [
        1988,
        6.899121715800001
      ],
      [
        1989,
        0.9339291383
      ],
      [
        1990,
        -1.284355381
      ],
      [
        1991,
        2.5042032744
      ],
      [
        1992,
        -6.5164446014
      ],
      [
        1993,
        1.4494378757
      ],
      [
        1994,
        4.0045617042
      ],
      [
        1995,
        2.6057558544
      ],
      [
        1996,
        3.4190930985000003
      ],
      [
        1997,
        2.7539656235
      ],
      [
        1998,
        10.4222625216
      ],
      [
        1999,
        -0.5687583319
      ],
      [
        2000,
        -1.40950935
      ],
      [
        2001,
        7.104340612100001
      ],
      [
        2002,
        2.9991220356
      ],
      [
        2003,
        5.2999999983
      ],
      [
        2004,
        0.1000000008
      ],
      [
        2005,
        4.4999999994
      ],
      [
        2006,
        5.8000000015
      ],
      [
        2007,
        3.1465703956
      ],
      [
        2008,
        9.5876957279
      ],
      [
        2009,
        -0.7126774298
      ],
      [
        2010,
        8.3642195302
      ],
      [
        2011,
        2.283008487
      ],
      [
        2012,
        11.849819181700001
      ],
      [
        2013,
        5.2684148973000005
      ],
      [
        2014,
        7.5290430685
      ],
      [
        2015,
        4.3370723687
      ],
      [
        2016,
        4.9259309327
      ],
      [
        2017,
        4.8934366925
      ],
      [
        2018,
        6.4830667043
      ],
      [
        2019,
        "NA"
      ]
    ],
    "eau_douce_agri": [
      [
        1960,
        "NA"
      ],
      [
        1961,
        "NA"
      ],
      [
        1962,
        "NA"
      ],
      [
        1963,
        "NA"
      ],
      [
        1964,
        "NA"
      ],
      [
        1965,
        "NA"
      ],
      [
        1966,
        "NA"
      ],
      [
        1967,
        "NA"
      ],
      [
        1968,
        "NA"
      ],
      [
        1969,
        "NA"
      ],
      [
        1970,
        "NA"
      ],
      [
        1971,
        "NA"
      ],
      [
        1972,
        "NA"
      ],
      [
        1973,
        "NA"
      ],
      [
        1974,
        "NA"
      ],
      [
        1975,
        "NA"
      ],
      [
        1976,
        "NA"
      ],
      [
        1977,
        "NA"
      ],
      [
        1978,
        "NA"
      ],
      [
        1979,
        "NA"
      ],
      [
        1980,
        "NA"
      ],
      [
        1981,
        "NA"
      ],
      [
        1982,
        "NA"
      ],
      [
        1983,
        "NA"
      ],
      [
        1984,
        "NA"
      ],
      [
        1985,
        "NA"
      ],
      [
        1986,
        "NA"
      ],
      [
        1987,
        "NA"
      ],
      [
        1988,
        82.0
      ],
      [
        1989,
        "NA"
      ],
      [
        1990,
        "NA"
      ],
      [
        1991,
        "NA"
      ],
      [
        1992,
        "NA"
      ],
      [
        1993,
        "NA"
      ],
      [
        1994,
        "NA"
      ],
      [
        1995,
        "NA"
      ],
      [
        1996,
        "NA"
      ],
      [
        1997,
        "NA"
      ],
      [
        1998,
        "NA"
      ],
      [
        1999,
        "NA"
      ],
      [
        2000,
        "NA"
      ],
      [
        2001,
        "NA"
      ],
      [
        2002,
        "NA"
      ],
      [
        2003,
        "NA"
      ],
      [
        2004,
        "NA"
      ],
      [
        2005,
        66.74
      ],
      [
        2006,
        "NA"
      ],
      [
        2007,
        "NA"
      ],
      [
        2008,
        "NA"
      ],
      [
        2009,
        "NA"
      ],
      [
        2010,
        "NA"
      ],
      [
        2011,
        "NA"
      ],
      [
        2012,
        "NA"
      ],
      [
        2013,
        "NA"
      ],
      [
        2014,
        "NA"
      ],
      [
        2015,
        "NA"
      ],
      [
        2016,
        "NA"
      ],
      [
        2017,
        "NA"
      ],
      [
        2018,
        "NA"
      ],
      [
        2019,
        "NA"
      ]
    ],
    "eau_potable_primaire": [
      [
        2000,
        "NA"
      ],
      [
        2001,
        "NA"
      ],
      [
        2002,
        "NA"
      ],
      [
        2003,
        "NA"
      ],
      [
        2004,
        "NA"
      ],
      [
        2005,
        "NA"
      ],
      [
        2006,
        "NA"
      ],
      [
        2007,
        "NA"
      ],
      [
        2008,
        "NA"
      ],
      [
        2009,
        "NA"
      ],
      [
        2010,
        "NA"
      ],
      [
        2011,
        "NA"
      ],
      [
        2012,
        "NA"
      ],
      [
        2013,
        "NA"
      ],
      [
        2014,
        "NA"
      ],
      [
        2015,
        "NA"
      ],
      [
        2016,
        "NA"
      ],
      [
        2017,
        16.65634
      ],
      [
        2018,
        15.60164
      ],
      [
        2019,
        "NA"
      ]
    ],
    "emploi_agri": [
      [
        1960,
        "NA"
      ],
      [
        1961,
        "NA"
      ],
      [
        1962,
        "NA"
      ],
      [
        1963,
        "NA"
      ],
      [
        1964,
        "NA"
      ],
      [
        1965,
        "NA"
      ],
      [
        1966,
        "NA"
      ],
      [
        1967,
        "NA"
      ],
      [
        1968,
        "NA"
      ],
      [
        1969,
        "NA"
      ],
      [
        1970,
        "NA"
      ],
      [
        1971,
        "NA"
      ],
      [
        1972,
        "NA"
      ],
      [
        1973,
        "NA"
      ],
      [
        1974,
        "NA"
      ],
      [
        1975,
        "NA"
      ],
      [
        1976,
        "NA"
      ],
      [
        1977,
        "NA"
      ],
      [
        1978,
        "NA"
      ],
      [
        1979,
        "NA"
      ],
      [
        1980,
        "NA"
      ],
      [
        1981,
        "NA"
      ],
      [
        1982,
        "NA"
      ],
      [
        1983,
        "NA"
      ],
      [
        1984,
        "NA"
      ],
      [
        1985,
        "NA"
      ],
      [
        1986,
        "NA"
      ],
      [
        1987,
        "NA"
      ],
      [
        1988,
        "NA"
      ],
      [
        1989,
        "NA"
      ],
      [
        1990,
        "NA"
      ],
      [
        1991,
        77.3560028076
      ],
      [
        1992,
        77.5899963379
      ],
      [
        1993,
        77.6439971924
      ],
      [
        1994,
        77.6409988403
      ],
      [
        1995,
        77.6689987183
      ],
      [
        1996,
        77.6849975586
      ],
      [
        1997,
        77.7119979858
      ],
      [
        1998,
        77.4950027466
      ],
      [
        1999,
        77.6760025024
      ],
      [
        2000,
        77.9100036621
      ],
      [
        2001,
        77.7519989014
      ],
      [
        2002,
        77.7799987793
      ],
      [
        2003,
        77.6630020142
      ],
      [
        2004,
        77.7880020142
      ],
      [
        2005,
        77.736000061
      ],
      [
        2006,
        77.5820007324
      ],
      [
        2007,
        77.5559997559
      ],
      [
        2008,
        77.2350006104
      ],
      [
        2009,
        77.3679962158
      ],
      [
        2010,
        77.0869979858
      ],
      [
        2011,
        77.06099700930001
      ],
      [
        2012,
        76.56999969479999
      ],
      [
        2013,
        76.3649978638
      ],
      [
        2014,
        76.0510025024
      ],
      [
        2015,
        75.8980026245
      ],
      [
        2016,
        75.7300033569
      ],
      [
        2017,
        75.53099823
      ],
      [
        2018,
        75.31199646
      ],
      [
        2019,
        75.06300354
      ]
    ],
    "enseignant_primaire": [
      [
        1960,
        "NA"
      ],
      [
        1961,
        "NA"
      ],
      [
        1962,
        "NA"
      ],
      [
        1963,
        "NA"
      ],
      [
        1964,
        "NA"
      ],
      [
        1965,
        "NA"
      ],
      [
        1966,
        "NA"
      ],
      [
        1967,
        "NA"
      ],
      [
        1968,
        "NA"
      ],
      [
        1969,
        "NA"
      ],
      [
        1970,
        "NA"
      ],
      [
        1971,
        "NA"
      ],
      [
        1972,
        "NA"
      ],
      [
        1973,
        "NA"
      ],
      [
        1974,
        "NA"
      ],
      [
        1975,
        "NA"
      ],
      [
        1976,
        "NA"
      ],
      [
        1977,
        "NA"
      ],
      [
        1978,
        "NA"
      ],
      [
        1979,
        "NA"
      ],
      [
        1980,
        "NA"
      ],
      [
        1981,
        "NA"
      ],
      [
        1982,
        "NA"
      ],
      [
        1983,
        "NA"
      ],
      [
        1984,
        "NA"
      ],
      [
        1985,
        "NA"
      ],
      [
        1986,
        "NA"
      ],
      [
        1987,
        "NA"
      ],
      [
        1988,
        "NA"
      ],
      [
        1989,
        "NA"
      ],
      [
        1990,
        "NA"
      ],
      [
        1991,
        "NA"
      ],
      [
        1992,
        "NA"
      ],
      [
        1993,
        "NA"
      ],
      [
        1994,
        "NA"
      ],
      [
        1995,
        "NA"
      ],
      [
        1996,
        "NA"
      ],
      [
        1997,
        "NA"
      ],
      [
        1998,
        "NA"
      ],
      [
        1999,
        97.75211
      ],
      [
        2000,
        97.3542
      ],
      [
        2001,
        79.88895
      ],
      [
        2002,
        69.62746
      ],
      [
        2003,
        72.45658
      ],
      [
        2004,
        75.75014
      ],
      [
        2005,
        85.00123
      ],
      [
        2006,
        91.90782
      ],
      [
        2007,
        98.23648
      ],
      [
        2008,
        98.43773
      ],
      [
        2009,
        98.01354
      ],
      [
        2010,
        "NA"
      ],
      [
        2011,
        "NA"
      ],
      [
        2012,
        "NA"
      ],
      [
        2013,
        45.84346
      ],
      [
        2014,
        50.083220000000004
      ],
      [
        2015,
        55.5236
      ],
      [
        2016,
        55.6421
      ],
      [
        2017,
        "NA"
      ],
      [
        2018,
        61.609280000000005
      ],
      [
        2019,
        "NA"
      ]
    ],
    "enseignant_secondaire": [
      [
        1960,
        "NA"
      ],
      [
        1961,
        "NA"
      ],
      [
        1962,
        "NA"
      ],
      [
        1963,
        "NA"
      ],
      [
        1964,
        "NA"
      ],
      [
        1965,
        "NA"
      ],
      [
        1966,
        "NA"
      ],
      [
        1967,
        "NA"
      ],
      [
        1968,
        "NA"
      ],
      [
        1969,
        "NA"
      ],
      [
        1970,
        "NA"
      ],
      [
        1971,
        "NA"
      ],
      [
        1972,
        "NA"
      ],
      [
        1973,
        "NA"
      ],
      [
        1974,
        "NA"
      ],
      [
        1975,
        "NA"
      ],
      [
        1976,
        "NA"
      ],
      [
        1977,
        "NA"
      ],
      [
        1978,
        "NA"
      ],
      [
        1979,
        "NA"
      ],
      [
        1980,
        "NA"
      ],
      [
        1981,
        "NA"
      ],
      [
        1982,
        "NA"
      ],
      [
        1983,
        "NA"
      ],
      [
        1984,
        "NA"
      ],
      [
        1985,
        "NA"
      ],
      [
        1986,
        "NA"
      ],
      [
        1987,
        "NA"
      ],
      [
        1988,
        "NA"
      ],
      [
        1989,
        "NA"
      ],
      [
        1990,
        "NA"
      ],
      [
        1991,
        "NA"
      ],
      [
        1992,
        "NA"
      ],
      [
        1993,
        "NA"
      ],
      [
        1994,
        "NA"
      ],
      [
        1995,
        "NA"
      ],
      [
        1996,
        "NA"
      ],
      [
        1997,
        "NA"
      ],
      [
        1998,
        "NA"
      ],
      [
        1999,
        "NA"
      ],
      [
        2000,
        "NA"
      ],
      [
        2001,
        "NA"
      ],
      [
        2002,
        "NA"
      ],
      [
        2003,
        28.166140000000002
      ],
      [
        2004,
        29.99415
      ],
      [
        2005,
        "NA"
      ],
      [
        2006,
        20.9296
      ],
      [
        2007,
        "NA"
      ],
      [
        2008,
        "NA"
      ],
      [
        2009,
        "NA"
      ],
      [
        2010,
        16.5812
      ],
      [
        2011,
        "NA"
      ],
      [
        2012,
        "NA"
      ],
      [
        2013,
        "NA"
      ],
      [
        2014,
        15.729679999999998
      ],
      [
        2015,
        15.00751
      ],
      [
        2016,
        "NA"
      ],
      [
        2017,
        10.568489999999999
      ],
      [
        2018,
        "NA"
      ],
      [
        2019,
        "NA"
      ]
    ],
    "frag_pol": [
      [
        2006,
        0.0
      ],
      [
        2007,
        0.0
      ],
      [
        2008,
        0.0
      ],
      [
        2009,
        0.0
      ],
      [
        2010,
        0.0
      ],
      [
        2011,
        0.0
      ],
      [
        2012,
        0.0
      ],
      [
        2013,
        0.0
      ],
      [
        2014,
        0.0
      ],
      [
        2015,
        0.0
      ],
      [
        2016,
        0.0
      ],
      [
        2017,
        0.0
      ]
    ],
    "idh": [
      [
        1990,
        0.21
      ],
      [
        1991,
        0.214
      ],
      [
        1992,
        0.21600000000000005
      ],
      [
        1993,
        0.22
      ],
      [
        1994,
        0.224
      ],
      [
        1995,
        0.229
      ],
      [
        1996,
        0.235
      ],
      [
        1997,
        0.238
      ],
      [
        1998,
        0.246
      ],
      [
        1999,
        0.25
      ],
      [
        2000,
        0.252
      ],
      [
        2001,
        0.258
      ],
      [
        2002,
        0.263
      ],
      [
        2003,
        0.266
      ],
      [
        2004,
        0.274
      ],
      [
        2005,
        0.28300000000000003
      ],
      [
        2006,
        0.289
      ],
      [
        2007,
        0.294
      ],
      [
        2008,
        0.303
      ],
      [
        2009,
        0.308
      ],
      [
        2010,
        0.318
      ],
      [
        2011,
        0.325
      ],
      [
        2012,
        0.336
      ],
      [
        2013,
        0.34
      ],
      [
        2014,
        0.345
      ],
      [
        2015,
        0.34700000000000003
      ],
      [
        2016,
        0.35100000000000003
      ],
      [
        2017,
        0.354
      ]
    ],
    "lib_monde": [
      [
        2013,
        2.0
      ],
      [
        2014,
        2.0
      ],
      [
        2015,
        2.0
      ],
      [
        2016,
        2.0
      ],
      [
        2017,
        2.0
      ],
      [
        2018,
        2.0
      ]
    ],
    "migration": [
      [
        1955,
        0.363
      ],
      [
        1960,
        -1.584
      ],
      [
        1965,
        -0.632
      ],
      [
        1970,
        -0.5479999999999999
      ],
      [
        1975,
        -0.568
      ],
      [
        1980,
        -0.649
      ],
      [
        1985,
        -2.8810000000000002
      ],
      [
        1990,
        -2.086
      ],
      [
        1995,
        -0.061
      ],
      [
        2000,
        -0.191
      ],
      [
        2005,
        -0.152
      ],
      [
        2010,
        -0.266
      ],
      [
        2015,
        0.207
      ],
      [
        2020,
        0.18100000000000002
      ],
      [
        2025,
        0.038
      ],
      [
        2030,
        0.031
      ],
      [
        2035,
        0.026000000000000002
      ],
      [
        2040,
        0.022000000000000002
      ],
      [
        2045,
        0.019
      ],
      [
        2050,
        0.016
      ],
      [
        2055,
        0.013999999999999999
      ],
      [
        2060,
        0.013000000000000001
      ],
      [
        2065,
        0.011000000000000001
      ],
      [
        2070,
        0.01
      ],
      [
        2075,
        0.009000000000000001
      ],
      [
        2080,
        0.008
      ],
      [
        2085,
        0.008
      ],
      [
        2090,
        0.006999999999999999
      ],
      [
        2095,
        0.006999999999999999
      ],
      [
        2100,
        0.006
      ]
    ],
    "mortal_infant": [
      [
        1960,
        "NA"
      ],
      [
        1961,
        "NA"
      ],
      [
        1962,
        "NA"
      ],
      [
        1963,
        "NA"
      ],
      [
        1964,
        "NA"
      ],
      [
        1965,
        "NA"
      ],
      [
        1966,
        "NA"
      ],
      [
        1967,
        314.9
      ],
      [
        1968,
        319.1
      ],
      [
        1969,
        323.1
      ],
      [
        1970,
        327.3
      ],
      [
        1971,
        331.5
      ],
      [
        1972,
        335.1
      ],
      [
        1973,
        337.6
      ],
      [
        1974,
        338.9
      ],
      [
        1975,
        338.2
      ],
      [
        1976,
        335.7
      ],
      [
        1977,
        331.4
      ],
      [
        1978,
        326.7
      ],
      [
        1979,
        322.5
      ],
      [
        1980,
        320.0
      ],
      [
        1981,
        319.4
      ],
      [
        1982,
        321.3
      ],
      [
        1983,
        325.0
      ],
      [
        1984,
        329.3
      ],
      [
        1985,
        333.7
      ],
      [
        1986,
        336.6
      ],
      [
        1987,
        337.6
      ],
      [
        1988,
        336.5
      ],
      [
        1989,
        333.4
      ],
      [
        1990,
        328.6
      ],
      [
        1991,
        321.9
      ],
      [
        1992,
        313.6
      ],
      [
        1993,
        303.4
      ],
      [
        1994,
        291.6
      ],
      [
        1995,
        278.7
      ],
      [
        1996,
        266.0
      ],
      [
        1997,
        254.6
      ],
      [
        1998,
        244.4
      ],
      [
        1999,
        235.2
      ],
      [
        2000,
        226.1
      ],
      [
        2001,
        216.6
      ],
      [
        2002,
        206.1
      ],
      [
        2003,
        194.9
      ],
      [
        2004,
        183.2
      ],
      [
        2005,
        171.7
      ],
      [
        2006,
        160.7
      ],
      [
        2007,
        150.2
      ],
      [
        2008,
        140.3
      ],
      [
        2009,
        131.1
      ],
      [
        2010,
        122.6
      ],
      [
        2011,
        115.1
      ],
      [
        2012,
        108.7
      ],
      [
        2013,
        103.2
      ],
      [
        2014,
        98.5
      ],
      [
        2015,
        94.3
      ],
      [
        2016,
        90.3
      ],
      [
        2017,
        86.7
      ],
      [
        2018,
        83.7
      ],
      [
        2019,
        "NA"
      ]
    ],
    "pib": [
      [
        1980,
        2.509
      ],
      [
        1981,
        2.171
      ],
      [
        1982,
        2.0180000000000002
      ],
      [
        1983,
        1.8030000000000002
      ],
      [
        1984,
        1.4609999999999999
      ],
      [
        1985,
        1.44
      ],
      [
        1986,
        1.9040000000000001
      ],
      [
        1987,
        2.233
      ],
      [
        1988,
        2.28
      ],
      [
        1989,
        2.18
      ],
      [
        1990,
        2.48
      ],
      [
        1991,
        2.3280000000000003
      ],
      [
        1992,
        2.345
      ],
      [
        1993,
        2.221
      ],
      [
        1994,
        1.5630000000000002
      ],
      [
        1995,
        1.756
      ],
      [
        1996,
        1.88
      ],
      [
        1997,
        1.733
      ],
      [
        1998,
        1.98
      ],
      [
        1999,
        1.916
      ],
      [
        2000,
        1.671
      ],
      [
        2001,
        1.815
      ],
      [
        2002,
        2.072
      ],
      [
        2003,
        2.645
      ],
      [
        2004,
        2.9
      ],
      [
        2005,
        3.3739999999999997
      ],
      [
        2006,
        3.65
      ],
      [
        2007,
        4.29
      ],
      [
        2008,
        5.428999999999999
      ],
      [
        2009,
        5.4110000000000005
      ],
      [
        2010,
        5.729
      ],
      [
        2011,
        6.415
      ],
      [
        2012,
        6.946000000000001
      ],
      [
        2013,
        7.67
      ],
      [
        2014,
        8.243
      ],
      [
        2015,
        7.255
      ],
      [
        2016,
        7.61
      ],
      [
        2017,
        8.136000000000001
      ],
      [
        2018,
        9.299
      ],
      [
        2019,
        9.443
      ],
      [
        2020,
        10.347000000000001
      ],
      [
        2021,
        11.214
      ],
      [
        2022,
        12.805
      ],
      [
        2023,
        13.915
      ],
      [
        2024,
        15.245
      ]
    ],
    "pib_hab": [
      [
        1980,
        432.97
      ],
      [
        1981,
        362.349
      ],
      [
        1982,
        325.466
      ],
      [
        1983,
        281.095
      ],
      [
        1984,
        220.24099999999999
      ],
      [
        1985,
        210.158
      ],
      [
        1986,
        269.043
      ],
      [
        1987,
        305.77299999999997
      ],
      [
        1988,
        302.67
      ],
      [
        1989,
        280.438
      ],
      [
        1990,
        309.293
      ],
      [
        1991,
        281.077
      ],
      [
        1992,
        273.816
      ],
      [
        1993,
        250.602
      ],
      [
        1994,
        170.454
      ],
      [
        1995,
        185.046
      ],
      [
        1996,
        191.327
      ],
      [
        1997,
        170.262
      ],
      [
        1998,
        187.796
      ],
      [
        1999,
        175.257
      ],
      [
        2000,
        147.441
      ],
      [
        2001,
        154.438
      ],
      [
        2002,
        169.947
      ],
      [
        2003,
        209.08599999999998
      ],
      [
        2004,
        220.93
      ],
      [
        2005,
        247.669
      ],
      [
        2006,
        258.056
      ],
      [
        2007,
        292.106
      ],
      [
        2008,
        355.962
      ],
      [
        2009,
        341.543
      ],
      [
        2010,
        347.985
      ],
      [
        2011,
        374.82300000000004
      ],
      [
        2012,
        390.33099999999996
      ],
      [
        2013,
        414.51599999999996
      ],
      [
        2014,
        428.44199999999995
      ],
      [
        2015,
        362.717
      ],
      [
        2016,
        366.05800000000005
      ],
      [
        2017,
        376.62300000000005
      ],
      [
        2018,
        414.32800000000003
      ],
      [
        2019,
        405.095
      ],
      [
        2020,
        427.445
      ],
      [
        2021,
        446.23800000000006
      ],
      [
        2022,
        490.903
      ],
      [
        2023,
        514.091
      ],
      [
        2024,
        542.9019999999999
      ]
    ],
    "pib_ppa": [
      [
        1980,
        4.145
      ],
      [
        1981,
        4.529
      ],
      [
        1982,
        4.913
      ],
      [
        1983,
        4.908
      ],
      [
        1984,
        4.23
      ],
      [
        1985,
        4.7010000000000005
      ],
      [
        1986,
        5.1
      ],
      [
        1987,
        5.231
      ],
      [
        1988,
        5.787000000000001
      ],
      [
        1989,
        6.072
      ],
      [
        1990,
        6.2170000000000005
      ],
      [
        1991,
        6.417000000000001
      ],
      [
        1992,
        6.695
      ],
      [
        1993,
        6.8839999999999995
      ],
      [
        1994,
        7.151
      ],
      [
        1995,
        7.468999999999999
      ],
      [
        1996,
        7.6339999999999995
      ],
      [
        1997,
        7.882000000000001
      ],
      [
        1998,
        8.757
      ],
      [
        1999,
        8.877
      ],
      [
        2000,
        8.98
      ],
      [
        2001,
        9.83
      ],
      [
        2002,
        10.460999999999999
      ],
      [
        2003,
        10.92
      ],
      [
        2004,
        11.254000000000001
      ],
      [
        2005,
        12.432
      ],
      [
        2006,
        13.555
      ],
      [
        2007,
        14.350999999999999
      ],
      [
        2008,
        15.767000000000001
      ],
      [
        2009,
        16.182000000000002
      ],
      [
        2010,
        17.75
      ],
      [
        2011,
        18.55
      ],
      [
        2012,
        20.91
      ],
      [
        2013,
        22.461
      ],
      [
        2014,
        24.378
      ],
      [
        2015,
        25.708000000000002
      ],
      [
        2016,
        27.451
      ],
      [
        2017,
        29.366
      ],
      [
        2018,
        32.189
      ],
      [
        2019,
        34.659
      ],
      [
        2020,
        35.211
      ],
      [
        2021,
        38.81
      ]
    ],
    "pop_pauvrete": [
      [
        1960,
        "NA"
      ],
      [
        1961,
        "NA"
      ],
      [
        1962,
        "NA"
      ],
      [
        1963,
        "NA"
      ],
      [
        1964,
        "NA"
      ],
      [
        1965,
        "NA"
      ],
      [
        1966,
        "NA"
      ],
      [
        1967,
        "NA"
      ],
      [
        1968,
        "NA"
      ],
      [
        1969,
        "NA"
      ],
      [
        1970,
        "NA"
      ],
      [
        1971,
        "NA"
      ],
      [
        1972,
        "NA"
      ],
      [
        1973,
        "NA"
      ],
      [
        1974,
        "NA"
      ],
      [
        1975,
        "NA"
      ],
      [
        1976,
        "NA"
      ],
      [
        1977,
        "NA"
      ],
      [
        1978,
        "NA"
      ],
      [
        1979,
        "NA"
      ],
      [
        1980,
        "NA"
      ],
      [
        1981,
        "NA"
      ],
      [
        1982,
        "NA"
      ],
      [
        1983,
        "NA"
      ],
      [
        1984,
        "NA"
      ],
      [
        1985,
        "NA"
      ],
      [
        1986,
        "NA"
      ],
      [
        1987,
        "NA"
      ],
      [
        1988,
        "NA"
      ],
      [
        1989,
        "NA"
      ],
      [
        1990,
        "NA"
      ],
      [
        1991,
        "NA"
      ],
      [
        1992,
        78.2
      ],
      [
        1993,
        "NA"
      ],
      [
        1994,
        81.4
      ],
      [
        1995,
        "NA"
      ],
      [
        1996,
        "NA"
      ],
      [
        1997,
        "NA"
      ],
      [
        1998,
        "NA"
      ],
      [
        1999,
        "NA"
      ],
      [
        2000,
        "NA"
      ],
      [
        2001,
        "NA"
      ],
      [
        2002,
        "NA"
      ],
      [
        2003,
        "NA"
      ],
      [
        2004,
        "NA"
      ],
      [
        2005,
        74.9
      ],
      [
        2006,
        "NA"
      ],
      [
        2007,
        72.0
      ],
      [
        2008,
        "NA"
      ],
      [
        2009,
        "NA"
      ],
      [
        2010,
        "NA"
      ],
      [
        2011,
        50.3
      ],
      [
        2012,
        "NA"
      ],
      [
        2013,
        "NA"
      ],
      [
        2014,
        44.5
      ],
      [
        2015,
        "NA"
      ],
      [
        2016,
        "NA"
      ],
      [
        2017,
        "NA"
      ],
      [
        2018,
        "NA"
      ],
      [
        2019,
        "NA"
      ]
    ],
    "pop_rurale": [
      [
        1960,
        94.20700000000001
      ],
      [
        1961,
        94.104
      ],
      [
        1962,
        94.0
      ],
      [
        1963,
        93.741
      ],
      [
        1964,
        93.471
      ],
      [
        1965,
        93.191
      ],
      [
        1966,
        92.9
      ],
      [
        1967,
        92.507
      ],
      [
        1968,
        92.094
      ],
      [
        1969,
        91.661
      ],
      [
        1970,
        91.206
      ],
      [
        1971,
        90.729
      ],
      [
        1972,
        90.228
      ],
      [
        1973,
        89.704
      ],
      [
        1974,
        89.155
      ],
      [
        1975,
        88.581
      ],
      [
        1976,
        87.979
      ],
      [
        1977,
        87.352
      ],
      [
        1978,
        86.975
      ],
      [
        1979,
        86.76700000000001
      ],
      [
        1980,
        86.557
      ],
      [
        1981,
        86.344
      ],
      [
        1982,
        86.12899999999999
      ],
      [
        1983,
        85.91
      ],
      [
        1984,
        85.68799999999999
      ],
      [
        1985,
        85.464
      ],
      [
        1986,
        85.23700000000001
      ],
      [
        1987,
        85.007
      ],
      [
        1988,
        84.791
      ],
      [
        1989,
        84.711
      ],
      [
        1990,
        84.632
      ],
      [
        1991,
        84.551
      ],
      [
        1992,
        84.471
      ],
      [
        1993,
        84.39
      ],
      [
        1994,
        84.309
      ],
      [
        1995,
        84.227
      ],
      [
        1996,
        84.145
      ],
      [
        1997,
        84.06299999999999
      ],
      [
        1998,
        83.98
      ],
      [
        1999,
        83.897
      ],
      [
        2000,
        83.814
      ],
      [
        2001,
        83.74
      ],
      [
        2002,
        83.745
      ],
      [
        2003,
        83.749
      ],
      [
        2004,
        83.75299999999999
      ],
      [
        2005,
        83.758
      ],
      [
        2006,
        83.762
      ],
      [
        2007,
        83.766
      ],
      [
        2008,
        83.771
      ],
      [
        2009,
        83.775
      ],
      [
        2010,
        83.779
      ],
      [
        2011,
        83.78399999999999
      ],
      [
        2012,
        83.788
      ],
      [
        2013,
        83.792
      ],
      [
        2014,
        83.781
      ],
      [
        2015,
        83.75299999999999
      ],
      [
        2016,
        83.71
      ],
      [
        2017,
        83.65
      ],
      [
        2018,
        83.575
      ],
      [
        2019,
        "NA"
      ]
    ],
    "pop_tot": [
      [
        1950,
        2.559703
      ],
      [
        1951,
        2.638127
      ],
      [
        1952,
        2.716816
      ],
      [
        1953,
        2.795807
      ],
      [
        1954,
        2.875276
      ],
      [
        1955,
        2.955541
      ],
      [
        1956,
        3.037051
      ],
      [
        1957,
        3.120416
      ],
      [
        1958,
        3.206342
      ],
      [
        1959,
        3.2955660000000004
      ],
      [
        1960,
        3.388764
      ],
      [
        1961,
        3.486326
      ],
      [
        1962,
        3.588228
      ],
      [
        1963,
        3.6939800000000003
      ],
      [
        1964,
        3.802803
      ],
      [
        1965,
        3.9141169999999996
      ],
      [
        1966,
        4.0279630000000015
      ],
      [
        1967,
        4.1445919999999985
      ],
      [
        1968,
        4.263927
      ],
      [
        1969,
        4.385927
      ],
      [
        1970,
        4.510644
      ],
      [
        1971,
        4.637988
      ],
      [
        1972,
        4.768227
      ],
      [
        1973,
        4.902151
      ],
      [
        1974,
        5.040798000000001
      ],
      [
        1975,
        5.184941
      ],
      [
        1976,
        5.335084999999999
      ],
      [
        1977,
        5.4911530000000015
      ],
      [
        1978,
        5.652652
      ],
      [
        1979,
        5.818763
      ],
      [
        1980,
        5.989004
      ],
      [
        1981,
        6.163705
      ],
      [
        1982,
        6.343523
      ],
      [
        1983,
        6.528641
      ],
      [
        1984,
        6.719309
      ],
      [
        1985,
        6.915997
      ],
      [
        1986,
        7.1188829999999985
      ],
      [
        1987,
        7.3289430000000015
      ],
      [
        1988,
        7.548433
      ],
      [
        1989,
        7.780245
      ],
      [
        1990,
        8.026591
      ],
      [
        1991,
        8.288735
      ],
      [
        1992,
        8.56677
      ],
      [
        1993,
        8.860287
      ],
      [
        1994,
        9.168312
      ],
      [
        1995,
        9.490288
      ],
      [
        1996,
        9.826597999999999
      ],
      [
        1997,
        10.178201
      ],
      [
        1998,
        10.545716
      ],
      [
        1999,
        10.929918
      ],
      [
        2000,
        11.331557
      ],
      [
        2001,
        11.751365
      ],
      [
        2002,
        12.189983
      ],
      [
        2003,
        12.647984
      ],
      [
        2004,
        13.125916
      ],
      [
        2005,
        13.624467
      ],
      [
        2006,
        14.143971
      ],
      [
        2007,
        14.685398999999999
      ],
      [
        2008,
        15.250908
      ],
      [
        2009,
        15.843132999999998
      ],
      [
        2010,
        16.464025000000003
      ],
      [
        2011,
        17.114766
      ],
      [
        2012,
        17.79521
      ],
      [
        2013,
        18.504281
      ],
      [
        2014,
        19.240179
      ],
      [
        2015,
        20.001663
      ],
      [
        2016,
        20.788798
      ],
      [
        2017,
        21.602382
      ],
      [
        2018,
        22.442822
      ],
      [
        2019,
        23.310715
      ],
      [
        2020,
        24.206644
      ],
      [
        2021,
        25.130817
      ],
      [
        2022,
        26.083660000000002
      ],
      [
        2023,
        27.066232
      ],
      [
        2024,
        28.079839
      ],
      [
        2025,
        29.12552
      ],
      [
        2026,
        30.203733000000003
      ],
      [
        2027,
        31.31461
      ],
      [
        2028,
        32.458489
      ],
      [
        2029,
        33.635577000000005
      ],
      [
        2030,
        34.84602
      ],
      [
        2031,
        36.08992
      ],
      [
        2032,
        37.367258
      ],
      [
        2033,
        38.677737
      ],
      [
        2034,
        40.020920000000004
      ],
      [
        2035,
        41.396373
      ],
      [
        2036,
        42.803808000000004
      ],
      [
        2037,
        44.242946
      ],
      [
        2038,
        45.713337
      ],
      [
        2039,
        47.214475
      ],
      [
        2040,
        48.74585500000001
      ],
      [
        2041,
        50.306974
      ],
      [
        2042,
        51.897321999999996
      ],
      [
        2043,
        53.516247
      ],
      [
        2044,
        55.16306700000001
      ],
      [
        2045,
        56.837126
      ],
      [
        2046,
        58.537693000000004
      ],
      [
        2047,
        60.264146
      ],
      [
        2048,
        62.01591000000001
      ],
      [
        2049,
        63.79241700000001
      ],
      [
        2050,
        65.59304300000001
      ],
      [
        2051,
        67.417106
      ],
      [
        2052,
        69.26376300000001
      ],
      [
        2053,
        71.131901
      ],
      [
        2054,
        73.02032000000001
      ],
      [
        2055,
        74.92789599999998
      ],
      [
        2056,
        76.85365300000002
      ],
      [
        2057,
        78.79683399999999
      ],
      [
        2058,
        80.756884
      ],
      [
        2059,
        82.73335499999997
      ],
      [
        2060,
        84.725659
      ],
      [
        2061,
        86.732926
      ],
      [
        2062,
        88.754071
      ],
      [
        2063,
        90.787961
      ],
      [
        2064,
        92.833377
      ],
      [
        2065,
        94.889127
      ],
      [
        2066,
        96.954149
      ],
      [
        2067,
        99.027364
      ],
      [
        2068,
        101.107581
      ],
      [
        2069,
        103.19354
      ],
      [
        2070,
        105.283988
      ],
      [
        2071,
        107.377872
      ],
      [
        2072,
        109.474085
      ],
      [
        2073,
        111.57132299999999
      ],
      [
        2074,
        113.668229
      ],
      [
        2075,
        115.76354199999999
      ],
      [
        2076,
        117.856171
      ],
      [
        2077,
        119.945213
      ],
      [
        2078,
        122.029844
      ],
      [
        2079,
        124.10933899999999
      ],
      [
        2080,
        126.182966
      ],
      [
        2081,
        128.249649
      ],
      [
        2082,
        130.30840700000002
      ],
      [
        2083,
        132.358787
      ],
      [
        2084,
        134.400422
      ],
      [
        2085,
        136.43273200000002
      ],
      [
        2086,
        138.455037
      ],
      [
        2087,
        140.46607500000002
      ],
      [
        2088,
        142.463926
      ],
      [
        2089,
        144.446326
      ],
      [
        2090,
        146.411369
      ],
      [
        2091,
        148.357811
      ],
      [
        2092,
        150.284929
      ],
      [
        2093,
        152.19236899999999
      ],
      [
        2094,
        154.079855
      ],
      [
        2095,
        155.946981
      ],
      [
        2096,
        157.793143
      ],
      [
        2097,
        159.617503
      ],
      [
        2098,
        161.41893299999995
      ],
      [
        2099,
        163.196087
      ],
      [
        2100,
        164.94733200000002
      ]
    ],
    "pop_urbaine": [
      [
        1960,
        5.792999999999999
      ],
      [
        1961,
        5.896
      ],
      [
        1962,
        6.0
      ],
      [
        1963,
        6.2589999999999995
      ],
      [
        1964,
        6.529
      ],
      [
        1965,
        6.809
      ],
      [
        1966,
        7.1
      ],
      [
        1967,
        7.492999999999999
      ],
      [
        1968,
        7.906000000000001
      ],
      [
        1969,
        8.339
      ],
      [
        1970,
        8.794
      ],
      [
        1971,
        9.271
      ],
      [
        1972,
        9.772
      ],
      [
        1973,
        10.296
      ],
      [
        1974,
        10.845
      ],
      [
        1975,
        11.419
      ],
      [
        1976,
        12.020999999999999
      ],
      [
        1977,
        12.648
      ],
      [
        1978,
        13.025
      ],
      [
        1979,
        13.232999999999999
      ],
      [
        1980,
        13.443
      ],
      [
        1981,
        13.655999999999999
      ],
      [
        1982,
        13.870999999999999
      ],
      [
        1983,
        14.09
      ],
      [
        1984,
        14.312000000000001
      ],
      [
        1985,
        14.536
      ],
      [
        1986,
        14.763
      ],
      [
        1987,
        14.993
      ],
      [
        1988,
        15.209000000000001
      ],
      [
        1989,
        15.289000000000001
      ],
      [
        1990,
        15.368
      ],
      [
        1991,
        15.449000000000002
      ],
      [
        1992,
        15.529000000000002
      ],
      [
        1993,
        15.61
      ],
      [
        1994,
        15.690999999999999
      ],
      [
        1995,
        15.773
      ],
      [
        1996,
        15.855
      ],
      [
        1997,
        15.937000000000001
      ],
      [
        1998,
        16.02
      ],
      [
        1999,
        16.102999999999998
      ],
      [
        2000,
        16.186
      ],
      [
        2001,
        16.26
      ],
      [
        2002,
        16.255
      ],
      [
        2003,
        16.250999999999998
      ],
      [
        2004,
        16.247
      ],
      [
        2005,
        16.242
      ],
      [
        2006,
        16.238
      ],
      [
        2007,
        16.234
      ],
      [
        2008,
        16.229
      ],
      [
        2009,
        16.225
      ],
      [
        2010,
        16.221
      ],
      [
        2011,
        16.215999999999998
      ],
      [
        2012,
        16.212
      ],
      [
        2013,
        16.208
      ],
      [
        2014,
        16.219
      ],
      [
        2015,
        16.247
      ],
      [
        2016,
        16.29
      ],
      [
        2017,
        16.35
      ],
      [
        2018,
        16.425
      ],
      [
        2019,
        "NA"
      ]
    ],
    "prod_elec_renouv": [
      [
        1960,
        "NA"
      ],
      [
        1961,
        "NA"
      ],
      [
        1962,
        "NA"
      ],
      [
        1963,
        "NA"
      ],
      [
        1964,
        "NA"
      ],
      [
        1965,
        "NA"
      ],
      [
        1966,
        "NA"
      ],
      [
        1967,
        "NA"
      ],
      [
        1968,
        "NA"
      ],
      [
        1969,
        "NA"
      ],
      [
        1970,
        "NA"
      ],
      [
        1971,
        "NA"
      ],
      [
        1972,
        "NA"
      ],
      [
        1973,
        "NA"
      ],
      [
        1974,
        "NA"
      ],
      [
        1975,
        "NA"
      ],
      [
        1976,
        "NA"
      ],
      [
        1977,
        "NA"
      ],
      [
        1978,
        "NA"
      ],
      [
        1979,
        "NA"
      ],
      [
        1980,
        "NA"
      ],
      [
        1981,
        "NA"
      ],
      [
        1982,
        "NA"
      ],
      [
        1983,
        "NA"
      ],
      [
        1984,
        "NA"
      ],
      [
        1985,
        "NA"
      ],
      [
        1986,
        "NA"
      ],
      [
        1987,
        "NA"
      ],
      [
        1988,
        "NA"
      ],
      [
        1989,
        "NA"
      ],
      [
        1990,
        "NA"
      ],
      [
        1991,
        "NA"
      ],
      [
        1992,
        "NA"
      ],
      [
        1993,
        "NA"
      ],
      [
        1994,
        "NA"
      ],
      [
        1995,
        "NA"
      ],
      [
        1996,
        "NA"
      ],
      [
        1997,
        "NA"
      ],
      [
        1998,
        "NA"
      ],
      [
        1999,
        "NA"
      ],
      [
        2000,
        0.0
      ],
      [
        2001,
        0.0
      ],
      [
        2002,
        0.0
      ],
      [
        2003,
        0.0
      ],
      [
        2004,
        0.0
      ],
      [
        2005,
        0.8733624454000001
      ],
      [
        2006,
        0.9174311927
      ],
      [
        2007,
        0.8928571429000001
      ],
      [
        2008,
        1.3157894737
      ],
      [
        2009,
        1.1673151751000002
      ],
      [
        2010,
        1.023890785
      ],
      [
        2011,
        0.0
      ],
      [
        2012,
        0.0
      ],
      [
        2013,
        0.9029345371999999
      ],
      [
        2014,
        0.9029345371999999
      ],
      [
        2015,
        0.7532956685
      ],
      [
        2016,
        "NA"
      ],
      [
        2017,
        "NA"
      ],
      [
        2018,
        "NA"
      ],
      [
        2019,
        "NA"
      ]
    ],
    "rdt_cerealier": [
      [
        1960,
        "NA"
      ],
      [
        1961,
        505.2
      ],
      [
        1962,
        547.8
      ],
      [
        1963,
        560.1
      ],
      [
        1964,
        599.3
      ],
      [
        1965,
        467.5
      ],
      [
        1966,
        496.2
      ],
      [
        1967,
        571.3
      ],
      [
        1968,
        394.0
      ],
      [
        1969,
        493.7
      ],
      [
        1970,
        390.2
      ],
      [
        1971,
        424.8
      ],
      [
        1972,
        417.6
      ],
      [
        1973,
        323.9
      ],
      [
        1974,
        406.0
      ],
      [
        1975,
        346.4
      ],
      [
        1976,
        423.4
      ],
      [
        1977,
        431.3
      ],
      [
        1978,
        431.5
      ],
      [
        1979,
        447.0
      ],
      [
        1980,
        457.4
      ],
      [
        1981,
        415.6
      ],
      [
        1982,
        400.3
      ],
      [
        1983,
        401.9
      ],
      [
        1984,
        257.1
      ],
      [
        1985,
        425.0
      ],
      [
        1986,
        418.9
      ],
      [
        1987,
        326.5
      ],
      [
        1988,
        475.2
      ],
      [
        1989,
        352.7
      ],
      [
        1990,
        310.3
      ],
      [
        1991,
        333.2
      ],
      [
        1992,
        309.2
      ],
      [
        1993,
        326.2
      ],
      [
        1994,
        267.9
      ],
      [
        1995,
        312.3
      ],
      [
        1996,
        291.0
      ],
      [
        1997,
        287.7
      ],
      [
        1998,
        389.5
      ],
      [
        1999,
        380.1
      ],
      [
        2000,
        289.2
      ],
      [
        2001,
        394.4
      ],
      [
        2002,
        422.9
      ],
      [
        2003,
        429.5
      ],
      [
        2004,
        341.5
      ],
      [
        2005,
        436.6
      ],
      [
        2006,
        449.6
      ],
      [
        2007,
        424.8
      ],
      [
        2008,
        496.5
      ],
      [
        2009,
        386.0
      ],
      [
        2010,
        494.8
      ],
      [
        2011,
        362.8
      ],
      [
        2012,
        520.3
      ],
      [
        2013,
        407.7
      ],
      [
        2014,
        446.8
      ],
      [
        2015,
        551.3
      ],
      [
        2016,
        536.5
      ],
      [
        2017,
        541.9
      ],
      [
        2018,
        "NA"
      ],
      [
        2019,
        "NA"
      ]
    ],
    "recette_budg": [
      [
        1980,
        "NA"
      ],
      [
        1981,
        "NA"
      ],
      [
        1982,
        "NA"
      ],
      [
        1983,
        "NA"
      ],
      [
        1984,
        "NA"
      ],
      [
        1985,
        "NA"
      ],
      [
        1986,
        "NA"
      ],
      [
        1987,
        "NA"
      ],
      [
        1988,
        "NA"
      ],
      [
        1989,
        "NA"
      ],
      [
        1990,
        "NA"
      ],
      [
        1991,
        "NA"
      ],
      [
        1992,
        "NA"
      ],
      [
        1993,
        "NA"
      ],
      [
        1994,
        "NA"
      ],
      [
        1995,
        12.157
      ],
      [
        1996,
        13.411
      ],
      [
        1997,
        13.859000000000002
      ],
      [
        1998,
        15.190999999999999
      ],
      [
        1999,
        14.129000000000001
      ],
      [
        2000,
        14.28
      ],
      [
        2001,
        14.99
      ],
      [
        2002,
        16.358
      ],
      [
        2003,
        15.165999999999999
      ],
      [
        2004,
        17.185
      ],
      [
        2005,
        18.184
      ],
      [
        2006,
        60.086999999999996
      ],
      [
        2007,
        22.188000000000002
      ],
      [
        2008,
        24.133000000000003
      ],
      [
        2009,
        18.618
      ],
      [
        2010,
        18.209
      ],
      [
        2011,
        17.93
      ],
      [
        2012,
        21.430999999999997
      ],
      [
        2013,
        24.638
      ],
      [
        2014,
        23.01
      ],
      [
        2015,
        23.346999999999998
      ],
      [
        2016,
        20.262999999999998
      ],
      [
        2017,
        21.151
      ],
      [
        2018,
        25.011999999999997
      ],
      [
        2019,
        25.653000000000002
      ],
      [
        2020,
        25.982
      ],
      [
        2021,
        25.412
      ],
      [
        2022,
        26.184
      ],
      [
        2023,
        26.076999999999998
      ],
      [
        2024,
        26.18
      ]
    ],
    "regime_pol": [
      [
        1816,
        -20.0
      ],
      [
        1817,
        -20.0
      ],
      [
        1818,
        -20.0
      ],
      [
        1819,
        -20.0
      ],
      [
        1820,
        -20.0
      ],
      [
        1821,
        -20.0
      ],
      [
        1822,
        -20.0
      ],
      [
        1823,
        -20.0
      ],
      [
        1824,
        -20.0
      ],
      [
        1825,
        -20.0
      ],
      [
        1826,
        -20.0
      ],
      [
        1827,
        -20.0
      ],
      [
        1828,
        -20.0
      ],
      [
        1829,
        -20.0
      ],
      [
        1830,
        -20.0
      ],
      [
        1831,
        -20.0
      ],
      [
        1832,
        -20.0
      ],
      [
        1833,
        -20.0
      ],
      [
        1834,
        -20.0
      ],
      [
        1835,
        -20.0
      ],
      [
        1836,
        -20.0
      ],
      [
        1837,
        -20.0
      ],
      [
        1838,
        -20.0
      ],
      [
        1839,
        -20.0
      ],
      [
        1840,
        -20.0
      ],
      [
        1841,
        -20.0
      ],
      [
        1842,
        -20.0
      ],
      [
        1843,
        -20.0
      ],
      [
        1844,
        -20.0
      ],
      [
        1845,
        -20.0
      ],
      [
        1846,
        -20.0
      ],
      [
        1847,
        -20.0
      ],
      [
        1848,
        -20.0
      ],
      [
        1849,
        -20.0
      ],
      [
        1850,
        -20.0
      ],
      [
        1851,
        -20.0
      ],
      [
        1852,
        -20.0
      ],
      [
        1853,
        -20.0
      ],
      [
        1854,
        -20.0
      ],
      [
        1855,
        -20.0
      ],
      [
        1856,
        -20.0
      ],
      [
        1857,
        -20.0
      ],
      [
        1858,
        -20.0
      ],
      [
        1859,
        -20.0
      ],
      [
        1860,
        -20.0
      ],
      [
        1861,
        -20.0
      ],
      [
        1862,
        -20.0
      ],
      [
        1863,
        -20.0
      ],
      [
        1864,
        -20.0
      ],
      [
        1865,
        -20.0
      ],
      [
        1866,
        -20.0
      ],
      [
        1867,
        -20.0
      ],
      [
        1868,
        -20.0
      ],
      [
        1869,
        -20.0
      ],
      [
        1870,
        -20.0
      ],
      [
        1871,
        -20.0
      ],
      [
        1872,
        -20.0
      ],
      [
        1873,
        -20.0
      ],
      [
        1874,
        -20.0
      ],
      [
        1875,
        -20.0
      ],
      [
        1876,
        -20.0
      ],
      [
        1877,
        -20.0
      ],
      [
        1878,
        -20.0
      ],
      [
        1879,
        -20.0
      ],
      [
        1880,
        -20.0
      ],
      [
        1881,
        -20.0
      ],
      [
        1882,
        -20.0
      ],
      [
        1883,
        -20.0
      ],
      [
        1884,
        -20.0
      ],
      [
        1885,
        -20.0
      ],
      [
        1886,
        -20.0
      ],
      [
        1887,
        -20.0
      ],
      [
        1888,
        -20.0
      ],
      [
        1889,
        -20.0
      ],
      [
        1890,
        -20.0
      ],
      [
        1891,
        -20.0
      ],
      [
        1892,
        -20.0
      ],
      [
        1893,
        -20.0
      ],
      [
        1894,
        -20.0
      ],
      [
        1895,
        -20.0
      ],
      [
        1896,
        -20.0
      ],
      [
        1897,
        -20.0
      ],
      [
        1898,
        -20.0
      ],
      [
        1899,
        -20.0
      ],
      [
        1900,
        -20.0
      ],
      [
        1901,
        -20.0
      ],
      [
        1902,
        -20.0
      ],
      [
        1903,
        -20.0
      ],
      [
        1904,
        -20.0
      ],
      [
        1905,
        -20.0
      ],
      [
        1906,
        -20.0
      ],
      [
        1907,
        -20.0
      ],
      [
        1908,
        -20.0
      ],
      [
        1909,
        -20.0
      ],
      [
        1910,
        -20.0
      ],
      [
        1911,
        -20.0
      ],
      [
        1912,
        -20.0
      ],
      [
        1913,
        -20.0
      ],
      [
        1914,
        -20.0
      ],
      [
        1915,
        -20.0
      ],
      [
        1916,
        -20.0
      ],
      [
        1917,
        -20.0
      ],
      [
        1918,
        -20.0
      ],
      [
        1919,
        -20.0
      ],
      [
        1920,
        -20.0
      ],
      [
        1921,
        -20.0
      ],
      [
        1922,
        -20.0
      ],
      [
        1923,
        -20.0
      ],
      [
        1924,
        -20.0
      ],
      [
        1925,
        -20.0
      ],
      [
        1926,
        -20.0
      ],
      [
        1927,
        -20.0
      ],
      [
        1928,
        -20.0
      ],
      [
        1929,
        -20.0
      ],
      [
        1930,
        -20.0
      ],
      [
        1931,
        -20.0
      ],
      [
        1932,
        -20.0
      ],
      [
        1933,
        -20.0
      ],
      [
        1934,
        -20.0
      ],
      [
        1935,
        -20.0
      ],
      [
        1936,
        -20.0
      ],
      [
        1937,
        -20.0
      ],
      [
        1938,
        -20.0
      ],
      [
        1939,
        -20.0
      ],
      [
        1940,
        -20.0
      ],
      [
        1941,
        -20.0
      ],
      [
        1942,
        -20.0
      ],
      [
        1943,
        -20.0
      ],
      [
        1944,
        -20.0
      ],
      [
        1945,
        -20.0
      ],
      [
        1946,
        -20.0
      ],
      [
        1947,
        -20.0
      ],
      [
        1948,
        -20.0
      ],
      [
        1949,
        -20.0
      ],
      [
        1950,
        -20.0
      ],
      [
        1951,
        -20.0
      ],
      [
        1952,
        -20.0
      ],
      [
        1953,
        -20.0
      ],
      [
        1954,
        -20.0
      ],
      [
        1955,
        -20.0
      ],
      [
        1956,
        -20.0
      ],
      [
        1957,
        -20.0
      ],
      [
        1958,
        -20.0
      ],
      [
        1959,
        -20.0
      ],
      [
        1960,
        -7.0
      ],
      [
        1961,
        -7.0
      ],
      [
        1962,
        -7.0
      ],
      [
        1963,
        -7.0
      ],
      [
        1964,
        -7.0
      ],
      [
        1965,
        -7.0
      ],
      [
        1966,
        -7.0
      ],
      [
        1967,
        -7.0
      ],
      [
        1968,
        -7.0
      ],
      [
        1969,
        -7.0
      ],
      [
        1970,
        -7.0
      ],
      [
        1971,
        -7.0
      ],
      [
        1972,
        -7.0
      ],
      [
        1973,
        -7.0
      ],
      [
        1974,
        -7.0
      ],
      [
        1975,
        -7.0
      ],
      [
        1976,
        -7.0
      ],
      [
        1977,
        -7.0
      ],
      [
        1978,
        -7.0
      ],
      [
        1979,
        -7.0
      ],
      [
        1980,
        -7.0
      ],
      [
        1981,
        -7.0
      ],
      [
        1982,
        -7.0
      ],
      [
        1983,
        -7.0
      ],
      [
        1984,
        -7.0
      ],
      [
        1985,
        -7.0
      ],
      [
        1986,
        -7.0
      ],
      [
        1987,
        -7.0
      ],
      [
        1988,
        -7.0
      ],
      [
        1989,
        -7.0
      ],
      [
        1990,
        -7.0
      ],
      [
        1991,
        1.0
      ],
      [
        1992,
        8.0
      ],
      [
        1993,
        8.0
      ],
      [
        1994,
        8.0
      ],
      [
        1995,
        8.0
      ],
      [
        1996,
        -6.0
      ],
      [
        1997,
        -6.0
      ],
      [
        1998,
        -6.0
      ],
      [
        1999,
        5.0
      ],
      [
        2000,
        5.0
      ],
      [
        2001,
        5.0
      ],
      [
        2002,
        5.0
      ],
      [
        2003,
        5.0
      ],
      [
        2004,
        6.0
      ],
      [
        2005,
        6.0
      ],
      [
        2006,
        6.0
      ],
      [
        2007,
        6.0
      ],
      [
        2008,
        6.0
      ],
      [
        2009,
        -3.0
      ],
      [
        2010,
        3.0
      ],
      [
        2011,
        6.0
      ],
      [
        2012,
        6.0
      ],
      [
        2013,
        6.0
      ],
      [
        2014,
        6.0
      ],
      [
        2015,
        6.0
      ]
    ],
    "sanitaire_primaire": [
      [
        2000,
        "NA"
      ],
      [
        2001,
        "NA"
      ],
      [
        2002,
        "NA"
      ],
      [
        2003,
        "NA"
      ],
      [
        2004,
        "NA"
      ],
      [
        2005,
        "NA"
      ],
      [
        2006,
        "NA"
      ],
      [
        2007,
        "NA"
      ],
      [
        2008,
        "NA"
      ],
      [
        2009,
        "NA"
      ],
      [
        2010,
        "NA"
      ],
      [
        2011,
        "NA"
      ],
      [
        2012,
        "NA"
      ],
      [
        2013,
        "NA"
      ],
      [
        2014,
        "NA"
      ],
      [
        2015,
        "NA"
      ],
      [
        2016,
        17.780479999999994
      ],
      [
        2017,
        34.05622
      ],
      [
        2018,
        "NA"
      ],
      [
        2019,
        "NA"
      ]
    ],
    "sous_nutri": [
      [
        1960,
        "NA"
      ],
      [
        1961,
        "NA"
      ],
      [
        1962,
        "NA"
      ],
      [
        1963,
        "NA"
      ],
      [
        1964,
        "NA"
      ],
      [
        1965,
        "NA"
      ],
      [
        1966,
        "NA"
      ],
      [
        1967,
        314.9
      ],
      [
        1968,
        319.1
      ],
      [
        1969,
        323.1
      ],
      [
        1970,
        327.3
      ],
      [
        1971,
        331.5
      ],
      [
        1972,
        335.1
      ],
      [
        1973,
        337.6
      ],
      [
        1974,
        338.9
      ],
      [
        1975,
        338.2
      ],
      [
        1976,
        335.7
      ],
      [
        1977,
        331.4
      ],
      [
        1978,
        326.7
      ],
      [
        1979,
        322.5
      ],
      [
        1980,
        320.0
      ],
      [
        1981,
        319.4
      ],
      [
        1982,
        321.3
      ],
      [
        1983,
        325.0
      ],
      [
        1984,
        329.3
      ],
      [
        1985,
        333.7
      ],
      [
        1986,
        336.6
      ],
      [
        1987,
        337.6
      ],
      [
        1988,
        336.5
      ],
      [
        1989,
        333.4
      ],
      [
        1990,
        328.6
      ],
      [
        1991,
        321.9
      ],
      [
        1992,
        313.6
      ],
      [
        1993,
        303.4
      ],
      [
        1994,
        291.6
      ],
      [
        1995,
        278.7
      ],
      [
        1996,
        266.0
      ],
      [
        1997,
        254.6
      ],
      [
        1998,
        244.4
      ],
      [
        1999,
        235.2
      ],
      [
        2000,
        226.1
      ],
      [
        2001,
        216.6
      ],
      [
        2002,
        206.1
      ],
      [
        2003,
        194.9
      ],
      [
        2004,
        183.2
      ],
      [
        2005,
        171.7
      ],
      [
        2006,
        160.7
      ],
      [
        2007,
        150.2
      ],
      [
        2008,
        140.3
      ],
      [
        2009,
        131.1
      ],
      [
        2010,
        122.6
      ],
      [
        2011,
        115.1
      ],
      [
        2012,
        108.7
      ],
      [
        2013,
        103.2
      ],
      [
        2014,
        98.5
      ],
      [
        2015,
        94.3
      ],
      [
        2016,
        90.3
      ],
      [
        2017,
        86.7
      ],
      [
        2018,
        83.7
      ],
      [
        2019,
        "NA"
      ]
    ],
    "volume_exp_biens": [
      [
        1980,
        20.0
      ],
      [
        1981,
        19.3
      ],
      [
        1982,
        -16.4
      ],
      [
        1983,
        -10.7
      ],
      [
        1984,
        -3.2
      ],
      [
        1985,
        -5.9
      ],
      [
        1986,
        -2.7
      ],
      [
        1987,
        6.9
      ],
      [
        1988,
        -6.2
      ],
      [
        1989,
        -4.4
      ],
      [
        1990,
        -5.8
      ],
      [
        1991,
        -5.2
      ],
      [
        1992,
        9.7
      ],
      [
        1993,
        -7.4879999999999995
      ],
      [
        1994,
        -6.495
      ],
      [
        1995,
        15.6
      ],
      [
        1996,
        26.941999999999997
      ],
      [
        1997,
        -5.218999999999999
      ],
      [
        1998,
        14.822000000000001
      ],
      [
        1999,
        -13.922
      ],
      [
        2000,
        41.473
      ],
      [
        2001,
        -0.884
      ],
      [
        2002,
        -10.862
      ],
      [
        2003,
        11.880999999999998
      ],
      [
        2004,
        6.207000000000001
      ],
      [
        2005,
        -2.638
      ],
      [
        2006,
        2.415
      ],
      [
        2007,
        -1.565
      ],
      [
        2008,
        -3.9930000000000003
      ],
      [
        2009,
        19.081
      ],
      [
        2010,
        20.494
      ],
      [
        2011,
        -11.491
      ],
      [
        2012,
        28.858
      ],
      [
        2013,
        5.121
      ],
      [
        2014,
        1.2930000000000001
      ],
      [
        2015,
        -3.342
      ],
      [
        2016,
        -3.275
      ],
      [
        2017,
        19.179000000000002
      ],
      [
        2018,
        -3.795
      ],
      [
        2019,
        15.112
      ],
      [
        2020,
        5.669
      ],
      [
        2021,
        2.807
      ],
      [
        2022,
        80.221
      ],
      [
        2023,
        10.031
      ],
      [
        2024,
        12.384
      ]
    ],
    "volume_exp_bs": [
      [
        1980,
        23.456999999999997
      ],
      [
        1981,
        20.576
      ],
      [
        1982,
        -14.26
      ],
      [
        1983,
        -9.882
      ],
      [
        1984,
        -4.655
      ],
      [
        1985,
        -1.99
      ],
      [
        1986,
        -2.659
      ],
      [
        1987,
        4.914
      ],
      [
        1988,
        -5.888
      ],
      [
        1989,
        -1.632
      ],
      [
        1990,
        -0.263
      ],
      [
        1991,
        -2.787
      ],
      [
        1992,
        11.465
      ],
      [
        1993,
        -9.185
      ],
      [
        1994,
        9.921
      ],
      [
        1995,
        0.2
      ],
      [
        1996,
        24.643
      ],
      [
        1997,
        -4.373
      ],
      [
        1998,
        11.020999999999999
      ],
      [
        1999,
        -12.898
      ],
      [
        2000,
        43.227
      ],
      [
        2001,
        5.709
      ],
      [
        2002,
        -8.578
      ],
      [
        2003,
        6.542000000000001
      ],
      [
        2004,
        9.259
      ],
      [
        2005,
        -5.091
      ],
      [
        2006,
        1.982
      ],
      [
        2007,
        -3.694
      ],
      [
        2008,
        -4.772
      ],
      [
        2009,
        14.583
      ],
      [
        2010,
        20.873
      ],
      [
        2011,
        -15.43
      ],
      [
        2012,
        28.579
      ],
      [
        2013,
        9.177999999999999
      ],
      [
        2014,
        10.839
      ],
      [
        2015,
        -1.5919999999999999
      ],
      [
        2016,
        -5.31
      ],
      [
        2017,
        18.548
      ],
      [
        2018,
        -2.7880000000000003
      ],
      [
        2019,
        13.446
      ],
      [
        2020,
        7.107
      ],
      [
        2021,
        7.188
      ],
      [
        2022,
        68.396
      ],
      [
        2023,
        9.073
      ],
      [
        2024,
        11.225
      ]
    ],
    "volume_import_biens": [
      [
        1980,
        -0.8
      ],
      [
        1981,
        -22.4
      ],
      [
        1982,
        9.6
      ],
      [
        1983,
        -24.4
      ],
      [
        1984,
        -23.1
      ],
      [
        1985,
        27.0
      ],
      [
        1986,
        -24.6
      ],
      [
        1987,
        13.7
      ],
      [
        1988,
        -9.8
      ],
      [
        1989,
        -3.3
      ],
      [
        1990,
        -18.9
      ],
      [
        1991,
        -14.4
      ],
      [
        1992,
        -4.7
      ],
      [
        1993,
        1.3869999999999998
      ],
      [
        1994,
        9.317
      ],
      [
        1995,
        -9.8
      ],
      [
        1996,
        14.690999999999999
      ],
      [
        1997,
        -5.656000000000001
      ],
      [
        1998,
        35.301
      ],
      [
        1999,
        -8.3
      ],
      [
        2000,
        7.902
      ],
      [
        2001,
        3.687
      ],
      [
        2002,
        0.958
      ],
      [
        2003,
        17.183
      ],
      [
        2004,
        1.089
      ],
      [
        2005,
        20.869
      ],
      [
        2006,
        -3.362
      ],
      [
        2007,
        8.617
      ],
      [
        2008,
        25.435
      ],
      [
        2009,
        51.339
      ],
      [
        2010,
        20.241
      ],
      [
        2011,
        -11.15
      ],
      [
        2012,
        -2.815
      ],
      [
        2013,
        1.399
      ],
      [
        2014,
        5.285
      ],
      [
        2015,
        7.468
      ],
      [
        2016,
        -14.298
      ],
      [
        2017,
        7.331
      ],
      [
        2018,
        12.49
      ],
      [
        2019,
        13.718
      ],
      [
        2020,
        14.911
      ],
      [
        2021,
        -7.483
      ],
      [
        2022,
        3.4730000000000003
      ],
      [
        2023,
        0.35700000000000004
      ],
      [
        2024,
        6.166
      ]
    ],
    "volume_import_bs": [
      [
        1980,
        6.615
      ],
      [
        1981,
        -6.143
      ],
      [
        1982,
        16.617
      ],
      [
        1983,
        -21.712
      ],
      [
        1984,
        -23.230999999999998
      ],
      [
        1985,
        19.021
      ],
      [
        1986,
        -29.919
      ],
      [
        1987,
        22.753
      ],
      [
        1988,
        -9.967
      ],
      [
        1989,
        -2.778
      ],
      [
        1990,
        -6.571000000000001
      ],
      [
        1991,
        -11.164000000000001
      ],
      [
        1992,
        -10.970999999999998
      ],
      [
        1993,
        2.932
      ],
      [
        1994,
        54.476000000000006
      ],
      [
        1995,
        -37.1
      ],
      [
        1996,
        9.626
      ],
      [
        1997,
        -2.517
      ],
      [
        1998,
        24.337
      ],
      [
        1999,
        -5.794
      ],
      [
        2000,
        5.999
      ],
      [
        2001,
        6.962000000000001
      ],
      [
        2002,
        2.036
      ],
      [
        2003,
        12.118
      ],
      [
        2004,
        4.493
      ],
      [
        2005,
        14.35
      ],
      [
        2006,
        1.2690000000000001
      ],
      [
        2007,
        6.608
      ],
      [
        2008,
        33.663000000000004
      ],
      [
        2009,
        42.206
      ],
      [
        2010,
        12.15
      ],
      [
        2011,
        2.5610000000000004
      ],
      [
        2012,
        -3.822
      ],
      [
        2013,
        -5.101
      ],
      [
        2014,
        1.962
      ],
      [
        2015,
        7.797000000000001
      ],
      [
        2016,
        -9.43
      ],
      [
        2017,
        10.235
      ],
      [
        2018,
        11.337
      ],
      [
        2019,
        11.934000000000001
      ],
      [
        2020,
        12.328
      ],
      [
        2021,
        -0.684
      ],
      [
        2022,
        4.686
      ],
      [
        2023,
        3.485
      ],
      [
        2024,
        6.2
      ]
    ],
    "vuln_clim_ferdi": [
      [
        2018,
        64.69396869963231
      ]
    ],
    "vuln_clim_ndgain": [
      [
        1995,
        0.7123250541731491
      ],
      [
        1996,
        0.709073815163205
      ],
      [
        1997,
        0.712227533012682
      ],
      [
        1998,
        0.7134975289370409
      ],
      [
        1999,
        0.7106461037243199
      ],
      [
        2000,
        0.7082768743196508
      ],
      [
        2001,
        0.694739268275169
      ],
      [
        2002,
        0.6903380910564899
      ],
      [
        2003,
        0.6876334775893471
      ],
      [
        2004,
        0.685516777591949
      ],
      [
        2005,
        0.7005030088434928
      ],
      [
        2006,
        0.6967345039367809
      ],
      [
        2007,
        0.694741017671291
      ],
      [
        2008,
        0.6828742343618481
      ],
      [
        2009,
        0.6806950886282939
      ],
      [
        2010,
        0.678273902258607
      ],
      [
        2011,
        0.6713277627429061
      ],
      [
        2012,
        0.672033181759474
      ],
      [
        2013,
        0.6754135302991259
      ],
      [
        2014,
        0.6817639820641379
      ],
      [
        2015,
        0.680429089696748
      ],
      [
        2016,
        0.679692823888777
      ]
    ]
  }
}