Year,DR_AFA,DR_AFC,DR_AFE,DR_AFN,DR_GOG,DR_GSA,DR_OCI
1960,75.56263411941913,79.34762602441432,93.04962626505156,65.7830049717372,84.17440939843233,90.03606848798361,86.48364276599933
1961,75.28910802084877,78.97796507019216,92.8238183690866,65.1737381741391,83.79192932655964,89.7509186104118,86.08160320539403
1962,75.02541420095963,78.59987984454189,92.5889728689051,64.56372350298295,83.3970922585183,89.45752467698638,85.67099514468894
1963,74.72700719331738,78.21570095342439,92.33999805332424,63.94513717383984,82.98914911864267,89.12813737429295,85.25281077470859
1964,74.38813830804341,77.82470550294799,92.08266342715649,63.31715747383746,82.56922767253921,88.77158244050678,84.82949438336696
1965,74.0287368459519,77.42737325883934,91.81871019631117,62.63291012889975,82.14023520757127,88.3806057967561,84.40379333464077
1966,73.65229750239696,77.02247577129002,91.54388778335915,61.99145803401213,81.74920811994828,87.9741899820589,83.97964683682207
1967,73.25885394828072,76.61111964721975,91.25972127662054,61.525389927113764,81.35145191383458,87.53723647278045,83.61655135401264
1968,72.85437466769997,76.18988294332539,90.96601542673663,61.051597084351556,80.94422400259398,87.08257682732611,83.25006106279015
1969,72.44981533684837,75.76410170149282,90.65517959729695,60.57281447340455,80.52658562352056,86.61100163333816,82.88286405325199
1970,72.11124570618672,75.33196211845623,90.33827441631672,60.08844656121708,80.11796416941492,86.1202616823749,82.51143191925017
1971,71.78031201152504,74.77669734904164,90.00891982363245,59.59974137756333,79.65487653512301,85.61707671220947,82.0764367000338
1972,71.43389858180011,74.20646609734068,89.66631464967084,59.07927270972001,79.18010971002361,85.09323266646514,81.63231482722549
1973,71.08715575964209,73.62353817761445,89.32033935038062,58.555046583511626,78.6981138859115,84.56071973509883,81.2854857647669
1974,70.73525055210054,73.02299968394398,88.99463415692622,58.075792890618196,78.20847642162143,84.01970043605374,80.92682430151919
1975,70.38437153256935,72.40487300340193,88.63976385237453,57.60189851701061,77.71606736804355,83.46466843559651,80.55908548835427
1976,70.02954023486991,71.8304559087219,88.25615824080356,57.14208612201758,77.19349858066668,82.86962105045508,80.22589724841004
1977,69.6804512344646,71.39766190920386,87.84342174989688,56.72864004310546,76.66422113619835,82.28625179532523,79.88332734555581
1978,69.33235819540538,70.95988574060702,87.41333307797049,56.289479697501335,76.12407050356425,81.7320940238148,79.54128036582574
1979,68.96881592941261,70.51599126833597,87.05944746187994,55.84706760929171,75.66549890668104,81.30120428047252,79.19422061514072
1980,68.57458901404198,70.0654353784463,86.79547518022885,55.40124065502572,75.21176280298012,80.83733400768128,78.84045779904795
1981,68.13623047566941,69.60845277845631,86.55534115668107,54.95387257705324,74.58481728668482,80.35025977343275,78.48055441726056
1982,67.66352362119301,69.16081582401053,86.33199237931365,54.503801802973946,73.94187232242318,79.84689213929582,78.11324905856411
1983,67.15903933688969,68.70833524446253,86.07229900222663,54.05390079342078,73.29908913152444,79.32629473615296,77.73770714069096
1984,66.64239033291315,68.24570063923692,85.73872340022726,53.600562000049806,72.63943414381109,78.78711468938937,77.30567092201494
1985,66.07734637614928,67.69458357624232,85.38568753277077,53.17791460472711,71.92777834530244,78.23405465256653,76.86611974650673
1986,65.41428117463401,67.15048525515903,85.01797961323304,52.761319744166435,71.21305329991594,77.72913685642254,76.41750010845733
1987,64.74573698461647,66.6221557456817,84.63772994974899,52.39839948302208,70.49490480111061,77.27677856536448,75.96133956560138
1988,64.06457441897285,66.1464733395617,84.2410166315373,52.07988922487756,69.76709250210861,76.87048669849094,75.4935598195629
1989,63.361255696821324,65.68368723731471,83.8536797026874,51.76360447099447,69.02541196192885,76.58984637367108,75.01716284462785
1990,62.623889401565904,65.23159428871797,83.42903658180795,51.44662388883469,68.2748232234224,76.30990026514937,74.5267396585054
1991,62.02394366534408,64.78595701217557,82.98498776317433,51.1284702554896,67.75256478298576,76.04311521792046,74.05944978405319
1992,61.442345346695944,64.34358349239608,82.49908221856828,50.80925867347231,67.30770855731271,75.79305514526538,73.59318243856163
1993,60.885776650131916,63.9021998954833,82.03706875159818,50.49238838456181,66.86311112410363,75.5641680122768,73.12054749324545
1994,60.334718650567815,63.45709829338722,81.71998944347352,50.185120017232606,66.40849556727909,75.36190817572646,72.90000693356755
1995,59.83852559013725,62.99469506958211,81.42816075713704,49.97316734205248,65.94569639177402,75.1636917449167,72.70254820278493
1996,59.35798829009318,62.518383051295736,81.1475519910532,49.7822065972077,65.47643454226768,74.96912193989209,72.5042695014758
1997,58.89274051712969,62.03000767893715,80.88488267495161,49.546979359392914,64.9635183339611,74.74089436253595,72.3053742369718
1998,58.486139917239946,61.53415755429993,80.63017271913448,49.2836551030136,64.4482517754551,74.47176693186024,72.10426117415537
1999,58.109115905301884,61.03712415178137,80.3688701295323,49.01498159305199,63.929497645153845,74.1656186004843,71.90018414463368
2000,57.73511856747564,60.54303683410158,80.09610899507388,48.74822451842824,63.41090781431854,73.8537724944987,71.6934660985665
2001,57.30280562508567,60.054400462132186,79.81519135324218,48.485446982850775,62.709983779065126,73.50996292916409,71.48236272239146
2002,56.82436651148831,59.56738539830271,79.52597104889723,48.22507603825469,62.00185229072281,73.16106989067676,71.26792867344754
2003,56.387366258125894,59.080865119996275,79.21734220678064,47.966670983465036,61.28437558081327,72.7826854127096,71.05109409700479
2004,55.955755768979714,58.59196673511196,78.90440942500173,47.70955416986841,60.56078412774048,72.38173183830551,70.83100655469048
2005,55.524612477860614,58.095997846274855,78.59055120140528,47.417117352096646,59.83021290176107,71.97641191577732,70.31221476472534
2006,55.152979917594685,57.5910111759293,78.27456880656786,47.114357662072045,59.09162228492851,71.56376688934866,69.78347229701595
2007,54.76810424437168,57.077840324081116,78.09931573923981,46.83081057151311,58.346992482594615,71.17786504300936,69.24555876830863
2008,54.33487638958394,56.55817990337661,77.68486585032484,46.561068895189074,57.596686506217296,70.81393071782652,68.69679429172349
2009,53.897474009328754,56.031563544657615,77.26566086482386,46.29944235230009,56.84429836778214,70.44912341291578,68.14153964732148
2010,53.45748317800082,55.49933076320863,76.83328707445152,46.04784665288303,56.08728167296954,70.08171538033493,67.57798124104124
2011,53.01619478310048,54.96035879373812,76.38805764623186,45.80749071211897,55.33325208680794,69.71475591925471,67.00710753386882
2012,52.5824208101436,54.41590177716281,76.11279833031135,45.59438065571847,54.582540807278505,69.34610170733588,66.42898671695046
2013,52.14939947152295,53.876527999577775,75.69650234831617,45.388191286540014,53.83728703500941,68.97567008657347,65.84432216408312
2014,51.71286792647376,53.33313947326253,75.26847999250947,45.18476596884863,53.097380497882405,68.59919536730685,65.25239899664011
2015,51.27427717946586,52.787040281276894,74.8288729933189,44.98089914314912,52.36180754048699,68.21455135608339,64.65505172983362
2016,50.83389552287136,52.238420595865634,74.37803228582112,44.77468208787151,51.632765842050404,67.82214042657391,64.05040280273948
2017,50.39218661456678,51.68814622693193,73.91617880028936,44.55549180028761,50.90880621584302,67.42202964799718,63.439554966799626
2018,49.95005856301705,51.13454696571349,73.44242848930185,44.32448436596791,50.19097945904189,67.01566130521313,62.822665608416
2019,,,,,,,
