{
  "country": "ZMB",
  "country_name": "Zambie",
  "indicators": {
    "abo_mobile": [
      [
        1960,
        0.0
      ],
      [
        1961,
        "NA"
      ],
      [
        1962,
        "NA"
      ],
      [
        1963,
        "NA"
      ],
      [
        1964,
        "NA"
      ],
      [
        1965,
        0.0
      ],
      [
        1966,
        "NA"
      ],
      [
        1967,
        "NA"
      ],
      [
        1968,
        "NA"
      ],
      [
        1969,
        "NA"
      ],
      [
        1970,
        0.0
      ],
      [
        1971,
        "NA"
      ],
      [
        1972,
        "NA"
      ],
      [
        1973,
        "NA"
      ],
      [
        1974,
        "NA"
      ],
      [
        1975,
        0.0
      ],
      [
        1976,
        0.0
      ],
      [
        1977,
        0.0
      ],
      [
        1978,
        0.0
      ],
      [
        1979,
        0.0
      ],
      [
        1980,
        0.0
      ],
      [
        1981,
        0.0
      ],
      [
        1982,
        0.0
      ],
      [
        1983,
        0.0
      ],
      [
        1984,
        0.0
      ],
      [
        1985,
        0.0
      ],
      [
        1986,
        0.0
      ],
      [
        1987,
        0.0
      ],
      [
        1988,
        0.0
      ],
      [
        1989,
        0.0
      ],
      [
        1990,
        0.0
      ],
      [
        1991,
        0.0
      ],
      [
        1992,
        0.0
      ],
      [
        1993,
        0.0
      ],
      [
        1994,
        0.0
      ],
      [
        1995,
        0.001547
      ],
      [
        1996,
        0.002721
      ],
      [
        1997,
        0.00455
      ],
      [
        1998,
        0.00826
      ],
      [
        1999,
        0.028189999999999996
      ],
      [
        2000,
        0.098853
      ],
      [
        2001,
        0.1212
      ],
      [
        2002,
        0.139092
      ],
      [
        2003,
        0.24100000000000002
      ],
      [
        2004,
        0.464354
      ],
      [
        2005,
        0.949559
      ],
      [
        2006,
        1.663328
      ],
      [
        2007,
        2.639026
      ],
      [
        2008,
        3.5390029999999997
      ],
      [
        2009,
        4.406682
      ],
      [
        2010,
        5.446991000000001
      ],
      [
        2011,
        8.164553
      ],
      [
        2012,
        10.524676
      ],
      [
        2013,
        10.395800999999999
      ],
      [
        2014,
        10.114867
      ],
      [
        2015,
        11.557725
      ],
      [
        2016,
        12.017033999999999
      ],
      [
        2017,
        13.438539000000002
      ],
      [
        2018,
        15.470270000000001
      ],
      [
        2019,
        "NA"
      ]
    ],
    "acces_elec": [
      [
        1960,
        "NA"
      ],
      [
        1961,
        "NA"
      ],
      [
        1962,
        "NA"
      ],
      [
        1963,
        "NA"
      ],
      [
        1964,
        "NA"
      ],
      [
        1965,
        "NA"
      ],
      [
        1966,
        "NA"
      ],
      [
        1967,
        "NA"
      ],
      [
        1968,
        "NA"
      ],
      [
        1969,
        "NA"
      ],
      [
        1970,
        "NA"
      ],
      [
        1971,
        "NA"
      ],
      [
        1972,
        "NA"
      ],
      [
        1973,
        "NA"
      ],
      [
        1974,
        "NA"
      ],
      [
        1975,
        "NA"
      ],
      [
        1976,
        "NA"
      ],
      [
        1977,
        "NA"
      ],
      [
        1978,
        "NA"
      ],
      [
        1979,
        "NA"
      ],
      [
        1980,
        "NA"
      ],
      [
        1981,
        "NA"
      ],
      [
        1982,
        "NA"
      ],
      [
        1983,
        "NA"
      ],
      [
        1984,
        "NA"
      ],
      [
        1985,
        "NA"
      ],
      [
        1986,
        "NA"
      ],
      [
        1987,
        "NA"
      ],
      [
        1988,
        "NA"
      ],
      [
        1989,
        "NA"
      ],
      [
        1990,
        13.9
      ],
      [
        1991,
        12.788977623
      ],
      [
        1992,
        19.2
      ],
      [
        1993,
        14.2156095505
      ],
      [
        1994,
        14.9304227829
      ],
      [
        1995,
        15.6470327377
      ],
      [
        1996,
        17.3
      ],
      [
        1997,
        17.088035583499998
      ],
      [
        1998,
        19.0
      ],
      [
        1999,
        18.5366516113
      ],
      [
        2000,
        16.7
      ],
      [
        2001,
        19.9638824463
      ],
      [
        2002,
        17.4
      ],
      [
        2003,
        18.5
      ],
      [
        2004,
        20.3
      ],
      [
        2005,
        22.6138439178
      ],
      [
        2006,
        23.225162506100002
      ],
      [
        2007,
        18.5
      ],
      [
        2008,
        24.445810318000003
      ],
      [
        2009,
        25.078306198099998
      ],
      [
        2010,
        22.0
      ],
      [
        2011,
        26.4455680847
      ],
      [
        2012,
        27.200088501
      ],
      [
        2013,
        28.0149288177
      ],
      [
        2014,
        27.9
      ],
      [
        2015,
        31.1
      ],
      [
        2016,
        35.3073387146
      ],
      [
        2017,
        40.3
      ],
      [
        2018,
        39.8126220703
      ],
      [
        2019,
        "NA"
      ]
    ],
    "acces_elec_primaire": [
      [
        2000,
        "NA"
      ],
      [
        2001,
        "NA"
      ],
      [
        2002,
        "NA"
      ],
      [
        2003,
        "NA"
      ],
      [
        2004,
        "NA"
      ],
      [
        2005,
        "NA"
      ],
      [
        2006,
        "NA"
      ],
      [
        2007,
        "NA"
      ],
      [
        2008,
        "NA"
      ],
      [
        2009,
        "NA"
      ],
      [
        2010,
        "NA"
      ],
      [
        2011,
        "NA"
      ],
      [
        2012,
        "NA"
      ],
      [
        2013,
        "NA"
      ],
      [
        2014,
        "NA"
      ],
      [
        2015,
        "NA"
      ],
      [
        2016,
        32.36994
      ],
      [
        2017,
        36.40167
      ],
      [
        2018,
        "NA"
      ],
      [
        2019,
        "NA"
      ]
    ],
    "alpha_adulte": [
      [
        1960,
        "NA"
      ],
      [
        1961,
        "NA"
      ],
      [
        1962,
        "NA"
      ],
      [
        1963,
        "NA"
      ],
      [
        1964,
        "NA"
      ],
      [
        1965,
        "NA"
      ],
      [
        1966,
        "NA"
      ],
      [
        1967,
        "NA"
      ],
      [
        1968,
        "NA"
      ],
      [
        1969,
        "NA"
      ],
      [
        1970,
        "NA"
      ],
      [
        1971,
        "NA"
      ],
      [
        1972,
        "NA"
      ],
      [
        1973,
        "NA"
      ],
      [
        1974,
        "NA"
      ],
      [
        1975,
        "NA"
      ],
      [
        1976,
        "NA"
      ],
      [
        1977,
        "NA"
      ],
      [
        1978,
        "NA"
      ],
      [
        1979,
        "NA"
      ],
      [
        1980,
        "NA"
      ],
      [
        1981,
        "NA"
      ],
      [
        1982,
        "NA"
      ],
      [
        1983,
        "NA"
      ],
      [
        1984,
        "NA"
      ],
      [
        1985,
        "NA"
      ],
      [
        1986,
        "NA"
      ],
      [
        1987,
        "NA"
      ],
      [
        1988,
        "NA"
      ],
      [
        1989,
        "NA"
      ],
      [
        1990,
        64.99826
      ],
      [
        1991,
        "NA"
      ],
      [
        1992,
        "NA"
      ],
      [
        1993,
        "NA"
      ],
      [
        1994,
        "NA"
      ],
      [
        1995,
        "NA"
      ],
      [
        1996,
        "NA"
      ],
      [
        1997,
        "NA"
      ],
      [
        1998,
        "NA"
      ],
      [
        1999,
        68.00179
      ],
      [
        2000,
        "NA"
      ],
      [
        2001,
        "NA"
      ],
      [
        2002,
        69.14922
      ],
      [
        2003,
        "NA"
      ],
      [
        2004,
        "NA"
      ],
      [
        2005,
        "NA"
      ],
      [
        2006,
        "NA"
      ],
      [
        2007,
        61.428290000000004
      ],
      [
        2008,
        "NA"
      ],
      [
        2009,
        "NA"
      ],
      [
        2010,
        83.00766999999999
      ],
      [
        2011,
        "NA"
      ],
      [
        2012,
        "NA"
      ],
      [
        2013,
        "NA"
      ],
      [
        2014,
        "NA"
      ],
      [
        2015,
        "NA"
      ],
      [
        2016,
        "NA"
      ],
      [
        2017,
        "NA"
      ],
      [
        2018,
        86.74795999999999
      ],
      [
        2019,
        "NA"
      ]
    ],
    "alpha_jeune": [
      [
        1960,
        "NA"
      ],
      [
        1961,
        "NA"
      ],
      [
        1962,
        "NA"
      ],
      [
        1963,
        "NA"
      ],
      [
        1964,
        "NA"
      ],
      [
        1965,
        "NA"
      ],
      [
        1966,
        "NA"
      ],
      [
        1967,
        "NA"
      ],
      [
        1968,
        "NA"
      ],
      [
        1969,
        "NA"
      ],
      [
        1970,
        "NA"
      ],
      [
        1971,
        "NA"
      ],
      [
        1972,
        "NA"
      ],
      [
        1973,
        "NA"
      ],
      [
        1974,
        "NA"
      ],
      [
        1975,
        "NA"
      ],
      [
        1976,
        "NA"
      ],
      [
        1977,
        "NA"
      ],
      [
        1978,
        "NA"
      ],
      [
        1979,
        "NA"
      ],
      [
        1980,
        "NA"
      ],
      [
        1981,
        "NA"
      ],
      [
        1982,
        "NA"
      ],
      [
        1983,
        "NA"
      ],
      [
        1984,
        "NA"
      ],
      [
        1985,
        "NA"
      ],
      [
        1986,
        "NA"
      ],
      [
        1987,
        "NA"
      ],
      [
        1988,
        "NA"
      ],
      [
        1989,
        "NA"
      ],
      [
        1990,
        66.38116
      ],
      [
        1991,
        "NA"
      ],
      [
        1992,
        "NA"
      ],
      [
        1993,
        "NA"
      ],
      [
        1994,
        "NA"
      ],
      [
        1995,
        "NA"
      ],
      [
        1996,
        "NA"
      ],
      [
        1997,
        "NA"
      ],
      [
        1998,
        "NA"
      ],
      [
        1999,
        69.45721999999999
      ],
      [
        2000,
        "NA"
      ],
      [
        2001,
        "NA"
      ],
      [
        2002,
        69.08881
      ],
      [
        2003,
        "NA"
      ],
      [
        2004,
        "NA"
      ],
      [
        2005,
        "NA"
      ],
      [
        2006,
        "NA"
      ],
      [
        2007,
        64.04964
      ],
      [
        2008,
        "NA"
      ],
      [
        2009,
        "NA"
      ],
      [
        2010,
        88.71455999999999
      ],
      [
        2011,
        "NA"
      ],
      [
        2012,
        "NA"
      ],
      [
        2013,
        "NA"
      ],
      [
        2014,
        "NA"
      ],
      [
        2015,
        "NA"
      ],
      [
        2016,
        "NA"
      ],
      [
        2017,
        "NA"
      ],
      [
        2018,
        92.09156999999999
      ],
      [
        2019,
        "NA"
      ]
    ],
    "bidonvilles": [
      [
        1960,
        "NA"
      ],
      [
        1961,
        "NA"
      ],
      [
        1962,
        "NA"
      ],
      [
        1963,
        "NA"
      ],
      [
        1964,
        "NA"
      ],
      [
        1965,
        "NA"
      ],
      [
        1966,
        "NA"
      ],
      [
        1967,
        "NA"
      ],
      [
        1968,
        "NA"
      ],
      [
        1969,
        "NA"
      ],
      [
        1970,
        "NA"
      ],
      [
        1971,
        "NA"
      ],
      [
        1972,
        "NA"
      ],
      [
        1973,
        "NA"
      ],
      [
        1974,
        "NA"
      ],
      [
        1975,
        "NA"
      ],
      [
        1976,
        "NA"
      ],
      [
        1977,
        "NA"
      ],
      [
        1978,
        "NA"
      ],
      [
        1979,
        "NA"
      ],
      [
        1980,
        "NA"
      ],
      [
        1981,
        "NA"
      ],
      [
        1982,
        "NA"
      ],
      [
        1983,
        "NA"
      ],
      [
        1984,
        "NA"
      ],
      [
        1985,
        "NA"
      ],
      [
        1986,
        "NA"
      ],
      [
        1987,
        "NA"
      ],
      [
        1988,
        "NA"
      ],
      [
        1989,
        "NA"
      ],
      [
        1990,
        57.0
      ],
      [
        1991,
        "NA"
      ],
      [
        1992,
        "NA"
      ],
      [
        1993,
        "NA"
      ],
      [
        1994,
        "NA"
      ],
      [
        1995,
        57.1
      ],
      [
        1996,
        "NA"
      ],
      [
        1997,
        "NA"
      ],
      [
        1998,
        "NA"
      ],
      [
        1999,
        "NA"
      ],
      [
        2000,
        57.2
      ],
      [
        2001,
        "NA"
      ],
      [
        2002,
        "NA"
      ],
      [
        2003,
        "NA"
      ],
      [
        2004,
        "NA"
      ],
      [
        2005,
        57.2
      ],
      [
        2006,
        "NA"
      ],
      [
        2007,
        57.3
      ],
      [
        2008,
        "NA"
      ],
      [
        2009,
        57.3
      ],
      [
        2010,
        "NA"
      ],
      [
        2011,
        "NA"
      ],
      [
        2012,
        "NA"
      ],
      [
        2013,
        "NA"
      ],
      [
        2014,
        54.0
      ],
      [
        2015,
        "NA"
      ],
      [
        2016,
        "NA"
      ],
      [
        2017,
        "NA"
      ],
      [
        2018,
        "NA"
      ],
      [
        2019,
        "NA"
      ]
    ],
    "compte_adulte": [
      [
        1960,
        "NA"
      ],
      [
        1961,
        "NA"
      ],
      [
        1962,
        "NA"
      ],
      [
        1963,
        "NA"
      ],
      [
        1964,
        "NA"
      ],
      [
        1965,
        "NA"
      ],
      [
        1966,
        "NA"
      ],
      [
        1967,
        "NA"
      ],
      [
        1968,
        "NA"
      ],
      [
        1969,
        "NA"
      ],
      [
        1970,
        "NA"
      ],
      [
        1971,
        "NA"
      ],
      [
        1972,
        "NA"
      ],
      [
        1973,
        "NA"
      ],
      [
        1974,
        "NA"
      ],
      [
        1975,
        "NA"
      ],
      [
        1976,
        "NA"
      ],
      [
        1977,
        "NA"
      ],
      [
        1978,
        "NA"
      ],
      [
        1979,
        "NA"
      ],
      [
        1980,
        "NA"
      ],
      [
        1981,
        "NA"
      ],
      [
        1982,
        "NA"
      ],
      [
        1983,
        "NA"
      ],
      [
        1984,
        "NA"
      ],
      [
        1985,
        "NA"
      ],
      [
        1986,
        "NA"
      ],
      [
        1987,
        "NA"
      ],
      [
        1988,
        "NA"
      ],
      [
        1989,
        "NA"
      ],
      [
        1990,
        "NA"
      ],
      [
        1991,
        "NA"
      ],
      [
        1992,
        "NA"
      ],
      [
        1993,
        "NA"
      ],
      [
        1994,
        "NA"
      ],
      [
        1995,
        "NA"
      ],
      [
        1996,
        "NA"
      ],
      [
        1997,
        "NA"
      ],
      [
        1998,
        "NA"
      ],
      [
        1999,
        "NA"
      ],
      [
        2000,
        "NA"
      ],
      [
        2001,
        "NA"
      ],
      [
        2002,
        "NA"
      ],
      [
        2003,
        "NA"
      ],
      [
        2004,
        "NA"
      ],
      [
        2005,
        "NA"
      ],
      [
        2006,
        "NA"
      ],
      [
        2007,
        "NA"
      ],
      [
        2008,
        "NA"
      ],
      [
        2009,
        "NA"
      ],
      [
        2010,
        "NA"
      ],
      [
        2011,
        25.7962741852
      ],
      [
        2012,
        "NA"
      ],
      [
        2013,
        "NA"
      ],
      [
        2014,
        39.5479164124
      ],
      [
        2015,
        "NA"
      ],
      [
        2016,
        "NA"
      ],
      [
        2017,
        48.3381385803
      ],
      [
        2018,
        "NA"
      ],
      [
        2019,
        "NA"
      ]
    ],
    "compte_jeune": [
      [
        1960,
        "NA"
      ],
      [
        1961,
        "NA"
      ],
      [
        1962,
        "NA"
      ],
      [
        1963,
        "NA"
      ],
      [
        1964,
        "NA"
      ],
      [
        1965,
        "NA"
      ],
      [
        1966,
        "NA"
      ],
      [
        1967,
        "NA"
      ],
      [
        1968,
        "NA"
      ],
      [
        1969,
        "NA"
      ],
      [
        1970,
        "NA"
      ],
      [
        1971,
        "NA"
      ],
      [
        1972,
        "NA"
      ],
      [
        1973,
        "NA"
      ],
      [
        1974,
        "NA"
      ],
      [
        1975,
        "NA"
      ],
      [
        1976,
        "NA"
      ],
      [
        1977,
        "NA"
      ],
      [
        1978,
        "NA"
      ],
      [
        1979,
        "NA"
      ],
      [
        1980,
        "NA"
      ],
      [
        1981,
        "NA"
      ],
      [
        1982,
        "NA"
      ],
      [
        1983,
        "NA"
      ],
      [
        1984,
        "NA"
      ],
      [
        1985,
        "NA"
      ],
      [
        1986,
        "NA"
      ],
      [
        1987,
        "NA"
      ],
      [
        1988,
        "NA"
      ],
      [
        1989,
        "NA"
      ],
      [
        1990,
        "NA"
      ],
      [
        1991,
        "NA"
      ],
      [
        1992,
        "NA"
      ],
      [
        1993,
        "NA"
      ],
      [
        1994,
        "NA"
      ],
      [
        1995,
        "NA"
      ],
      [
        1996,
        "NA"
      ],
      [
        1997,
        "NA"
      ],
      [
        1998,
        "NA"
      ],
      [
        1999,
        "NA"
      ],
      [
        2000,
        "NA"
      ],
      [
        2001,
        "NA"
      ],
      [
        2002,
        "NA"
      ],
      [
        2003,
        "NA"
      ],
      [
        2004,
        "NA"
      ],
      [
        2005,
        "NA"
      ],
      [
        2006,
        "NA"
      ],
      [
        2007,
        "NA"
      ],
      [
        2008,
        "NA"
      ],
      [
        2009,
        "NA"
      ],
      [
        2010,
        "NA"
      ],
      [
        2011,
        12.8176298141
      ],
      [
        2012,
        "NA"
      ],
      [
        2013,
        "NA"
      ],
      [
        2014,
        28.843360900900002
      ],
      [
        2015,
        "NA"
      ],
      [
        2016,
        "NA"
      ],
      [
        2017,
        41.542633056599996
      ],
      [
        2018,
        "NA"
      ],
      [
        2019,
        "NA"
      ]
    ],
    "croissance_pib": [
      [
        1960,
        "NA"
      ],
      [
        1961,
        1.3613819915
      ],
      [
        1962,
        -2.4908394745
      ],
      [
        1963,
        3.2723928926999997
      ],
      [
        1964,
        12.2140480179
      ],
      [
        1965,
        16.6474559632
      ],
      [
        1966,
        -5.5703098086
      ],
      [
        1967,
        7.919696512000001
      ],
      [
        1968,
        1.2483299822
      ],
      [
        1969,
        -0.43691582310000004
      ],
      [
        1970,
        4.7971129031999995
      ],
      [
        1971,
        -0.0860395509
      ],
      [
        1972,
        9.2088651423
      ],
      [
        1973,
        -0.9620487564
      ],
      [
        1974,
        6.4281585489
      ],
      [
        1975,
        -2.2693289242
      ],
      [
        1976,
        6.2209752671
      ],
      [
        1977,
        -4.5642361744
      ],
      [
        1978,
        0.5537638442
      ],
      [
        1979,
        -3.0239310312
      ],
      [
        1980,
        3.0356223506999997
      ],
      [
        1981,
        6.167957406499999
      ],
      [
        1982,
        -2.8127826287
      ],
      [
        1983,
        -1.9666892975999999
      ],
      [
        1984,
        -0.3368348993
      ],
      [
        1985,
        1.6153103675999998
      ],
      [
        1986,
        0.7238939559
      ],
      [
        1987,
        2.6756617134000003
      ],
      [
        1988,
        6.280749009
      ],
      [
        1989,
        -1.0235017887
      ],
      [
        1990,
        -0.4810720278
      ],
      [
        1991,
        -0.0361333839
      ],
      [
        1992,
        -1.7309221735
      ],
      [
        1993,
        6.797274049099999
      ],
      [
        1994,
        -8.625441952300001
      ],
      [
        1995,
        2.8976688933999997
      ],
      [
        1996,
        6.2185464888999995
      ],
      [
        1997,
        3.8140074972000004
      ],
      [
        1998,
        -0.3857461458
      ],
      [
        1999,
        4.6501897464
      ],
      [
        2000,
        3.8973229434
      ],
      [
        2001,
        5.3168682742
      ],
      [
        2002,
        4.5060142803
      ],
      [
        2003,
        6.9449739822000005
      ],
      [
        2004,
        7.0323951152
      ],
      [
        2005,
        7.235599006599999
      ],
      [
        2006,
        7.9036944448
      ],
      [
        2007,
        8.3524362445
      ],
      [
        2008,
        7.7738958153999995
      ],
      [
        2009,
        9.220348405900001
      ],
      [
        2010,
        10.298205851699999
      ],
      [
        2011,
        5.564624716699999
      ],
      [
        2012,
        7.5976169689
      ],
      [
        2013,
        5.0593763782
      ],
      [
        2014,
        4.6958263727
      ],
      [
        2015,
        2.9198811102
      ],
      [
        2016,
        3.7571778048000004
      ],
      [
        2017,
        3.4031688512000002
      ],
      [
        2018,
        3.7949009167
      ],
      [
        2019,
        "NA"
      ]
    ],
    "eau_douce_agri": [
      [
        1960,
        "NA"
      ],
      [
        1961,
        "NA"
      ],
      [
        1962,
        "NA"
      ],
      [
        1963,
        "NA"
      ],
      [
        1964,
        "NA"
      ],
      [
        1965,
        "NA"
      ],
      [
        1966,
        "NA"
      ],
      [
        1967,
        "NA"
      ],
      [
        1968,
        "NA"
      ],
      [
        1969,
        "NA"
      ],
      [
        1970,
        "NA"
      ],
      [
        1971,
        "NA"
      ],
      [
        1972,
        "NA"
      ],
      [
        1973,
        "NA"
      ],
      [
        1974,
        "NA"
      ],
      [
        1975,
        "NA"
      ],
      [
        1976,
        "NA"
      ],
      [
        1977,
        "NA"
      ],
      [
        1978,
        "NA"
      ],
      [
        1979,
        "NA"
      ],
      [
        1980,
        "NA"
      ],
      [
        1981,
        "NA"
      ],
      [
        1982,
        "NA"
      ],
      [
        1983,
        "NA"
      ],
      [
        1984,
        "NA"
      ],
      [
        1985,
        "NA"
      ],
      [
        1986,
        "NA"
      ],
      [
        1987,
        "NA"
      ],
      [
        1988,
        "NA"
      ],
      [
        1989,
        "NA"
      ],
      [
        1990,
        "NA"
      ],
      [
        1991,
        "NA"
      ],
      [
        1992,
        76.65
      ],
      [
        1993,
        "NA"
      ],
      [
        1994,
        77.26
      ],
      [
        1995,
        "NA"
      ],
      [
        1996,
        "NA"
      ],
      [
        1997,
        "NA"
      ],
      [
        1998,
        "NA"
      ],
      [
        1999,
        "NA"
      ],
      [
        2000,
        "NA"
      ],
      [
        2001,
        "NA"
      ],
      [
        2002,
        73.28
      ],
      [
        2003,
        "NA"
      ],
      [
        2004,
        "NA"
      ],
      [
        2005,
        "NA"
      ],
      [
        2006,
        "NA"
      ],
      [
        2007,
        "NA"
      ],
      [
        2008,
        "NA"
      ],
      [
        2009,
        "NA"
      ],
      [
        2010,
        "NA"
      ],
      [
        2011,
        "NA"
      ],
      [
        2012,
        "NA"
      ],
      [
        2013,
        "NA"
      ],
      [
        2014,
        "NA"
      ],
      [
        2015,
        "NA"
      ],
      [
        2016,
        "NA"
      ],
      [
        2017,
        "NA"
      ],
      [
        2018,
        "NA"
      ],
      [
        2019,
        "NA"
      ]
    ],
    "eau_potable_primaire": [
      [
        2000,
        "NA"
      ],
      [
        2001,
        "NA"
      ],
      [
        2002,
        "NA"
      ],
      [
        2003,
        "NA"
      ],
      [
        2004,
        "NA"
      ],
      [
        2005,
        "NA"
      ],
      [
        2006,
        "NA"
      ],
      [
        2007,
        "NA"
      ],
      [
        2008,
        "NA"
      ],
      [
        2009,
        "NA"
      ],
      [
        2010,
        "NA"
      ],
      [
        2011,
        "NA"
      ],
      [
        2012,
        "NA"
      ],
      [
        2013,
        "NA"
      ],
      [
        2014,
        "NA"
      ],
      [
        2015,
        "NA"
      ],
      [
        2016,
        75.99455999999998
      ],
      [
        2017,
        82.21191999999998
      ],
      [
        2018,
        "NA"
      ],
      [
        2019,
        "NA"
      ]
    ],
    "emploi_agri": [
      [
        1960,
        "NA"
      ],
      [
        1961,
        "NA"
      ],
      [
        1962,
        "NA"
      ],
      [
        1963,
        "NA"
      ],
      [
        1964,
        "NA"
      ],
      [
        1965,
        "NA"
      ],
      [
        1966,
        "NA"
      ],
      [
        1967,
        "NA"
      ],
      [
        1968,
        "NA"
      ],
      [
        1969,
        "NA"
      ],
      [
        1970,
        "NA"
      ],
      [
        1971,
        "NA"
      ],
      [
        1972,
        "NA"
      ],
      [
        1973,
        "NA"
      ],
      [
        1974,
        "NA"
      ],
      [
        1975,
        "NA"
      ],
      [
        1976,
        "NA"
      ],
      [
        1977,
        "NA"
      ],
      [
        1978,
        "NA"
      ],
      [
        1979,
        "NA"
      ],
      [
        1980,
        "NA"
      ],
      [
        1981,
        "NA"
      ],
      [
        1982,
        "NA"
      ],
      [
        1983,
        "NA"
      ],
      [
        1984,
        "NA"
      ],
      [
        1985,
        "NA"
      ],
      [
        1986,
        "NA"
      ],
      [
        1987,
        "NA"
      ],
      [
        1988,
        "NA"
      ],
      [
        1989,
        "NA"
      ],
      [
        1990,
        "NA"
      ],
      [
        1991,
        69.9749984741
      ],
      [
        1992,
        70.02100372310001
      ],
      [
        1993,
        69.8489990234
      ],
      [
        1994,
        70.0899963379
      ],
      [
        1995,
        70.01699829100001
      ],
      [
        1996,
        69.85399627689999
      ],
      [
        1997,
        69.783996582
      ],
      [
        1998,
        69.9700012207
      ],
      [
        1999,
        70.4580001831
      ],
      [
        2000,
        70.9290008545
      ],
      [
        2001,
        71.2740020752
      ],
      [
        2002,
        71.60399627689999
      ],
      [
        2003,
        71.8020019531
      ],
      [
        2004,
        71.9850006104
      ],
      [
        2005,
        72.2630004883
      ],
      [
        2006,
        72.0159988403
      ],
      [
        2007,
        71.7300033569
      ],
      [
        2008,
        71.4329986572
      ],
      [
        2009,
        68.091003418
      ],
      [
        2010,
        64.31199646
      ],
      [
        2011,
        60.430999755900004
      ],
      [
        2012,
        56.028999328599994
      ],
      [
        2013,
        54.2490005493
      ],
      [
        2014,
        52.8019981384
      ],
      [
        2015,
        51.6660003662
      ],
      [
        2016,
        50.7319984436
      ],
      [
        2017,
        49.9729995728
      ],
      [
        2018,
        49.261001586899994
      ],
      [
        2019,
        48.8390007019
      ]
    ],
    "enseignant_primaire": [
      [
        1960,
        "NA"
      ],
      [
        1961,
        "NA"
      ],
      [
        1962,
        "NA"
      ],
      [
        1963,
        "NA"
      ],
      [
        1964,
        "NA"
      ],
      [
        1965,
        "NA"
      ],
      [
        1966,
        "NA"
      ],
      [
        1967,
        "NA"
      ],
      [
        1968,
        "NA"
      ],
      [
        1969,
        "NA"
      ],
      [
        1970,
        "NA"
      ],
      [
        1971,
        "NA"
      ],
      [
        1972,
        "NA"
      ],
      [
        1973,
        "NA"
      ],
      [
        1974,
        "NA"
      ],
      [
        1975,
        "NA"
      ],
      [
        1976,
        "NA"
      ],
      [
        1977,
        "NA"
      ],
      [
        1978,
        "NA"
      ],
      [
        1979,
        "NA"
      ],
      [
        1980,
        "NA"
      ],
      [
        1981,
        "NA"
      ],
      [
        1982,
        "NA"
      ],
      [
        1983,
        "NA"
      ],
      [
        1984,
        "NA"
      ],
      [
        1985,
        "NA"
      ],
      [
        1986,
        "NA"
      ],
      [
        1987,
        "NA"
      ],
      [
        1988,
        "NA"
      ],
      [
        1989,
        "NA"
      ],
      [
        1990,
        "NA"
      ],
      [
        1991,
        "NA"
      ],
      [
        1992,
        "NA"
      ],
      [
        1993,
        "NA"
      ],
      [
        1994,
        "NA"
      ],
      [
        1995,
        "NA"
      ],
      [
        1996,
        "NA"
      ],
      [
        1997,
        "NA"
      ],
      [
        1998,
        89.92539000000001
      ],
      [
        1999,
        94.18157
      ],
      [
        2000,
        "NA"
      ],
      [
        2001,
        "NA"
      ],
      [
        2002,
        "NA"
      ],
      [
        2003,
        "NA"
      ],
      [
        2004,
        "NA"
      ],
      [
        2005,
        "NA"
      ],
      [
        2006,
        "NA"
      ],
      [
        2007,
        "NA"
      ],
      [
        2008,
        "NA"
      ],
      [
        2009,
        "NA"
      ],
      [
        2010,
        "NA"
      ],
      [
        2011,
        "NA"
      ],
      [
        2012,
        92.65586
      ],
      [
        2013,
        "NA"
      ],
      [
        2014,
        "NA"
      ],
      [
        2015,
        "NA"
      ],
      [
        2016,
        "NA"
      ],
      [
        2017,
        98.7503
      ],
      [
        2018,
        "NA"
      ],
      [
        2019,
        "NA"
      ]
    ],
    "enseignant_secondaire": [
      [
        1960,
        "NA"
      ],
      [
        1961,
        "NA"
      ],
      [
        1962,
        "NA"
      ],
      [
        1963,
        "NA"
      ],
      [
        1964,
        "NA"
      ],
      [
        1965,
        "NA"
      ],
      [
        1966,
        "NA"
      ],
      [
        1967,
        "NA"
      ],
      [
        1968,
        "NA"
      ],
      [
        1969,
        "NA"
      ],
      [
        1970,
        "NA"
      ],
      [
        1971,
        "NA"
      ],
      [
        1972,
        "NA"
      ],
      [
        1973,
        "NA"
      ],
      [
        1974,
        "NA"
      ],
      [
        1975,
        "NA"
      ],
      [
        1976,
        "NA"
      ],
      [
        1977,
        "NA"
      ],
      [
        1978,
        "NA"
      ],
      [
        1979,
        "NA"
      ],
      [
        1980,
        "NA"
      ],
      [
        1981,
        "NA"
      ],
      [
        1982,
        "NA"
      ],
      [
        1983,
        "NA"
      ],
      [
        1984,
        "NA"
      ],
      [
        1985,
        "NA"
      ],
      [
        1986,
        "NA"
      ],
      [
        1987,
        "NA"
      ],
      [
        1988,
        "NA"
      ],
      [
        1989,
        "NA"
      ],
      [
        1990,
        "NA"
      ],
      [
        1991,
        "NA"
      ],
      [
        1992,
        "NA"
      ],
      [
        1993,
        "NA"
      ],
      [
        1994,
        "NA"
      ],
      [
        1995,
        "NA"
      ],
      [
        1996,
        "NA"
      ],
      [
        1997,
        "NA"
      ],
      [
        1998,
        "NA"
      ],
      [
        1999,
        "NA"
      ],
      [
        2000,
        "NA"
      ],
      [
        2001,
        "NA"
      ],
      [
        2002,
        "NA"
      ],
      [
        2003,
        "NA"
      ],
      [
        2004,
        "NA"
      ],
      [
        2005,
        "NA"
      ],
      [
        2006,
        "NA"
      ],
      [
        2007,
        "NA"
      ],
      [
        2008,
        "NA"
      ],
      [
        2009,
        "NA"
      ],
      [
        2010,
        "NA"
      ],
      [
        2011,
        "NA"
      ],
      [
        2012,
        "NA"
      ],
      [
        2013,
        "NA"
      ],
      [
        2014,
        "NA"
      ],
      [
        2015,
        "NA"
      ],
      [
        2016,
        "NA"
      ],
      [
        2017,
        "NA"
      ],
      [
        2018,
        "NA"
      ],
      [
        2019,
        "NA"
      ]
    ],
    "frag_pol": [
      [
        2006,
        0.0
      ],
      [
        2007,
        0.0
      ],
      [
        2008,
        0.0
      ],
      [
        2009,
        0.0
      ],
      [
        2010,
        0.0
      ],
      [
        2011,
        0.0
      ],
      [
        2012,
        0.0
      ],
      [
        2013,
        0.0
      ],
      [
        2014,
        0.0
      ],
      [
        2015,
        0.0
      ],
      [
        2016,
        0.0
      ],
      [
        2017,
        0.0
      ]
    ],
    "idh": [
      [
        1990,
        0.401
      ],
      [
        1991,
        0.402
      ],
      [
        1992,
        0.403
      ],
      [
        1993,
        0.409
      ],
      [
        1994,
        0.408
      ],
      [
        1995,
        0.412
      ],
      [
        1996,
        0.416
      ],
      [
        1997,
        0.419
      ],
      [
        1998,
        0.42
      ],
      [
        1999,
        0.426
      ],
      [
        2000,
        0.4320000000000001
      ],
      [
        2001,
        0.44
      ],
      [
        2002,
        0.449
      ],
      [
        2003,
        0.46
      ],
      [
        2004,
        0.469
      ],
      [
        2005,
        0.48
      ],
      [
        2006,
        0.4920000000000001
      ],
      [
        2007,
        0.503
      ],
      [
        2008,
        0.517
      ],
      [
        2009,
        0.5329999999999999
      ],
      [
        2010,
        0.544
      ],
      [
        2011,
        0.556
      ],
      [
        2012,
        0.569
      ],
      [
        2013,
        0.574
      ],
      [
        2014,
        0.58
      ],
      [
        2015,
        0.583
      ],
      [
        2016,
        0.586
      ],
      [
        2017,
        0.588
      ]
    ],
    "lib_monde": [
      [
        2013,
        2.0
      ],
      [
        2014,
        2.0
      ],
      [
        2015,
        2.0
      ],
      [
        2016,
        2.0
      ],
      [
        2017,
        2.0
      ],
      [
        2018,
        2.0
      ]
    ],
    "migration": [
      [
        1955,
        0.0
      ],
      [
        1960,
        0.0
      ],
      [
        1965,
        -2.128
      ],
      [
        1970,
        -1.138
      ],
      [
        1975,
        -0.877
      ],
      [
        1980,
        -0.9259999999999999
      ],
      [
        1985,
        0.313
      ],
      [
        1990,
        -2.005
      ],
      [
        1995,
        -3.502
      ],
      [
        2000,
        0.41
      ],
      [
        2005,
        -2.694
      ],
      [
        2010,
        -2.7489999999999997
      ],
      [
        2015,
        -0.6779999999999999
      ],
      [
        2020,
        -0.467
      ],
      [
        2025,
        -0.40399999999999997
      ],
      [
        2030,
        -0.22
      ],
      [
        2035,
        -0.192
      ],
      [
        2040,
        -0.16899999999999998
      ],
      [
        2045,
        -0.15
      ],
      [
        2050,
        -0.135
      ],
      [
        2055,
        -0.121
      ],
      [
        2060,
        -0.11
      ],
      [
        2065,
        -0.10099999999999999
      ],
      [
        2070,
        -0.09300000000000001
      ],
      [
        2075,
        -0.086
      ],
      [
        2080,
        -0.08
      ],
      [
        2085,
        -0.07400000000000001
      ],
      [
        2090,
        -0.07
      ],
      [
        2095,
        -0.066
      ],
      [
        2100,
        -0.063
      ]
    ],
    "mortal_infant": [
      [
        1960,
        205.6
      ],
      [
        1961,
        201.6
      ],
      [
        1962,
        197.9
      ],
      [
        1963,
        194.7
      ],
      [
        1964,
        192.1
      ],
      [
        1965,
        190.1
      ],
      [
        1966,
        188.7
      ],
      [
        1967,
        187.7
      ],
      [
        1968,
        186.4
      ],
      [
        1969,
        184.2
      ],
      [
        1970,
        180.7
      ],
      [
        1971,
        175.9
      ],
      [
        1972,
        170.3
      ],
      [
        1973,
        164.8
      ],
      [
        1974,
        159.9
      ],
      [
        1975,
        156.2
      ],
      [
        1976,
        154.2
      ],
      [
        1977,
        153.7
      ],
      [
        1978,
        154.5
      ],
      [
        1979,
        155.6
      ],
      [
        1980,
        156.3
      ],
      [
        1981,
        156.9
      ],
      [
        1982,
        158.3
      ],
      [
        1983,
        160.8
      ],
      [
        1984,
        164.4
      ],
      [
        1985,
        168.8
      ],
      [
        1986,
        173.6
      ],
      [
        1987,
        177.9
      ],
      [
        1988,
        181.2
      ],
      [
        1989,
        183.8
      ],
      [
        1990,
        185.8
      ],
      [
        1991,
        186.9
      ],
      [
        1992,
        187.0
      ],
      [
        1993,
        185.7
      ],
      [
        1994,
        183.6
      ],
      [
        1995,
        180.8
      ],
      [
        1996,
        177.9
      ],
      [
        1997,
        175.4
      ],
      [
        1998,
        172.9
      ],
      [
        1999,
        169.0
      ],
      [
        2000,
        162.4
      ],
      [
        2001,
        153.1
      ],
      [
        2002,
        142.1
      ],
      [
        2003,
        130.5
      ],
      [
        2004,
        119.2
      ],
      [
        2005,
        109.6
      ],
      [
        2006,
        101.4
      ],
      [
        2007,
        95.4
      ],
      [
        2008,
        90.4
      ],
      [
        2009,
        85.1
      ],
      [
        2010,
        80.3
      ],
      [
        2011,
        77.2
      ],
      [
        2012,
        74.3
      ],
      [
        2013,
        70.7
      ],
      [
        2014,
        66.9
      ],
      [
        2015,
        64.6
      ],
      [
        2016,
        62.0
      ],
      [
        2017,
        59.4
      ],
      [
        2018,
        57.8
      ],
      [
        2019,
        "NA"
      ]
    ],
    "pib": [
      [
        1980,
        4.246
      ],
      [
        1981,
        4.385
      ],
      [
        1982,
        4.232
      ],
      [
        1983,
        3.653
      ],
      [
        1984,
        3.003
      ],
      [
        1985,
        2.8480000000000003
      ],
      [
        1986,
        1.962
      ],
      [
        1987,
        2.431
      ],
      [
        1988,
        4.095
      ],
      [
        1989,
        4.365
      ],
      [
        1990,
        4.085
      ],
      [
        1991,
        3.69
      ],
      [
        1992,
        3.614
      ],
      [
        1993,
        3.549
      ],
      [
        1994,
        3.657
      ],
      [
        1995,
        3.799
      ],
      [
        1996,
        3.5989999999999998
      ],
      [
        1997,
        4.303
      ],
      [
        1998,
        3.5380000000000003
      ],
      [
        1999,
        3.405
      ],
      [
        2000,
        3.6010000000000004
      ],
      [
        2001,
        4.093999999999999
      ],
      [
        2002,
        4.194
      ],
      [
        2003,
        4.902
      ],
      [
        2004,
        6.221
      ],
      [
        2005,
        8.332
      ],
      [
        2006,
        12.757
      ],
      [
        2007,
        14.057
      ],
      [
        2008,
        17.910999999999998
      ],
      [
        2009,
        15.328
      ],
      [
        2010,
        20.265
      ],
      [
        2011,
        23.46
      ],
      [
        2012,
        25.503
      ],
      [
        2013,
        28.046
      ],
      [
        2014,
        27.151
      ],
      [
        2015,
        21.243000000000002
      ],
      [
        2016,
        20.941
      ],
      [
        2017,
        25.868000000000002
      ],
      [
        2018,
        26.72
      ],
      [
        2019,
        23.945999999999998
      ],
      [
        2020,
        23.342
      ],
      [
        2021,
        23.415
      ],
      [
        2022,
        23.636
      ],
      [
        2023,
        23.951
      ],
      [
        2024,
        24.401
      ]
    ],
    "pib_hab": [
      [
        1980,
        718.795
      ],
      [
        1981,
        718.743
      ],
      [
        1982,
        672.013
      ],
      [
        1983,
        562.441
      ],
      [
        1984,
        448.532
      ],
      [
        1985,
        412.851
      ],
      [
        1986,
        276.151
      ],
      [
        1987,
        332.26800000000003
      ],
      [
        1988,
        543.316
      ],
      [
        1989,
        561.832
      ],
      [
        1990,
        509.75199999999995
      ],
      [
        1991,
        446.778
      ],
      [
        1992,
        424.949
      ],
      [
        1993,
        405.587
      ],
      [
        1994,
        405.54400000000004
      ],
      [
        1995,
        410.542
      ],
      [
        1996,
        378.71
      ],
      [
        1997,
        440.70099999999996
      ],
      [
        1998,
        352.62699999999995
      ],
      [
        1999,
        330.283
      ],
      [
        2000,
        340.164
      ],
      [
        2001,
        376.986
      ],
      [
        2002,
        376.468
      ],
      [
        2003,
        429.01
      ],
      [
        2004,
        530.54
      ],
      [
        2005,
        691.785
      ],
      [
        2006,
        1030.282
      ],
      [
        2007,
        1103.452
      ],
      [
        2008,
        1365.692
      ],
      [
        2009,
        1134.758
      ],
      [
        2010,
        1456.162
      ],
      [
        2011,
        1635.505
      ],
      [
        2012,
        1724.711
      ],
      [
        2013,
        1839.537
      ],
      [
        2014,
        1727.026
      ],
      [
        2015,
        1310.354
      ],
      [
        2016,
        1252.698
      ],
      [
        2017,
        1500.646
      ],
      [
        2018,
        1503.401
      ],
      [
        2019,
        1307.029
      ],
      [
        2020,
        1236.192
      ],
      [
        2021,
        1203.473
      ],
      [
        2022,
        1179.288
      ],
      [
        2023,
        1160.265
      ],
      [
        2024,
        1147.79
      ]
    ],
    "pib_ppa": [
      [
        1980,
        8.038
      ],
      [
        1981,
        9.382
      ],
      [
        1982,
        9.671
      ],
      [
        1983,
        9.935
      ],
      [
        1984,
        10.117
      ],
      [
        1985,
        10.565999999999999
      ],
      [
        1986,
        10.960999999999999
      ],
      [
        1987,
        11.4
      ],
      [
        1988,
        12.895999999999999
      ],
      [
        1989,
        12.911
      ],
      [
        1990,
        13.317
      ],
      [
        1991,
        13.675999999999998
      ],
      [
        1992,
        14.275
      ],
      [
        1993,
        14.600999999999999
      ],
      [
        1994,
        12.927999999999999
      ],
      [
        1995,
        13.582
      ],
      [
        1996,
        14.690999999999999
      ],
      [
        1997,
        15.514000000000001
      ],
      [
        1998,
        15.628
      ],
      [
        1999,
        16.590999999999998
      ],
      [
        2000,
        17.623
      ],
      [
        2001,
        18.967
      ],
      [
        2002,
        20.135
      ],
      [
        2003,
        21.934
      ],
      [
        2004,
        24.108
      ],
      [
        2005,
        26.658
      ],
      [
        2006,
        29.635
      ],
      [
        2007,
        32.973
      ],
      [
        2008,
        36.227
      ],
      [
        2009,
        39.869
      ],
      [
        2010,
        44.488
      ],
      [
        2011,
        47.943999999999996
      ],
      [
        2012,
        52.576
      ],
      [
        2013,
        56.20399999999999
      ],
      [
        2014,
        59.934
      ],
      [
        2015,
        62.326
      ],
      [
        2016,
        65.337
      ],
      [
        2017,
        68.914
      ],
      [
        2018,
        73.441
      ],
      [
        2019,
        75.857
      ],
      [
        2020,
        73.66199999999999
      ],
      [
        2021,
        76.862
      ]
    ],
    "pop_pauvrete": [
      [
        1960,
        "NA"
      ],
      [
        1961,
        "NA"
      ],
      [
        1962,
        "NA"
      ],
      [
        1963,
        "NA"
      ],
      [
        1964,
        "NA"
      ],
      [
        1965,
        "NA"
      ],
      [
        1966,
        "NA"
      ],
      [
        1967,
        "NA"
      ],
      [
        1968,
        "NA"
      ],
      [
        1969,
        "NA"
      ],
      [
        1970,
        "NA"
      ],
      [
        1971,
        "NA"
      ],
      [
        1972,
        "NA"
      ],
      [
        1973,
        "NA"
      ],
      [
        1974,
        "NA"
      ],
      [
        1975,
        "NA"
      ],
      [
        1976,
        "NA"
      ],
      [
        1977,
        "NA"
      ],
      [
        1978,
        "NA"
      ],
      [
        1979,
        "NA"
      ],
      [
        1980,
        "NA"
      ],
      [
        1981,
        "NA"
      ],
      [
        1982,
        "NA"
      ],
      [
        1983,
        "NA"
      ],
      [
        1984,
        "NA"
      ],
      [
        1985,
        "NA"
      ],
      [
        1986,
        "NA"
      ],
      [
        1987,
        "NA"
      ],
      [
        1988,
        "NA"
      ],
      [
        1989,
        "NA"
      ],
      [
        1990,
        "NA"
      ],
      [
        1991,
        54.1
      ],
      [
        1992,
        "NA"
      ],
      [
        1993,
        54.5
      ],
      [
        1994,
        "NA"
      ],
      [
        1995,
        "NA"
      ],
      [
        1996,
        41.7
      ],
      [
        1997,
        "NA"
      ],
      [
        1998,
        42.1
      ],
      [
        1999,
        "NA"
      ],
      [
        2000,
        "NA"
      ],
      [
        2001,
        "NA"
      ],
      [
        2002,
        49.4
      ],
      [
        2003,
        "NA"
      ],
      [
        2004,
        56.7
      ],
      [
        2005,
        "NA"
      ],
      [
        2006,
        60.5
      ],
      [
        2007,
        "NA"
      ],
      [
        2008,
        "NA"
      ],
      [
        2009,
        "NA"
      ],
      [
        2010,
        64.4
      ],
      [
        2011,
        "NA"
      ],
      [
        2012,
        "NA"
      ],
      [
        2013,
        "NA"
      ],
      [
        2014,
        "NA"
      ],
      [
        2015,
        57.5
      ],
      [
        2016,
        "NA"
      ],
      [
        2017,
        "NA"
      ],
      [
        2018,
        "NA"
      ],
      [
        2019,
        "NA"
      ]
    ],
    "pop_rurale": [
      [
        1960,
        81.855
      ],
      [
        1961,
        81.04899999999999
      ],
      [
        1962,
        80.215
      ],
      [
        1963,
        79.288
      ],
      [
        1964,
        77.985
      ],
      [
        1965,
        76.628
      ],
      [
        1966,
        75.211
      ],
      [
        1967,
        73.73899999999999
      ],
      [
        1968,
        72.209
      ],
      [
        1969,
        70.63
      ],
      [
        1970,
        69.649
      ],
      [
        1971,
        68.759
      ],
      [
        1972,
        67.854
      ],
      [
        1973,
        66.939
      ],
      [
        1974,
        66.008
      ],
      [
        1975,
        65.066
      ],
      [
        1976,
        64.11
      ],
      [
        1977,
        63.145
      ],
      [
        1978,
        62.168
      ],
      [
        1979,
        61.181999999999995
      ],
      [
        1980,
        60.185
      ],
      [
        1981,
        60.146
      ],
      [
        1982,
        60.195
      ],
      [
        1983,
        60.245
      ],
      [
        1984,
        60.295
      ],
      [
        1985,
        60.345
      ],
      [
        1986,
        60.394
      ],
      [
        1987,
        60.443999999999996
      ],
      [
        1988,
        60.494
      ],
      [
        1989,
        60.544
      ],
      [
        1990,
        60.593
      ],
      [
        1991,
        61.011
      ],
      [
        1992,
        61.486000000000004
      ],
      [
        1993,
        61.958
      ],
      [
        1994,
        62.428000000000004
      ],
      [
        1995,
        62.896
      ],
      [
        1996,
        63.361999999999995
      ],
      [
        1997,
        63.824
      ],
      [
        1998,
        64.28399999999999
      ],
      [
        1999,
        64.742
      ],
      [
        2000,
        65.19800000000001
      ],
      [
        2001,
        64.998
      ],
      [
        2002,
        64.525
      ],
      [
        2003,
        64.04899999999999
      ],
      [
        2004,
        63.57
      ],
      [
        2005,
        63.089
      ],
      [
        2006,
        62.605
      ],
      [
        2007,
        62.119
      ],
      [
        2008,
        61.629
      ],
      [
        2009,
        61.138999999999996
      ],
      [
        2010,
        60.645
      ],
      [
        2011,
        60.148999999999994
      ],
      [
        2012,
        59.646
      ],
      [
        2013,
        59.135
      ],
      [
        2014,
        58.618
      ],
      [
        2015,
        58.093
      ],
      [
        2016,
        57.562
      ],
      [
        2017,
        57.023999999999994
      ],
      [
        2018,
        56.479
      ],
      [
        2019,
        "NA"
      ]
    ],
    "pop_tot": [
      [
        1950,
        2.3104419999999997
      ],
      [
        1951,
        2.368604
      ],
      [
        1952,
        2.4313439999999997
      ],
      [
        1953,
        2.498465
      ],
      [
        1954,
        2.569748
      ],
      [
        1955,
        2.6449759999999998
      ],
      [
        1956,
        2.723864
      ],
      [
        1957,
        2.8061640000000003
      ],
      [
        1958,
        2.891581
      ],
      [
        1959,
        2.979852
      ],
      [
        1960,
        3.070776
      ],
      [
        1961,
        3.1643290000000004
      ],
      [
        1962,
        3.26065
      ],
      [
        1963,
        3.360104
      ],
      [
        1964,
        3.4632129999999997
      ],
      [
        1965,
        3.570464
      ],
      [
        1966,
        3.6819550000000003
      ],
      [
        1967,
        3.7978730000000005
      ],
      [
        1968,
        3.918872
      ],
      [
        1969,
        4.04574
      ],
      [
        1970,
        4.179067
      ],
      [
        1971,
        4.319224
      ],
      [
        1972,
        4.466174
      ],
      [
        1973,
        4.6195460000000015
      ],
      [
        1974,
        4.7787239999999995
      ],
      [
        1975,
        4.943283
      ],
      [
        1976,
        5.1128230000000014
      ],
      [
        1977,
        5.287548
      ],
      [
        1978,
        5.468261999999998
      ],
      [
        1979,
        5.6561390000000005
      ],
      [
        1980,
        5.851825
      ],
      [
        1981,
        6.055366
      ],
      [
        1982,
        6.265864
      ],
      [
        1983,
        6.481916
      ],
      [
        1984,
        6.70154
      ],
      [
        1985,
        6.923149
      ],
      [
        1986,
        7.146969
      ],
      [
        1987,
        7.372837
      ],
      [
        1988,
        7.598274999999999
      ],
      [
        1989,
        7.8202050000000005
      ],
      [
        1990,
        8.036845
      ],
      [
        1991,
        8.246656000000002
      ],
      [
        1992,
        8.451347
      ],
      [
        1993,
        8.656486000000001
      ],
      [
        1994,
        8.86974
      ],
      [
        1995,
        9.096607
      ],
      [
        1996,
        9.339733
      ],
      [
        1997,
        9.597609
      ],
      [
        1998,
        9.866475999999999
      ],
      [
        1999,
        10.140561
      ],
      [
        2000,
        10.415944
      ],
      [
        2001,
        10.692193
      ],
      [
        2002,
        10.971698
      ],
      [
        2003,
        11.256743
      ],
      [
        2004,
        11.550642
      ],
      [
        2005,
        11.856247
      ],
      [
        2006,
        12.173514
      ],
      [
        2007,
        12.502958
      ],
      [
        2008,
        12.84853
      ],
      [
        2009,
        13.215139
      ],
      [
        2010,
        13.605984
      ],
      [
        2011,
        14.023203
      ],
      [
        2012,
        14.46515
      ],
      [
        2013,
        14.926544
      ],
      [
        2014,
        15.399788
      ],
      [
        2015,
        15.879361
      ],
      [
        2016,
        16.363457999999998
      ],
      [
        2017,
        16.853599
      ],
      [
        2018,
        17.351708
      ],
      [
        2019,
        17.86103
      ],
      [
        2020,
        18.383955
      ],
      [
        2021,
        18.920651000000003
      ],
      [
        2022,
        19.470234
      ],
      [
        2023,
        20.032812000000003
      ],
      [
        2024,
        20.608359
      ],
      [
        2025,
        21.196801
      ],
      [
        2026,
        21.798153
      ],
      [
        2027,
        22.412316
      ],
      [
        2028,
        23.038729999999997
      ],
      [
        2029,
        23.676661
      ],
      [
        2030,
        24.325505
      ],
      [
        2031,
        24.984961
      ],
      [
        2032,
        25.654798
      ],
      [
        2033,
        26.334558
      ],
      [
        2034,
        27.023734
      ],
      [
        2035,
        27.721896
      ],
      [
        2036,
        28.428666999999997
      ],
      [
        2037,
        29.143814000000003
      ],
      [
        2038,
        29.867201
      ],
      [
        2039,
        30.598792
      ],
      [
        2040,
        31.338483
      ],
      [
        2041,
        32.086104
      ],
      [
        2042,
        32.841342
      ],
      [
        2043,
        33.603854
      ],
      [
        2044,
        34.373196
      ],
      [
        2045,
        35.149038
      ],
      [
        2046,
        35.931106
      ],
      [
        2047,
        36.719296
      ],
      [
        2048,
        37.513609
      ],
      [
        2049,
        38.314144
      ],
      [
        2050,
        39.120917
      ],
      [
        2051,
        39.933823
      ],
      [
        2052,
        40.752621000000005
      ],
      [
        2053,
        41.57704800000001
      ],
      [
        2054,
        42.406782
      ],
      [
        2055,
        43.241551
      ],
      [
        2056,
        44.081041
      ],
      [
        2057,
        44.925128
      ],
      [
        2058,
        45.773853
      ],
      [
        2059,
        46.627340999999994
      ],
      [
        2060,
        47.485579
      ],
      [
        2061,
        48.348443
      ],
      [
        2062,
        49.215488
      ],
      [
        2063,
        50.086058
      ],
      [
        2064,
        50.959315
      ],
      [
        2065,
        51.834554
      ],
      [
        2066,
        52.711361
      ],
      [
        2067,
        53.589514
      ],
      [
        2068,
        54.468799
      ],
      [
        2069,
        55.349033999999996
      ],
      [
        2070,
        56.23003300000001
      ],
      [
        2071,
        57.111509999999996
      ],
      [
        2072,
        57.993115
      ],
      [
        2073,
        58.874527
      ],
      [
        2074,
        59.755428
      ],
      [
        2075,
        60.63551
      ],
      [
        2076,
        61.51442700000001
      ],
      [
        2077,
        62.391914
      ],
      [
        2078,
        63.267867
      ],
      [
        2079,
        64.142234
      ],
      [
        2080,
        65.014875
      ],
      [
        2081,
        65.885593
      ],
      [
        2082,
        66.75396500000001
      ],
      [
        2083,
        67.61941999999999
      ],
      [
        2084,
        68.481237
      ],
      [
        2085,
        69.33881600000001
      ],
      [
        2086,
        70.191783
      ],
      [
        2087,
        71.039947
      ],
      [
        2088,
        71.883133
      ],
      [
        2089,
        72.72124000000002
      ],
      [
        2090,
        73.554125
      ],
      [
        2091,
        74.381597
      ],
      [
        2092,
        75.203383
      ],
      [
        2093,
        76.019211
      ],
      [
        2094,
        76.828802
      ],
      [
        2095,
        77.631916
      ],
      [
        2096,
        78.428394
      ],
      [
        2097,
        79.218087
      ],
      [
        2098,
        80.000947
      ],
      [
        2099,
        80.776966
      ],
      [
        2100,
        81.5462
      ]
    ],
    "pop_urbaine": [
      [
        1960,
        18.145
      ],
      [
        1961,
        18.951
      ],
      [
        1962,
        19.785
      ],
      [
        1963,
        20.712
      ],
      [
        1964,
        22.015
      ],
      [
        1965,
        23.372
      ],
      [
        1966,
        24.789
      ],
      [
        1967,
        26.261
      ],
      [
        1968,
        27.791
      ],
      [
        1969,
        29.37
      ],
      [
        1970,
        30.351
      ],
      [
        1971,
        31.241
      ],
      [
        1972,
        32.146
      ],
      [
        1973,
        33.061
      ],
      [
        1974,
        33.992
      ],
      [
        1975,
        34.934
      ],
      [
        1976,
        35.89
      ],
      [
        1977,
        36.855
      ],
      [
        1978,
        37.832
      ],
      [
        1979,
        38.818000000000005
      ],
      [
        1980,
        39.815
      ],
      [
        1981,
        39.854
      ],
      [
        1982,
        39.805
      ],
      [
        1983,
        39.755
      ],
      [
        1984,
        39.705
      ],
      [
        1985,
        39.655
      ],
      [
        1986,
        39.606
      ],
      [
        1987,
        39.556
      ],
      [
        1988,
        39.506
      ],
      [
        1989,
        39.455999999999996
      ],
      [
        1990,
        39.407
      ],
      [
        1991,
        38.989000000000004
      ],
      [
        1992,
        38.514
      ],
      [
        1993,
        38.042
      ],
      [
        1994,
        37.571999999999996
      ],
      [
        1995,
        37.104
      ],
      [
        1996,
        36.638000000000005
      ],
      [
        1997,
        36.176
      ],
      [
        1998,
        35.716
      ],
      [
        1999,
        35.258
      ],
      [
        2000,
        34.802
      ],
      [
        2001,
        35.001999999999995
      ],
      [
        2002,
        35.475
      ],
      [
        2003,
        35.951
      ],
      [
        2004,
        36.43
      ],
      [
        2005,
        36.911
      ],
      [
        2006,
        37.395
      ],
      [
        2007,
        37.881
      ],
      [
        2008,
        38.371
      ],
      [
        2009,
        38.861
      ],
      [
        2010,
        39.355
      ],
      [
        2011,
        39.851
      ],
      [
        2012,
        40.354
      ],
      [
        2013,
        40.865
      ],
      [
        2014,
        41.382
      ],
      [
        2015,
        41.907
      ],
      [
        2016,
        42.438
      ],
      [
        2017,
        42.976000000000006
      ],
      [
        2018,
        43.521
      ],
      [
        2019,
        "NA"
      ]
    ],
    "prod_elec_renouv": [
      [
        1960,
        "NA"
      ],
      [
        1961,
        "NA"
      ],
      [
        1962,
        "NA"
      ],
      [
        1963,
        "NA"
      ],
      [
        1964,
        "NA"
      ],
      [
        1965,
        "NA"
      ],
      [
        1966,
        "NA"
      ],
      [
        1967,
        "NA"
      ],
      [
        1968,
        "NA"
      ],
      [
        1969,
        "NA"
      ],
      [
        1970,
        "NA"
      ],
      [
        1971,
        0.0
      ],
      [
        1972,
        0.0
      ],
      [
        1973,
        0.0
      ],
      [
        1974,
        0.0
      ],
      [
        1975,
        0.0
      ],
      [
        1976,
        0.0
      ],
      [
        1977,
        0.0
      ],
      [
        1978,
        0.0
      ],
      [
        1979,
        0.0
      ],
      [
        1980,
        0.0
      ],
      [
        1981,
        0.0
      ],
      [
        1982,
        0.0
      ],
      [
        1983,
        0.0
      ],
      [
        1984,
        0.0
      ],
      [
        1985,
        0.0
      ],
      [
        1986,
        0.0
      ],
      [
        1987,
        0.0
      ],
      [
        1988,
        0.0
      ],
      [
        1989,
        0.0
      ],
      [
        1990,
        0.0
      ],
      [
        1991,
        0.0
      ],
      [
        1992,
        0.0
      ],
      [
        1993,
        0.0
      ],
      [
        1994,
        0.0
      ],
      [
        1995,
        0.0
      ],
      [
        1996,
        0.0
      ],
      [
        1997,
        0.0
      ],
      [
        1998,
        0.0
      ],
      [
        1999,
        0.0
      ],
      [
        2000,
        0.0
      ],
      [
        2001,
        0.0
      ],
      [
        2002,
        0.0
      ],
      [
        2003,
        0.0
      ],
      [
        2004,
        0.0
      ],
      [
        2005,
        0.0
      ],
      [
        2006,
        0.0
      ],
      [
        2007,
        0.0
      ],
      [
        2008,
        0.0
      ],
      [
        2009,
        0.0
      ],
      [
        2010,
        0.0
      ],
      [
        2011,
        0.0
      ],
      [
        2012,
        0.0
      ],
      [
        2013,
        0.0
      ],
      [
        2014,
        0.0
      ],
      [
        2015,
        0.0
      ],
      [
        2016,
        "NA"
      ],
      [
        2017,
        "NA"
      ],
      [
        2018,
        "NA"
      ],
      [
        2019,
        "NA"
      ]
    ],
    "rdt_cerealier": [
      [
        1960,
        "NA"
      ],
      [
        1961,
        822.2
      ],
      [
        1962,
        801.4
      ],
      [
        1963,
        706.9
      ],
      [
        1964,
        788.9
      ],
      [
        1965,
        823.5
      ],
      [
        1966,
        878.0
      ],
      [
        1967,
        869.6
      ],
      [
        1968,
        785.2
      ],
      [
        1969,
        774.0
      ],
      [
        1970,
        624.4
      ],
      [
        1971,
        876.3
      ],
      [
        1972,
        1007.1
      ],
      [
        1973,
        838.7
      ],
      [
        1974,
        967.7
      ],
      [
        1975,
        1311.1
      ],
      [
        1976,
        1375.7
      ],
      [
        1977,
        1504.7
      ],
      [
        1978,
        1515.4
      ],
      [
        1979,
        1529.1
      ],
      [
        1980,
        1567.5
      ],
      [
        1981,
        1930.6
      ],
      [
        1982,
        1572.1
      ],
      [
        1983,
        1651.2
      ],
      [
        1984,
        1646.1
      ],
      [
        1985,
        1842.8
      ],
      [
        1986,
        1930.6
      ],
      [
        1987,
        1610.3
      ],
      [
        1988,
        2457.4
      ],
      [
        1989,
        1717.3
      ],
      [
        1990,
        1351.9
      ],
      [
        1991,
        1640.6
      ],
      [
        1992,
        763.1
      ],
      [
        1993,
        2302.9
      ],
      [
        1994,
        1417.5
      ],
      [
        1995,
        1331.4
      ],
      [
        1996,
        1911.7
      ],
      [
        1997,
        1413.4
      ],
      [
        1998,
        1211.2
      ],
      [
        1999,
        1323.6
      ],
      [
        2000,
        1682.3
      ],
      [
        2001,
        1402.1
      ],
      [
        2002,
        1419.2
      ],
      [
        2003,
        1701.9
      ],
      [
        2004,
        1814.4
      ],
      [
        2005,
        1898.7
      ],
      [
        2006,
        1816.0
      ],
      [
        2007,
        2252.6
      ],
      [
        2008,
        2179.8
      ],
      [
        2009,
        2066.4
      ],
      [
        2010,
        2533.5
      ],
      [
        2011,
        2731.4
      ],
      [
        2012,
        2689.3
      ],
      [
        2013,
        2532.4
      ],
      [
        2014,
        2755.2
      ],
      [
        2015,
        3006.6
      ],
      [
        2016,
        2417.7
      ],
      [
        2017,
        2477.6
      ],
      [
        2018,
        "NA"
      ],
      [
        2019,
        "NA"
      ]
    ],
    "recette_budg": [
      [
        1980,
        "NA"
      ],
      [
        1981,
        "NA"
      ],
      [
        1982,
        "NA"
      ],
      [
        1983,
        "NA"
      ],
      [
        1984,
        "NA"
      ],
      [
        1985,
        "NA"
      ],
      [
        1986,
        "NA"
      ],
      [
        1987,
        "NA"
      ],
      [
        1988,
        "NA"
      ],
      [
        1989,
        "NA"
      ],
      [
        1990,
        "NA"
      ],
      [
        1991,
        "NA"
      ],
      [
        1992,
        "NA"
      ],
      [
        1993,
        "NA"
      ],
      [
        1994,
        "NA"
      ],
      [
        1995,
        "NA"
      ],
      [
        1996,
        "NA"
      ],
      [
        1997,
        "NA"
      ],
      [
        1998,
        "NA"
      ],
      [
        1999,
        "NA"
      ],
      [
        2000,
        22.569000000000003
      ],
      [
        2001,
        22.07
      ],
      [
        2002,
        23.072
      ],
      [
        2003,
        21.999000000000002
      ],
      [
        2004,
        20.764
      ],
      [
        2005,
        20.079
      ],
      [
        2006,
        36.604
      ],
      [
        2007,
        18.886
      ],
      [
        2008,
        18.79
      ],
      [
        2009,
        15.75
      ],
      [
        2010,
        15.634
      ],
      [
        2011,
        17.744
      ],
      [
        2012,
        18.694000000000003
      ],
      [
        2013,
        17.629
      ],
      [
        2014,
        18.895
      ],
      [
        2015,
        18.77
      ],
      [
        2016,
        18.237000000000002
      ],
      [
        2017,
        17.475
      ],
      [
        2018,
        19.127
      ],
      [
        2019,
        19.396
      ],
      [
        2020,
        19.709
      ],
      [
        2021,
        19.804000000000002
      ],
      [
        2022,
        19.784000000000002
      ],
      [
        2023,
        19.726
      ],
      [
        2024,
        19.739
      ]
    ],
    "regime_pol": [
      [
        1816,
        -20.0
      ],
      [
        1817,
        -20.0
      ],
      [
        1818,
        -20.0
      ],
      [
        1819,
        -20.0
      ],
      [
        1820,
        -20.0
      ],
      [
        1821,
        -20.0
      ],
      [
        1822,
        -20.0
      ],
      [
        1823,
        -20.0
      ],
      [
        1824,
        -20.0
      ],
      [
        1825,
        -20.0
      ],
      [
        1826,
        -20.0
      ],
      [
        1827,
        -20.0
      ],
      [
        1828,
        -20.0
      ],
      [
        1829,
        -20.0
      ],
      [
        1830,
        -20.0
      ],
      [
        1831,
        -20.0
      ],
      [
        1832,
        -20.0
      ],
      [
        1833,
        -20.0
      ],
      [
        1834,
        -20.0
      ],
      [
        1835,
        -20.0
      ],
      [
        1836,
        -20.0
      ],
      [
        1837,
        -20.0
      ],
      [
        1838,
        -20.0
      ],
      [
        1839,
        -20.0
      ],
      [
        1840,
        -20.0
      ],
      [
        1841,
        -20.0
      ],
      [
        1842,
        -20.0
      ],
      [
        1843,
        -20.0
      ],
      [
        1844,
        -20.0
      ],
      [
        1845,
        -20.0
      ],
      [
        1846,
        -20.0
      ],
      [
        1847,
        -20.0
      ],
      [
        1848,
        -20.0
      ],
      [
        1849,
        -20.0
      ],
      [
        1850,
        -20.0
      ],
      [
        1851,
        -20.0
      ],
      [
        1852,
        -20.0
      ],
      [
        1853,
        -20.0
      ],
      [
        1854,
        -20.0
      ],
      [
        1855,
        -20.0
      ],
      [
        1856,
        -20.0
      ],
      [
        1857,
        -20.0
      ],
      [
        1858,
        -20.0
      ],
      [
        1859,
        -20.0
      ],
      [
        1860,
        -20.0
      ],
      [
        1861,
        -20.0
      ],
      [
        1862,
        -20.0
      ],
      [
        1863,
        -20.0
      ],
      [
        1864,
        -20.0
      ],
      [
        1865,
        -20.0
      ],
      [
        1866,
        -20.0
      ],
      [
        1867,
        -20.0
      ],
      [
        1868,
        -20.0
      ],
      [
        1869,
        -20.0
      ],
      [
        1870,
        -20.0
      ],
      [
        1871,
        -20.0
      ],
      [
        1872,
        -20.0
      ],
      [
        1873,
        -20.0
      ],
      [
        1874,
        -20.0
      ],
      [
        1875,
        -20.0
      ],
      [
        1876,
        -20.0
      ],
      [
        1877,
        -20.0
      ],
      [
        1878,
        -20.0
      ],
      [
        1879,
        -20.0
      ],
      [
        1880,
        -20.0
      ],
      [
        1881,
        -20.0
      ],
      [
        1882,
        -20.0
      ],
      [
        1883,
        -20.0
      ],
      [
        1884,
        -20.0
      ],
      [
        1885,
        -20.0
      ],
      [
        1886,
        -20.0
      ],
      [
        1887,
        -20.0
      ],
      [
        1888,
        -20.0
      ],
      [
        1889,
        -20.0
      ],
      [
        1890,
        -20.0
      ],
      [
        1891,
        -20.0
      ],
      [
        1892,
        -20.0
      ],
      [
        1893,
        -20.0
      ],
      [
        1894,
        -20.0
      ],
      [
        1895,
        -20.0
      ],
      [
        1896,
        -20.0
      ],
      [
        1897,
        -20.0
      ],
      [
        1898,
        -20.0
      ],
      [
        1899,
        -20.0
      ],
      [
        1900,
        -20.0
      ],
      [
        1901,
        -20.0
      ],
      [
        1902,
        -20.0
      ],
      [
        1903,
        -20.0
      ],
      [
        1904,
        -20.0
      ],
      [
        1905,
        -20.0
      ],
      [
        1906,
        -20.0
      ],
      [
        1907,
        -20.0
      ],
      [
        1908,
        -20.0
      ],
      [
        1909,
        -20.0
      ],
      [
        1910,
        -20.0
      ],
      [
        1911,
        -20.0
      ],
      [
        1912,
        -20.0
      ],
      [
        1913,
        -20.0
      ],
      [
        1914,
        -20.0
      ],
      [
        1915,
        -20.0
      ],
      [
        1916,
        -20.0
      ],
      [
        1917,
        -20.0
      ],
      [
        1918,
        -20.0
      ],
      [
        1919,
        -20.0
      ],
      [
        1920,
        -20.0
      ],
      [
        1921,
        -20.0
      ],
      [
        1922,
        -20.0
      ],
      [
        1923,
        -20.0
      ],
      [
        1924,
        -20.0
      ],
      [
        1925,
        -20.0
      ],
      [
        1926,
        -20.0
      ],
      [
        1927,
        -20.0
      ],
      [
        1928,
        -20.0
      ],
      [
        1929,
        -20.0
      ],
      [
        1930,
        -20.0
      ],
      [
        1931,
        -20.0
      ],
      [
        1932,
        -20.0
      ],
      [
        1933,
        -20.0
      ],
      [
        1934,
        -20.0
      ],
      [
        1935,
        -20.0
      ],
      [
        1936,
        -20.0
      ],
      [
        1937,
        -20.0
      ],
      [
        1938,
        -20.0
      ],
      [
        1939,
        -20.0
      ],
      [
        1940,
        -20.0
      ],
      [
        1941,
        -20.0
      ],
      [
        1942,
        -20.0
      ],
      [
        1943,
        -20.0
      ],
      [
        1944,
        -20.0
      ],
      [
        1945,
        -20.0
      ],
      [
        1946,
        -20.0
      ],
      [
        1947,
        -20.0
      ],
      [
        1948,
        -20.0
      ],
      [
        1949,
        -20.0
      ],
      [
        1950,
        -20.0
      ],
      [
        1951,
        -20.0
      ],
      [
        1952,
        -20.0
      ],
      [
        1953,
        -20.0
      ],
      [
        1954,
        -20.0
      ],
      [
        1955,
        -20.0
      ],
      [
        1956,
        -20.0
      ],
      [
        1957,
        -20.0
      ],
      [
        1958,
        -20.0
      ],
      [
        1959,
        -20.0
      ],
      [
        1960,
        -20.0
      ],
      [
        1961,
        -20.0
      ],
      [
        1962,
        -20.0
      ],
      [
        1963,
        -20.0
      ],
      [
        1964,
        2.0
      ],
      [
        1965,
        2.0
      ],
      [
        1966,
        2.0
      ],
      [
        1967,
        2.0
      ],
      [
        1968,
        0.0
      ],
      [
        1969,
        0.0
      ],
      [
        1970,
        0.0
      ],
      [
        1971,
        0.0
      ],
      [
        1972,
        -9.0
      ],
      [
        1973,
        -9.0
      ],
      [
        1974,
        -9.0
      ],
      [
        1975,
        -9.0
      ],
      [
        1976,
        -9.0
      ],
      [
        1977,
        -9.0
      ],
      [
        1978,
        -9.0
      ],
      [
        1979,
        -9.0
      ],
      [
        1980,
        -9.0
      ],
      [
        1981,
        -9.0
      ],
      [
        1982,
        -9.0
      ],
      [
        1983,
        -9.0
      ],
      [
        1984,
        -9.0
      ],
      [
        1985,
        -9.0
      ],
      [
        1986,
        -9.0
      ],
      [
        1987,
        -9.0
      ],
      [
        1988,
        -9.0
      ],
      [
        1989,
        -9.0
      ],
      [
        1990,
        -9.0
      ],
      [
        1991,
        6.0
      ],
      [
        1992,
        6.0
      ],
      [
        1993,
        6.0
      ],
      [
        1994,
        6.0
      ],
      [
        1995,
        6.0
      ],
      [
        1996,
        1.0
      ],
      [
        1997,
        1.0
      ],
      [
        1998,
        1.0
      ],
      [
        1999,
        1.0
      ],
      [
        2000,
        1.0
      ],
      [
        2001,
        5.0
      ],
      [
        2002,
        5.0
      ],
      [
        2003,
        5.0
      ],
      [
        2004,
        5.0
      ],
      [
        2005,
        5.0
      ],
      [
        2006,
        5.0
      ],
      [
        2007,
        5.0
      ],
      [
        2008,
        7.0
      ],
      [
        2009,
        7.0
      ],
      [
        2010,
        7.0
      ],
      [
        2011,
        7.0
      ],
      [
        2012,
        7.0
      ],
      [
        2013,
        7.0
      ],
      [
        2014,
        7.0
      ],
      [
        2015,
        7.0
      ]
    ],
    "sous_nutri": [
      [
        1960,
        205.6
      ],
      [
        1961,
        201.6
      ],
      [
        1962,
        197.9
      ],
      [
        1963,
        194.7
      ],
      [
        1964,
        192.1
      ],
      [
        1965,
        190.1
      ],
      [
        1966,
        188.7
      ],
      [
        1967,
        187.7
      ],
      [
        1968,
        186.4
      ],
      [
        1969,
        184.2
      ],
      [
        1970,
        180.7
      ],
      [
        1971,
        175.9
      ],
      [
        1972,
        170.3
      ],
      [
        1973,
        164.8
      ],
      [
        1974,
        159.9
      ],
      [
        1975,
        156.2
      ],
      [
        1976,
        154.2
      ],
      [
        1977,
        153.7
      ],
      [
        1978,
        154.5
      ],
      [
        1979,
        155.6
      ],
      [
        1980,
        156.3
      ],
      [
        1981,
        156.9
      ],
      [
        1982,
        158.3
      ],
      [
        1983,
        160.8
      ],
      [
        1984,
        164.4
      ],
      [
        1985,
        168.8
      ],
      [
        1986,
        173.6
      ],
      [
        1987,
        177.9
      ],
      [
        1988,
        181.2
      ],
      [
        1989,
        183.8
      ],
      [
        1990,
        185.8
      ],
      [
        1991,
        186.9
      ],
      [
        1992,
        187.0
      ],
      [
        1993,
        185.7
      ],
      [
        1994,
        183.6
      ],
      [
        1995,
        180.8
      ],
      [
        1996,
        177.9
      ],
      [
        1997,
        175.4
      ],
      [
        1998,
        172.9
      ],
      [
        1999,
        169.0
      ],
      [
        2000,
        162.4
      ],
      [
        2001,
        153.1
      ],
      [
        2002,
        142.1
      ],
      [
        2003,
        130.5
      ],
      [
        2004,
        119.2
      ],
      [
        2005,
        109.6
      ],
      [
        2006,
        101.4
      ],
      [
        2007,
        95.4
      ],
      [
        2008,
        90.4
      ],
      [
        2009,
        85.1
      ],
      [
        2010,
        80.3
      ],
      [
        2011,
        77.2
      ],
      [
        2012,
        74.3
      ],
      [
        2013,
        70.7
      ],
      [
        2014,
        66.9
      ],
      [
        2015,
        64.6
      ],
      [
        2016,
        62.0
      ],
      [
        2017,
        59.4
      ],
      [
        2018,
        57.8
      ],
      [
        2019,
        "NA"
      ]
    ],
    "volume_exp_biens": [
      [
        1980,
        "NA"
      ],
      [
        1981,
        "NA"
      ],
      [
        1982,
        "NA"
      ],
      [
        1983,
        "NA"
      ],
      [
        1984,
        "NA"
      ],
      [
        1985,
        "NA"
      ],
      [
        1986,
        "NA"
      ],
      [
        1987,
        "NA"
      ],
      [
        1988,
        "NA"
      ],
      [
        1989,
        "NA"
      ],
      [
        1990,
        "NA"
      ],
      [
        1991,
        "NA"
      ],
      [
        1992,
        "NA"
      ],
      [
        1993,
        "NA"
      ],
      [
        1994,
        "NA"
      ],
      [
        1995,
        "NA"
      ],
      [
        1996,
        "NA"
      ],
      [
        1997,
        "NA"
      ],
      [
        1998,
        "NA"
      ],
      [
        1999,
        "NA"
      ],
      [
        2000,
        -6.178999999999999
      ],
      [
        2001,
        26.175
      ],
      [
        2002,
        12.827
      ],
      [
        2003,
        -3.207
      ],
      [
        2004,
        16.95
      ],
      [
        2005,
        6.292999999999999
      ],
      [
        2006,
        6.303
      ],
      [
        2007,
        3.096
      ],
      [
        2008,
        7.407
      ],
      [
        2009,
        19.198
      ],
      [
        2010,
        20.145
      ],
      [
        2011,
        1.7930000000000001
      ],
      [
        2012,
        27.935
      ],
      [
        2013,
        22.868000000000002
      ],
      [
        2014,
        -3.622
      ],
      [
        2015,
        -11.374
      ],
      [
        2016,
        -4.704
      ],
      [
        2017,
        3.5460000000000003
      ],
      [
        2018,
        7.28
      ],
      [
        2019,
        2.26
      ],
      [
        2020,
        3.12
      ],
      [
        2021,
        3.125
      ],
      [
        2022,
        3.0810000000000004
      ],
      [
        2023,
        3.157
      ],
      [
        2024,
        4.336
      ]
    ],
    "volume_exp_bs": [
      [
        1980,
        "NA"
      ],
      [
        1981,
        "NA"
      ],
      [
        1982,
        "NA"
      ],
      [
        1983,
        "NA"
      ],
      [
        1984,
        "NA"
      ],
      [
        1985,
        "NA"
      ],
      [
        1986,
        "NA"
      ],
      [
        1987,
        "NA"
      ],
      [
        1988,
        "NA"
      ],
      [
        1989,
        "NA"
      ],
      [
        1990,
        "NA"
      ],
      [
        1991,
        "NA"
      ],
      [
        1992,
        "NA"
      ],
      [
        1993,
        "NA"
      ],
      [
        1994,
        "NA"
      ],
      [
        1995,
        "NA"
      ],
      [
        1996,
        "NA"
      ],
      [
        1997,
        "NA"
      ],
      [
        1998,
        "NA"
      ],
      [
        1999,
        "NA"
      ],
      [
        2000,
        -6.178999999999999
      ],
      [
        2001,
        26.175
      ],
      [
        2002,
        12.827
      ],
      [
        2003,
        -3.207
      ],
      [
        2004,
        16.95
      ],
      [
        2005,
        6.292999999999999
      ],
      [
        2006,
        6.303
      ],
      [
        2007,
        3.096
      ],
      [
        2008,
        7.407
      ],
      [
        2009,
        19.198
      ],
      [
        2010,
        20.145
      ],
      [
        2011,
        1.7930000000000001
      ],
      [
        2012,
        27.935
      ],
      [
        2013,
        22.868000000000002
      ],
      [
        2014,
        -3.622
      ],
      [
        2015,
        -11.374
      ],
      [
        2016,
        -4.704
      ],
      [
        2017,
        3.5460000000000003
      ],
      [
        2018,
        7.28
      ],
      [
        2019,
        2.26
      ],
      [
        2020,
        3.12
      ],
      [
        2021,
        3.125
      ],
      [
        2022,
        3.0810000000000004
      ],
      [
        2023,
        3.157
      ],
      [
        2024,
        4.336
      ]
    ],
    "volume_import_biens": [
      [
        1980,
        "NA"
      ],
      [
        1981,
        "NA"
      ],
      [
        1982,
        "NA"
      ],
      [
        1983,
        "NA"
      ],
      [
        1984,
        "NA"
      ],
      [
        1985,
        "NA"
      ],
      [
        1986,
        "NA"
      ],
      [
        1987,
        "NA"
      ],
      [
        1988,
        "NA"
      ],
      [
        1989,
        "NA"
      ],
      [
        1990,
        "NA"
      ],
      [
        1991,
        "NA"
      ],
      [
        1992,
        "NA"
      ],
      [
        1993,
        "NA"
      ],
      [
        1994,
        "NA"
      ],
      [
        1995,
        "NA"
      ],
      [
        1996,
        "NA"
      ],
      [
        1997,
        "NA"
      ],
      [
        1998,
        "NA"
      ],
      [
        1999,
        "NA"
      ],
      [
        2000,
        2.515
      ],
      [
        2001,
        34.253
      ],
      [
        2002,
        -4.4639999999999995
      ],
      [
        2003,
        3.5789999999999997
      ],
      [
        2004,
        20.808000000000003
      ],
      [
        2005,
        10.037
      ],
      [
        2006,
        15.088
      ],
      [
        2007,
        30.748
      ],
      [
        2008,
        12.206
      ],
      [
        2009,
        -14.334000000000001
      ],
      [
        2010,
        32.764
      ],
      [
        2011,
        26.938000000000002
      ],
      [
        2012,
        23.883000000000003
      ],
      [
        2013,
        16.668
      ],
      [
        2014,
        -6.546
      ],
      [
        2015,
        0.013000000000000001
      ],
      [
        2016,
        -7.932
      ],
      [
        2017,
        12.405999999999999
      ],
      [
        2018,
        6.297999999999999
      ],
      [
        2019,
        -5.974
      ],
      [
        2020,
        0.402
      ],
      [
        2021,
        1.564
      ],
      [
        2022,
        1.869
      ],
      [
        2023,
        1.7830000000000001
      ],
      [
        2024,
        2.682
      ]
    ],
    "volume_import_bs": [
      [
        1980,
        "NA"
      ],
      [
        1981,
        "NA"
      ],
      [
        1982,
        "NA"
      ],
      [
        1983,
        "NA"
      ],
      [
        1984,
        "NA"
      ],
      [
        1985,
        "NA"
      ],
      [
        1986,
        "NA"
      ],
      [
        1987,
        "NA"
      ],
      [
        1988,
        "NA"
      ],
      [
        1989,
        "NA"
      ],
      [
        1990,
        "NA"
      ],
      [
        1991,
        "NA"
      ],
      [
        1992,
        "NA"
      ],
      [
        1993,
        "NA"
      ],
      [
        1994,
        "NA"
      ],
      [
        1995,
        "NA"
      ],
      [
        1996,
        "NA"
      ],
      [
        1997,
        "NA"
      ],
      [
        1998,
        "NA"
      ],
      [
        1999,
        "NA"
      ],
      [
        2000,
        2.515
      ],
      [
        2001,
        34.253
      ],
      [
        2002,
        -4.4639999999999995
      ],
      [
        2003,
        3.5789999999999997
      ],
      [
        2004,
        20.808000000000003
      ],
      [
        2005,
        10.037
      ],
      [
        2006,
        15.088
      ],
      [
        2007,
        30.748
      ],
      [
        2008,
        12.206
      ],
      [
        2009,
        -14.334000000000001
      ],
      [
        2010,
        32.764
      ],
      [
        2011,
        26.938000000000002
      ],
      [
        2012,
        23.883000000000003
      ],
      [
        2013,
        16.668
      ],
      [
        2014,
        -6.546
      ],
      [
        2015,
        0.013000000000000001
      ],
      [
        2016,
        -7.932
      ],
      [
        2017,
        12.405999999999999
      ],
      [
        2018,
        6.297999999999999
      ],
      [
        2019,
        -5.974
      ],
      [
        2020,
        0.402
      ],
      [
        2021,
        1.564
      ],
      [
        2022,
        1.869
      ],
      [
        2023,
        1.7830000000000001
      ],
      [
        2024,
        2.682
      ]
    ],
    "vuln_clim_ferdi": [
      [
        2018,
        51.787269737258704
      ]
    ],
    "vuln_clim_ndgain": [
      [
        1995,
        0.551695952270906
      ],
      [
        1996,
        0.556236758133517
      ],
      [
        1997,
        0.5609848323468821
      ],
      [
        1998,
        0.561356412901871
      ],
      [
        1999,
        0.5482709918678039
      ],
      [
        2000,
        0.5557399947873399
      ],
      [
        2001,
        0.550988683107931
      ],
      [
        2002,
        0.5642845397205861
      ],
      [
        2003,
        0.562567887099525
      ],
      [
        2004,
        0.558196956541569
      ],
      [
        2005,
        0.558572800014228
      ],
      [
        2006,
        0.557517538840931
      ],
      [
        2007,
        0.5571335260509039
      ],
      [
        2008,
        0.556018103630151
      ],
      [
        2009,
        0.5542089279071379
      ],
      [
        2010,
        0.552824299790068
      ],
      [
        2011,
        0.550410330689956
      ],
      [
        2012,
        0.548583175263212
      ],
      [
        2013,
        0.547402907503507
      ],
      [
        2014,
        0.543222245873857
      ],
      [
        2015,
        0.5425520757005851
      ],
      [
        2016,
        0.54237118271595
      ]
    ]
  }
}