{
  "country": "COM",
  "country_name": "Comores",
  "indicators": {
    "abo_mobile": [
      [
        1960,
        0.0
      ],
      [
        1961,
        "NA"
      ],
      [
        1962,
        "NA"
      ],
      [
        1963,
        "NA"
      ],
      [
        1964,
        "NA"
      ],
      [
        1965,
        0.0
      ],
      [
        1966,
        "NA"
      ],
      [
        1967,
        "NA"
      ],
      [
        1968,
        "NA"
      ],
      [
        1969,
        "NA"
      ],
      [
        1970,
        0.0
      ],
      [
        1971,
        "NA"
      ],
      [
        1972,
        "NA"
      ],
      [
        1973,
        "NA"
      ],
      [
        1974,
        "NA"
      ],
      [
        1975,
        0.0
      ],
      [
        1976,
        0.0
      ],
      [
        1977,
        0.0
      ],
      [
        1978,
        0.0
      ],
      [
        1979,
        0.0
      ],
      [
        1980,
        0.0
      ],
      [
        1981,
        0.0
      ],
      [
        1982,
        0.0
      ],
      [
        1983,
        0.0
      ],
      [
        1984,
        0.0
      ],
      [
        1985,
        0.0
      ],
      [
        1986,
        0.0
      ],
      [
        1987,
        0.0
      ],
      [
        1988,
        0.0
      ],
      [
        1989,
        0.0
      ],
      [
        1990,
        0.0
      ],
      [
        1991,
        0.0
      ],
      [
        1992,
        0.0
      ],
      [
        1993,
        0.0
      ],
      [
        1994,
        0.0
      ],
      [
        1995,
        0.0
      ],
      [
        1996,
        0.0
      ],
      [
        1997,
        0.0
      ],
      [
        1998,
        0.0
      ],
      [
        1999,
        0.0
      ],
      [
        2000,
        0.0
      ],
      [
        2001,
        0.0
      ],
      [
        2002,
        0.0
      ],
      [
        2003,
        0.002
      ],
      [
        2004,
        0.008378
      ],
      [
        2005,
        0.015522999999999999
      ],
      [
        2006,
        0.036877
      ],
      [
        2007,
        0.062104
      ],
      [
        2008,
        0.091741
      ],
      [
        2009,
        0.12259600000000001
      ],
      [
        2010,
        0.165278
      ],
      [
        2011,
        0.21643800000000002
      ],
      [
        2012,
        0.283511
      ],
      [
        2013,
        0.3475
      ],
      [
        2014,
        0.38299999999999995
      ],
      [
        2015,
        0.42478599999999994
      ],
      [
        2016,
        0.45438900000000004
      ],
      [
        2017,
        0.46891400000000005
      ],
      [
        2018,
        0.498903
      ],
      [
        2019,
        "NA"
      ]
    ],
    "acces_elec": [
      [
        1960,
        "NA"
      ],
      [
        1961,
        "NA"
      ],
      [
        1962,
        "NA"
      ],
      [
        1963,
        "NA"
      ],
      [
        1964,
        "NA"
      ],
      [
        1965,
        "NA"
      ],
      [
        1966,
        "NA"
      ],
      [
        1967,
        "NA"
      ],
      [
        1968,
        "NA"
      ],
      [
        1969,
        "NA"
      ],
      [
        1970,
        "NA"
      ],
      [
        1971,
        "NA"
      ],
      [
        1972,
        "NA"
      ],
      [
        1973,
        "NA"
      ],
      [
        1974,
        "NA"
      ],
      [
        1975,
        "NA"
      ],
      [
        1976,
        "NA"
      ],
      [
        1977,
        "NA"
      ],
      [
        1978,
        "NA"
      ],
      [
        1979,
        "NA"
      ],
      [
        1980,
        "NA"
      ],
      [
        1981,
        "NA"
      ],
      [
        1982,
        "NA"
      ],
      [
        1983,
        "NA"
      ],
      [
        1984,
        "NA"
      ],
      [
        1985,
        "NA"
      ],
      [
        1986,
        "NA"
      ],
      [
        1987,
        "NA"
      ],
      [
        1988,
        "NA"
      ],
      [
        1989,
        "NA"
      ],
      [
        1990,
        "NA"
      ],
      [
        1991,
        "NA"
      ],
      [
        1992,
        "NA"
      ],
      [
        1993,
        "NA"
      ],
      [
        1994,
        "NA"
      ],
      [
        1995,
        "NA"
      ],
      [
        1996,
        "NA"
      ],
      [
        1997,
        "NA"
      ],
      [
        1998,
        "NA"
      ],
      [
        1999,
        "NA"
      ],
      [
        2000,
        "NA"
      ],
      [
        2001,
        "NA"
      ],
      [
        2002,
        "NA"
      ],
      [
        2003,
        "NA"
      ],
      [
        2004,
        "NA"
      ],
      [
        2005,
        51.208652496300004
      ],
      [
        2006,
        53.433532714799995
      ],
      [
        2007,
        55.653888702399996
      ],
      [
        2008,
        57.8813018799
      ],
      [
        2009,
        60.127361297600004
      ],
      [
        2010,
        70.1040878296
      ],
      [
        2011,
        69.6052703857
      ],
      [
        2012,
        69.3
      ],
      [
        2013,
        69.50240325930001
      ],
      [
        2014,
        71.9505767822
      ],
      [
        2015,
        74.425453186
      ],
      [
        2016,
        76.9181213379
      ],
      [
        2017,
        79.4196929932
      ],
      [
        2018,
        81.9227523804
      ],
      [
        2019,
        "NA"
      ]
    ],
    "acces_elec_primaire": [
      [
        2000,
        "NA"
      ],
      [
        2001,
        "NA"
      ],
      [
        2002,
        "NA"
      ],
      [
        2003,
        "NA"
      ],
      [
        2004,
        "NA"
      ],
      [
        2005,
        "NA"
      ],
      [
        2006,
        "NA"
      ],
      [
        2007,
        "NA"
      ],
      [
        2008,
        "NA"
      ],
      [
        2009,
        "NA"
      ],
      [
        2010,
        "NA"
      ],
      [
        2011,
        "NA"
      ],
      [
        2012,
        "NA"
      ],
      [
        2013,
        "NA"
      ],
      [
        2014,
        "NA"
      ],
      [
        2015,
        "NA"
      ],
      [
        2016,
        "NA"
      ],
      [
        2017,
        40.87591
      ],
      [
        2018,
        "NA"
      ],
      [
        2019,
        "NA"
      ]
    ],
    "alpha_adulte": [
      [
        1960,
        "NA"
      ],
      [
        1961,
        "NA"
      ],
      [
        1962,
        "NA"
      ],
      [
        1963,
        "NA"
      ],
      [
        1964,
        "NA"
      ],
      [
        1965,
        "NA"
      ],
      [
        1966,
        "NA"
      ],
      [
        1967,
        "NA"
      ],
      [
        1968,
        "NA"
      ],
      [
        1969,
        "NA"
      ],
      [
        1970,
        "NA"
      ],
      [
        1971,
        "NA"
      ],
      [
        1972,
        "NA"
      ],
      [
        1973,
        "NA"
      ],
      [
        1974,
        "NA"
      ],
      [
        1975,
        "NA"
      ],
      [
        1976,
        "NA"
      ],
      [
        1977,
        "NA"
      ],
      [
        1978,
        "NA"
      ],
      [
        1979,
        "NA"
      ],
      [
        1980,
        47.91923
      ],
      [
        1981,
        "NA"
      ],
      [
        1982,
        "NA"
      ],
      [
        1983,
        "NA"
      ],
      [
        1984,
        "NA"
      ],
      [
        1985,
        "NA"
      ],
      [
        1986,
        "NA"
      ],
      [
        1987,
        "NA"
      ],
      [
        1988,
        "NA"
      ],
      [
        1989,
        "NA"
      ],
      [
        1990,
        "NA"
      ],
      [
        1991,
        "NA"
      ],
      [
        1992,
        "NA"
      ],
      [
        1993,
        "NA"
      ],
      [
        1994,
        "NA"
      ],
      [
        1995,
        "NA"
      ],
      [
        1996,
        "NA"
      ],
      [
        1997,
        "NA"
      ],
      [
        1998,
        "NA"
      ],
      [
        1999,
        "NA"
      ],
      [
        2000,
        68.48923
      ],
      [
        2001,
        "NA"
      ],
      [
        2002,
        "NA"
      ],
      [
        2003,
        "NA"
      ],
      [
        2004,
        "NA"
      ],
      [
        2005,
        "NA"
      ],
      [
        2006,
        "NA"
      ],
      [
        2007,
        "NA"
      ],
      [
        2008,
        "NA"
      ],
      [
        2009,
        "NA"
      ],
      [
        2010,
        "NA"
      ],
      [
        2011,
        "NA"
      ],
      [
        2012,
        49.19614
      ],
      [
        2013,
        "NA"
      ],
      [
        2014,
        "NA"
      ],
      [
        2015,
        "NA"
      ],
      [
        2016,
        "NA"
      ],
      [
        2017,
        "NA"
      ],
      [
        2018,
        58.81701999999999
      ],
      [
        2019,
        "NA"
      ]
    ],
    "alpha_jeune": [
      [
        1960,
        "NA"
      ],
      [
        1961,
        "NA"
      ],
      [
        1962,
        "NA"
      ],
      [
        1963,
        "NA"
      ],
      [
        1964,
        "NA"
      ],
      [
        1965,
        "NA"
      ],
      [
        1966,
        "NA"
      ],
      [
        1967,
        "NA"
      ],
      [
        1968,
        "NA"
      ],
      [
        1969,
        "NA"
      ],
      [
        1970,
        "NA"
      ],
      [
        1971,
        "NA"
      ],
      [
        1972,
        "NA"
      ],
      [
        1973,
        "NA"
      ],
      [
        1974,
        "NA"
      ],
      [
        1975,
        "NA"
      ],
      [
        1976,
        "NA"
      ],
      [
        1977,
        "NA"
      ],
      [
        1978,
        "NA"
      ],
      [
        1979,
        "NA"
      ],
      [
        1980,
        61.71301999999999
      ],
      [
        1981,
        "NA"
      ],
      [
        1982,
        "NA"
      ],
      [
        1983,
        "NA"
      ],
      [
        1984,
        "NA"
      ],
      [
        1985,
        "NA"
      ],
      [
        1986,
        "NA"
      ],
      [
        1987,
        "NA"
      ],
      [
        1988,
        "NA"
      ],
      [
        1989,
        "NA"
      ],
      [
        1990,
        "NA"
      ],
      [
        1991,
        "NA"
      ],
      [
        1992,
        "NA"
      ],
      [
        1993,
        "NA"
      ],
      [
        1994,
        "NA"
      ],
      [
        1995,
        "NA"
      ],
      [
        1996,
        "NA"
      ],
      [
        1997,
        "NA"
      ],
      [
        1998,
        "NA"
      ],
      [
        1999,
        "NA"
      ],
      [
        2000,
        80.18576
      ],
      [
        2001,
        "NA"
      ],
      [
        2002,
        "NA"
      ],
      [
        2003,
        "NA"
      ],
      [
        2004,
        "NA"
      ],
      [
        2005,
        "NA"
      ],
      [
        2006,
        "NA"
      ],
      [
        2007,
        "NA"
      ],
      [
        2008,
        "NA"
      ],
      [
        2009,
        "NA"
      ],
      [
        2010,
        "NA"
      ],
      [
        2011,
        "NA"
      ],
      [
        2012,
        71.58126999999999
      ],
      [
        2013,
        "NA"
      ],
      [
        2014,
        "NA"
      ],
      [
        2015,
        "NA"
      ],
      [
        2016,
        "NA"
      ],
      [
        2017,
        "NA"
      ],
      [
        2018,
        78.27039
      ],
      [
        2019,
        "NA"
      ]
    ],
    "bidonvilles": [
      [
        1960,
        "NA"
      ],
      [
        1961,
        "NA"
      ],
      [
        1962,
        "NA"
      ],
      [
        1963,
        "NA"
      ],
      [
        1964,
        "NA"
      ],
      [
        1965,
        "NA"
      ],
      [
        1966,
        "NA"
      ],
      [
        1967,
        "NA"
      ],
      [
        1968,
        "NA"
      ],
      [
        1969,
        "NA"
      ],
      [
        1970,
        "NA"
      ],
      [
        1971,
        "NA"
      ],
      [
        1972,
        "NA"
      ],
      [
        1973,
        "NA"
      ],
      [
        1974,
        "NA"
      ],
      [
        1975,
        "NA"
      ],
      [
        1976,
        "NA"
      ],
      [
        1977,
        "NA"
      ],
      [
        1978,
        "NA"
      ],
      [
        1979,
        "NA"
      ],
      [
        1980,
        "NA"
      ],
      [
        1981,
        "NA"
      ],
      [
        1982,
        "NA"
      ],
      [
        1983,
        "NA"
      ],
      [
        1984,
        "NA"
      ],
      [
        1985,
        "NA"
      ],
      [
        1986,
        "NA"
      ],
      [
        1987,
        "NA"
      ],
      [
        1988,
        "NA"
      ],
      [
        1989,
        "NA"
      ],
      [
        1990,
        65.4
      ],
      [
        1991,
        "NA"
      ],
      [
        1992,
        "NA"
      ],
      [
        1993,
        "NA"
      ],
      [
        1994,
        "NA"
      ],
      [
        1995,
        65.4
      ],
      [
        1996,
        "NA"
      ],
      [
        1997,
        "NA"
      ],
      [
        1998,
        "NA"
      ],
      [
        1999,
        "NA"
      ],
      [
        2000,
        65.4
      ],
      [
        2001,
        "NA"
      ],
      [
        2002,
        "NA"
      ],
      [
        2003,
        "NA"
      ],
      [
        2004,
        "NA"
      ],
      [
        2005,
        68.9
      ],
      [
        2006,
        "NA"
      ],
      [
        2007,
        68.9
      ],
      [
        2008,
        "NA"
      ],
      [
        2009,
        "NA"
      ],
      [
        2010,
        "NA"
      ],
      [
        2011,
        "NA"
      ],
      [
        2012,
        "NA"
      ],
      [
        2013,
        "NA"
      ],
      [
        2014,
        69.6
      ],
      [
        2015,
        "NA"
      ],
      [
        2016,
        "NA"
      ],
      [
        2017,
        "NA"
      ],
      [
        2018,
        "NA"
      ],
      [
        2019,
        "NA"
      ]
    ],
    "compte_adulte": [
      [
        1960,
        "NA"
      ],
      [
        1961,
        "NA"
      ],
      [
        1962,
        "NA"
      ],
      [
        1963,
        "NA"
      ],
      [
        1964,
        "NA"
      ],
      [
        1965,
        "NA"
      ],
      [
        1966,
        "NA"
      ],
      [
        1967,
        "NA"
      ],
      [
        1968,
        "NA"
      ],
      [
        1969,
        "NA"
      ],
      [
        1970,
        "NA"
      ],
      [
        1971,
        "NA"
      ],
      [
        1972,
        "NA"
      ],
      [
        1973,
        "NA"
      ],
      [
        1974,
        "NA"
      ],
      [
        1975,
        "NA"
      ],
      [
        1976,
        "NA"
      ],
      [
        1977,
        "NA"
      ],
      [
        1978,
        "NA"
      ],
      [
        1979,
        "NA"
      ],
      [
        1980,
        "NA"
      ],
      [
        1981,
        "NA"
      ],
      [
        1982,
        "NA"
      ],
      [
        1983,
        "NA"
      ],
      [
        1984,
        "NA"
      ],
      [
        1985,
        "NA"
      ],
      [
        1986,
        "NA"
      ],
      [
        1987,
        "NA"
      ],
      [
        1988,
        "NA"
      ],
      [
        1989,
        "NA"
      ],
      [
        1990,
        "NA"
      ],
      [
        1991,
        "NA"
      ],
      [
        1992,
        "NA"
      ],
      [
        1993,
        "NA"
      ],
      [
        1994,
        "NA"
      ],
      [
        1995,
        "NA"
      ],
      [
        1996,
        "NA"
      ],
      [
        1997,
        "NA"
      ],
      [
        1998,
        "NA"
      ],
      [
        1999,
        "NA"
      ],
      [
        2000,
        "NA"
      ],
      [
        2001,
        "NA"
      ],
      [
        2002,
        "NA"
      ],
      [
        2003,
        "NA"
      ],
      [
        2004,
        "NA"
      ],
      [
        2005,
        "NA"
      ],
      [
        2006,
        "NA"
      ],
      [
        2007,
        "NA"
      ],
      [
        2008,
        "NA"
      ],
      [
        2009,
        "NA"
      ],
      [
        2010,
        "NA"
      ],
      [
        2011,
        29.0370883942
      ],
      [
        2012,
        "NA"
      ],
      [
        2013,
        "NA"
      ],
      [
        2014,
        "NA"
      ],
      [
        2015,
        "NA"
      ],
      [
        2016,
        "NA"
      ],
      [
        2017,
        "NA"
      ],
      [
        2018,
        "NA"
      ],
      [
        2019,
        "NA"
      ]
    ],
    "compte_jeune": [
      [
        1960,
        "NA"
      ],
      [
        1961,
        "NA"
      ],
      [
        1962,
        "NA"
      ],
      [
        1963,
        "NA"
      ],
      [
        1964,
        "NA"
      ],
      [
        1965,
        "NA"
      ],
      [
        1966,
        "NA"
      ],
      [
        1967,
        "NA"
      ],
      [
        1968,
        "NA"
      ],
      [
        1969,
        "NA"
      ],
      [
        1970,
        "NA"
      ],
      [
        1971,
        "NA"
      ],
      [
        1972,
        "NA"
      ],
      [
        1973,
        "NA"
      ],
      [
        1974,
        "NA"
      ],
      [
        1975,
        "NA"
      ],
      [
        1976,
        "NA"
      ],
      [
        1977,
        "NA"
      ],
      [
        1978,
        "NA"
      ],
      [
        1979,
        "NA"
      ],
      [
        1980,
        "NA"
      ],
      [
        1981,
        "NA"
      ],
      [
        1982,
        "NA"
      ],
      [
        1983,
        "NA"
      ],
      [
        1984,
        "NA"
      ],
      [
        1985,
        "NA"
      ],
      [
        1986,
        "NA"
      ],
      [
        1987,
        "NA"
      ],
      [
        1988,
        "NA"
      ],
      [
        1989,
        "NA"
      ],
      [
        1990,
        "NA"
      ],
      [
        1991,
        "NA"
      ],
      [
        1992,
        "NA"
      ],
      [
        1993,
        "NA"
      ],
      [
        1994,
        "NA"
      ],
      [
        1995,
        "NA"
      ],
      [
        1996,
        "NA"
      ],
      [
        1997,
        "NA"
      ],
      [
        1998,
        "NA"
      ],
      [
        1999,
        "NA"
      ],
      [
        2000,
        "NA"
      ],
      [
        2001,
        "NA"
      ],
      [
        2002,
        "NA"
      ],
      [
        2003,
        "NA"
      ],
      [
        2004,
        "NA"
      ],
      [
        2005,
        "NA"
      ],
      [
        2006,
        "NA"
      ],
      [
        2007,
        "NA"
      ],
      [
        2008,
        "NA"
      ],
      [
        2009,
        "NA"
      ],
      [
        2010,
        "NA"
      ],
      [
        2011,
        6.997128486599999
      ],
      [
        2012,
        "NA"
      ],
      [
        2013,
        "NA"
      ],
      [
        2014,
        "NA"
      ],
      [
        2015,
        "NA"
      ],
      [
        2016,
        "NA"
      ],
      [
        2017,
        "NA"
      ],
      [
        2018,
        "NA"
      ],
      [
        2019,
        "NA"
      ]
    ],
    "croissance_pib": [
      [
        1960,
        "NA"
      ],
      [
        1961,
        "NA"
      ],
      [
        1962,
        "NA"
      ],
      [
        1963,
        "NA"
      ],
      [
        1964,
        "NA"
      ],
      [
        1965,
        "NA"
      ],
      [
        1966,
        "NA"
      ],
      [
        1967,
        "NA"
      ],
      [
        1968,
        "NA"
      ],
      [
        1969,
        "NA"
      ],
      [
        1970,
        "NA"
      ],
      [
        1971,
        "NA"
      ],
      [
        1972,
        "NA"
      ],
      [
        1973,
        "NA"
      ],
      [
        1974,
        "NA"
      ],
      [
        1975,
        "NA"
      ],
      [
        1976,
        "NA"
      ],
      [
        1977,
        "NA"
      ],
      [
        1978,
        "NA"
      ],
      [
        1979,
        "NA"
      ],
      [
        1980,
        "NA"
      ],
      [
        1981,
        3.8649289569
      ],
      [
        1982,
        6.3833170099
      ],
      [
        1983,
        4.8214018831
      ],
      [
        1984,
        4.1102999886000005
      ],
      [
        1985,
        2.2799607772
      ],
      [
        1986,
        1.8676121665
      ],
      [
        1987,
        1.6377841805000002
      ],
      [
        1988,
        2.6873794042
      ],
      [
        1989,
        -3.1802565162
      ],
      [
        1990,
        5.0912364134
      ],
      [
        1991,
        -5.3956371486000005
      ],
      [
        1992,
        8.5309817877
      ],
      [
        1993,
        3.0060613074
      ],
      [
        1994,
        -5.2767829974
      ],
      [
        1995,
        3.6102064317
      ],
      [
        1996,
        -1.2916889262
      ],
      [
        1997,
        4.0301536677
      ],
      [
        1998,
        1.2825157934
      ],
      [
        1999,
        1.9244087121
      ],
      [
        2000,
        10.8478786161
      ],
      [
        2001,
        2.3329071018
      ],
      [
        2002,
        2.3249448613999997
      ],
      [
        2003,
        2.1038716355
      ],
      [
        2004,
        1.9196598071000002
      ],
      [
        2005,
        2.8375478699000003
      ],
      [
        2006,
        2.6469554759
      ],
      [
        2007,
        0.800042349
      ],
      [
        2008,
        3.9999719914
      ],
      [
        2009,
        3.2001131115
      ],
      [
        2010,
        3.7999334547
      ],
      [
        2011,
        4.099846955
      ],
      [
        2012,
        3.2002729032
      ],
      [
        2013,
        4.499874215299999
      ],
      [
        2014,
        2.1000064383000003
      ],
      [
        2015,
        1.1161405827
      ],
      [
        2016,
        3.3206800249
      ],
      [
        2017,
        3.8157021128
      ],
      [
        2018,
        3.4307641362
      ],
      [
        2019,
        "NA"
      ]
    ],
    "eau_douce_agri": [
      [
        1960,
        "NA"
      ],
      [
        1961,
        "NA"
      ],
      [
        1962,
        "NA"
      ],
      [
        1963,
        "NA"
      ],
      [
        1964,
        "NA"
      ],
      [
        1965,
        "NA"
      ],
      [
        1966,
        "NA"
      ],
      [
        1967,
        "NA"
      ],
      [
        1968,
        "NA"
      ],
      [
        1969,
        "NA"
      ],
      [
        1970,
        "NA"
      ],
      [
        1971,
        "NA"
      ],
      [
        1972,
        "NA"
      ],
      [
        1973,
        "NA"
      ],
      [
        1974,
        "NA"
      ],
      [
        1975,
        "NA"
      ],
      [
        1976,
        "NA"
      ],
      [
        1977,
        "NA"
      ],
      [
        1978,
        "NA"
      ],
      [
        1979,
        "NA"
      ],
      [
        1980,
        "NA"
      ],
      [
        1981,
        "NA"
      ],
      [
        1982,
        "NA"
      ],
      [
        1983,
        "NA"
      ],
      [
        1984,
        "NA"
      ],
      [
        1985,
        "NA"
      ],
      [
        1986,
        "NA"
      ],
      [
        1987,
        "NA"
      ],
      [
        1988,
        "NA"
      ],
      [
        1989,
        "NA"
      ],
      [
        1990,
        "NA"
      ],
      [
        1991,
        "NA"
      ],
      [
        1992,
        "NA"
      ],
      [
        1993,
        "NA"
      ],
      [
        1994,
        "NA"
      ],
      [
        1995,
        "NA"
      ],
      [
        1996,
        "NA"
      ],
      [
        1997,
        "NA"
      ],
      [
        1998,
        "NA"
      ],
      [
        1999,
        47.0
      ],
      [
        2000,
        "NA"
      ],
      [
        2001,
        "NA"
      ],
      [
        2002,
        "NA"
      ],
      [
        2003,
        "NA"
      ],
      [
        2004,
        "NA"
      ],
      [
        2005,
        "NA"
      ],
      [
        2006,
        "NA"
      ],
      [
        2007,
        "NA"
      ],
      [
        2008,
        "NA"
      ],
      [
        2009,
        "NA"
      ],
      [
        2010,
        "NA"
      ],
      [
        2011,
        "NA"
      ],
      [
        2012,
        "NA"
      ],
      [
        2013,
        "NA"
      ],
      [
        2014,
        "NA"
      ],
      [
        2015,
        "NA"
      ],
      [
        2016,
        "NA"
      ],
      [
        2017,
        "NA"
      ],
      [
        2018,
        "NA"
      ],
      [
        2019,
        "NA"
      ]
    ],
    "emploi_agri": [
      [
        1960,
        "NA"
      ],
      [
        1961,
        "NA"
      ],
      [
        1962,
        "NA"
      ],
      [
        1963,
        "NA"
      ],
      [
        1964,
        "NA"
      ],
      [
        1965,
        "NA"
      ],
      [
        1966,
        "NA"
      ],
      [
        1967,
        "NA"
      ],
      [
        1968,
        "NA"
      ],
      [
        1969,
        "NA"
      ],
      [
        1970,
        "NA"
      ],
      [
        1971,
        "NA"
      ],
      [
        1972,
        "NA"
      ],
      [
        1973,
        "NA"
      ],
      [
        1974,
        "NA"
      ],
      [
        1975,
        "NA"
      ],
      [
        1976,
        "NA"
      ],
      [
        1977,
        "NA"
      ],
      [
        1978,
        "NA"
      ],
      [
        1979,
        "NA"
      ],
      [
        1980,
        "NA"
      ],
      [
        1981,
        "NA"
      ],
      [
        1982,
        "NA"
      ],
      [
        1983,
        "NA"
      ],
      [
        1984,
        "NA"
      ],
      [
        1985,
        "NA"
      ],
      [
        1986,
        "NA"
      ],
      [
        1987,
        "NA"
      ],
      [
        1988,
        "NA"
      ],
      [
        1989,
        "NA"
      ],
      [
        1990,
        "NA"
      ],
      [
        1991,
        57.8540000916
      ],
      [
        1992,
        57.6040000916
      ],
      [
        1993,
        57.5190010071
      ],
      [
        1994,
        57.7480010986
      ],
      [
        1995,
        57.63000106810001
      ],
      [
        1996,
        57.7089996338
      ],
      [
        1997,
        57.5120010376
      ],
      [
        1998,
        57.443000793500005
      ],
      [
        1999,
        57.3149986267
      ],
      [
        2000,
        56.63299942020001
      ],
      [
        2001,
        56.40599823
      ],
      [
        2002,
        56.172000885
      ],
      [
        2003,
        55.943000793500005
      ],
      [
        2004,
        55.71900177
      ],
      [
        2005,
        55.4119987488
      ],
      [
        2006,
        55.1240005493
      ],
      [
        2007,
        54.930000305200004
      ],
      [
        2008,
        54.5040016174
      ],
      [
        2009,
        54.153999328599994
      ],
      [
        2010,
        53.7490005493
      ],
      [
        2011,
        53.297000885
      ],
      [
        2012,
        52.8880004883
      ],
      [
        2013,
        52.3810005188
      ],
      [
        2014,
        52.054000854499996
      ],
      [
        2015,
        51.798000335699996
      ],
      [
        2016,
        51.445999145500004
      ],
      [
        2017,
        51.039001464799995
      ],
      [
        2018,
        50.611000061000006
      ],
      [
        2019,
        50.375
      ]
    ],
    "enseignant_primaire": [
      [
        1960,
        "NA"
      ],
      [
        1961,
        "NA"
      ],
      [
        1962,
        "NA"
      ],
      [
        1963,
        "NA"
      ],
      [
        1964,
        "NA"
      ],
      [
        1965,
        "NA"
      ],
      [
        1966,
        "NA"
      ],
      [
        1967,
        "NA"
      ],
      [
        1968,
        "NA"
      ],
      [
        1969,
        "NA"
      ],
      [
        1970,
        "NA"
      ],
      [
        1971,
        "NA"
      ],
      [
        1972,
        "NA"
      ],
      [
        1973,
        "NA"
      ],
      [
        1974,
        "NA"
      ],
      [
        1975,
        "NA"
      ],
      [
        1976,
        "NA"
      ],
      [
        1977,
        "NA"
      ],
      [
        1978,
        "NA"
      ],
      [
        1979,
        "NA"
      ],
      [
        1980,
        "NA"
      ],
      [
        1981,
        "NA"
      ],
      [
        1982,
        "NA"
      ],
      [
        1983,
        "NA"
      ],
      [
        1984,
        "NA"
      ],
      [
        1985,
        "NA"
      ],
      [
        1986,
        "NA"
      ],
      [
        1987,
        "NA"
      ],
      [
        1988,
        "NA"
      ],
      [
        1989,
        "NA"
      ],
      [
        1990,
        "NA"
      ],
      [
        1991,
        "NA"
      ],
      [
        1992,
        "NA"
      ],
      [
        1993,
        "NA"
      ],
      [
        1994,
        "NA"
      ],
      [
        1995,
        "NA"
      ],
      [
        1996,
        "NA"
      ],
      [
        1997,
        "NA"
      ],
      [
        1998,
        "NA"
      ],
      [
        1999,
        "NA"
      ],
      [
        2000,
        "NA"
      ],
      [
        2001,
        "NA"
      ],
      [
        2002,
        "NA"
      ],
      [
        2003,
        "NA"
      ],
      [
        2004,
        "NA"
      ],
      [
        2005,
        "NA"
      ],
      [
        2006,
        "NA"
      ],
      [
        2007,
        "NA"
      ],
      [
        2008,
        57.421980000000005
      ],
      [
        2009,
        "NA"
      ],
      [
        2010,
        "NA"
      ],
      [
        2011,
        55.15353
      ],
      [
        2012,
        "NA"
      ],
      [
        2013,
        "NA"
      ],
      [
        2014,
        "NA"
      ],
      [
        2015,
        "NA"
      ],
      [
        2016,
        "NA"
      ],
      [
        2017,
        "NA"
      ],
      [
        2018,
        "NA"
      ],
      [
        2019,
        "NA"
      ]
    ],
    "enseignant_secondaire": [
      [
        1960,
        "NA"
      ],
      [
        1961,
        "NA"
      ],
      [
        1962,
        "NA"
      ],
      [
        1963,
        "NA"
      ],
      [
        1964,
        "NA"
      ],
      [
        1965,
        "NA"
      ],
      [
        1966,
        "NA"
      ],
      [
        1967,
        "NA"
      ],
      [
        1968,
        "NA"
      ],
      [
        1969,
        "NA"
      ],
      [
        1970,
        "NA"
      ],
      [
        1971,
        "NA"
      ],
      [
        1972,
        "NA"
      ],
      [
        1973,
        "NA"
      ],
      [
        1974,
        "NA"
      ],
      [
        1975,
        "NA"
      ],
      [
        1976,
        "NA"
      ],
      [
        1977,
        "NA"
      ],
      [
        1978,
        "NA"
      ],
      [
        1979,
        "NA"
      ],
      [
        1980,
        "NA"
      ],
      [
        1981,
        "NA"
      ],
      [
        1982,
        "NA"
      ],
      [
        1983,
        "NA"
      ],
      [
        1984,
        "NA"
      ],
      [
        1985,
        "NA"
      ],
      [
        1986,
        "NA"
      ],
      [
        1987,
        "NA"
      ],
      [
        1988,
        "NA"
      ],
      [
        1989,
        "NA"
      ],
      [
        1990,
        "NA"
      ],
      [
        1991,
        "NA"
      ],
      [
        1992,
        "NA"
      ],
      [
        1993,
        "NA"
      ],
      [
        1994,
        "NA"
      ],
      [
        1995,
        "NA"
      ],
      [
        1996,
        "NA"
      ],
      [
        1997,
        "NA"
      ],
      [
        1998,
        "NA"
      ],
      [
        1999,
        "NA"
      ],
      [
        2000,
        "NA"
      ],
      [
        2001,
        "NA"
      ],
      [
        2002,
        "NA"
      ],
      [
        2003,
        51.19153
      ],
      [
        2004,
        "NA"
      ],
      [
        2005,
        "NA"
      ],
      [
        2006,
        "NA"
      ],
      [
        2007,
        "NA"
      ],
      [
        2008,
        "NA"
      ],
      [
        2009,
        "NA"
      ],
      [
        2010,
        "NA"
      ],
      [
        2011,
        "NA"
      ],
      [
        2012,
        "NA"
      ],
      [
        2013,
        "NA"
      ],
      [
        2014,
        "NA"
      ],
      [
        2015,
        "NA"
      ],
      [
        2016,
        "NA"
      ],
      [
        2017,
        "NA"
      ],
      [
        2018,
        "NA"
      ],
      [
        2019,
        "NA"
      ]
    ],
    "frag_pol": [
      [
        2006,
        1.0
      ],
      [
        2007,
        1.0
      ],
      [
        2008,
        1.0
      ],
      [
        2009,
        1.0
      ],
      [
        2010,
        1.0
      ],
      [
        2011,
        1.0
      ],
      [
        2012,
        1.0
      ],
      [
        2013,
        1.0
      ],
      [
        2014,
        1.0
      ],
      [
        2015,
        1.0
      ],
      [
        2016,
        1.0
      ],
      [
        2017,
        1.0
      ]
    ],
    "idh": [
      [
        1990,
        "NA"
      ],
      [
        1991,
        "NA"
      ],
      [
        1992,
        "NA"
      ],
      [
        1993,
        "NA"
      ],
      [
        1994,
        "NA"
      ],
      [
        1995,
        "NA"
      ],
      [
        1996,
        "NA"
      ],
      [
        1997,
        "NA"
      ],
      [
        1998,
        "NA"
      ],
      [
        1999,
        "NA"
      ],
      [
        2000,
        "NA"
      ],
      [
        2001,
        "NA"
      ],
      [
        2002,
        "NA"
      ],
      [
        2003,
        "NA"
      ],
      [
        2004,
        0.449
      ],
      [
        2005,
        0.455
      ],
      [
        2006,
        0.461
      ],
      [
        2007,
        0.466
      ],
      [
        2008,
        0.47
      ],
      [
        2009,
        0.476
      ],
      [
        2010,
        0.482
      ],
      [
        2011,
        0.487
      ],
      [
        2012,
        0.493
      ],
      [
        2013,
        0.499
      ],
      [
        2014,
        0.501
      ],
      [
        2015,
        0.502
      ],
      [
        2016,
        0.502
      ],
      [
        2017,
        0.503
      ]
    ],
    "lib_monde": [
      [
        2013,
        2.0
      ],
      [
        2014,
        2.0
      ],
      [
        2015,
        2.0
      ],
      [
        2016,
        2.0
      ],
      [
        2017,
        2.0
      ],
      [
        2018,
        2.0
      ]
    ],
    "migration": [
      [
        1955,
        0.0
      ],
      [
        1960,
        -6.666
      ],
      [
        1965,
        -8.522
      ],
      [
        1970,
        -5.029
      ],
      [
        1975,
        -4.513999999999999
      ],
      [
        1980,
        7.077999999999999
      ],
      [
        1985,
        -2.714
      ],
      [
        1990,
        -2.347
      ],
      [
        1995,
        -1.3530000000000002
      ],
      [
        2000,
        -2.358
      ],
      [
        2005,
        -3.466
      ],
      [
        2010,
        -3.074
      ],
      [
        2015,
        -2.7260000000000004
      ],
      [
        2020,
        -2.4290000000000003
      ],
      [
        2025,
        -2.18
      ],
      [
        2030,
        -1.972
      ],
      [
        2035,
        -1.796
      ],
      [
        2040,
        -1.646
      ],
      [
        2045,
        -1.517
      ],
      [
        2050,
        -1.4080000000000001
      ],
      [
        2055,
        -1.315
      ],
      [
        2060,
        -1.236
      ],
      [
        2065,
        -1.169
      ],
      [
        2070,
        -1.112
      ],
      [
        2075,
        -1.064
      ],
      [
        2080,
        -1.023
      ],
      [
        2085,
        -0.99
      ],
      [
        2090,
        -0.9620000000000001
      ],
      [
        2095,
        -0.94
      ],
      [
        2100,
        -0.922
      ]
    ],
    "mortal_infant": [
      [
        1960,
        "NA"
      ],
      [
        1961,
        "NA"
      ],
      [
        1962,
        "NA"
      ],
      [
        1963,
        "NA"
      ],
      [
        1964,
        "NA"
      ],
      [
        1965,
        "NA"
      ],
      [
        1966,
        "NA"
      ],
      [
        1967,
        "NA"
      ],
      [
        1968,
        "NA"
      ],
      [
        1969,
        "NA"
      ],
      [
        1970,
        227.1
      ],
      [
        1971,
        221.9
      ],
      [
        1972,
        217.6
      ],
      [
        1973,
        212.7
      ],
      [
        1974,
        207.8
      ],
      [
        1975,
        203.0
      ],
      [
        1976,
        197.9
      ],
      [
        1977,
        192.6
      ],
      [
        1978,
        186.9
      ],
      [
        1979,
        181.1
      ],
      [
        1980,
        175.2
      ],
      [
        1981,
        169.4
      ],
      [
        1982,
        163.6
      ],
      [
        1983,
        157.8
      ],
      [
        1984,
        152.3
      ],
      [
        1985,
        147.3
      ],
      [
        1986,
        142.3
      ],
      [
        1987,
        137.7
      ],
      [
        1988,
        133.4
      ],
      [
        1989,
        129.3
      ],
      [
        1990,
        125.3
      ],
      [
        1991,
        121.3
      ],
      [
        1992,
        117.4
      ],
      [
        1993,
        113.7
      ],
      [
        1994,
        110.6
      ],
      [
        1995,
        108.1
      ],
      [
        1996,
        106.0
      ],
      [
        1997,
        104.3
      ],
      [
        1998,
        103.1
      ],
      [
        1999,
        102.3
      ],
      [
        2000,
        101.9
      ],
      [
        2001,
        101.9
      ],
      [
        2002,
        102.0
      ],
      [
        2003,
        101.8
      ],
      [
        2004,
        100.9
      ],
      [
        2005,
        99.3
      ],
      [
        2006,
        97.3
      ],
      [
        2007,
        95.2
      ],
      [
        2008,
        92.4
      ],
      [
        2009,
        89.8
      ],
      [
        2010,
        87.1
      ],
      [
        2011,
        84.9
      ],
      [
        2012,
        82.3
      ],
      [
        2013,
        79.5
      ],
      [
        2014,
        77.1
      ],
      [
        2015,
        74.9
      ],
      [
        2016,
        72.3
      ],
      [
        2017,
        69.9
      ],
      [
        2018,
        67.5
      ],
      [
        2019,
        "NA"
      ]
    ],
    "pib": [
      [
        1980,
        0.242
      ],
      [
        1981,
        0.212
      ],
      [
        1982,
        0.201
      ],
      [
        1983,
        0.195
      ],
      [
        1984,
        0.188
      ],
      [
        1985,
        0.191
      ],
      [
        1986,
        0.257
      ],
      [
        1987,
        0.312
      ],
      [
        1988,
        0.336
      ],
      [
        1989,
        0.32799999999999996
      ],
      [
        1990,
        0.401
      ],
      [
        1991,
        0.4
      ],
      [
        1992,
        0.436
      ],
      [
        1993,
        0.42700000000000005
      ],
      [
        1994,
        0.314
      ],
      [
        1995,
        0.392
      ],
      [
        1996,
        0.392
      ],
      [
        1997,
        0.36200000000000004
      ],
      [
        1998,
        0.363
      ],
      [
        1999,
        0.37200000000000005
      ],
      [
        2000,
        0.33899999999999997
      ],
      [
        2001,
        0.373
      ],
      [
        2002,
        0.42700000000000005
      ],
      [
        2003,
        0.547
      ],
      [
        2004,
        0.622
      ],
      [
        2005,
        0.6559999999999999
      ],
      [
        2006,
        0.6890000000000001
      ],
      [
        2007,
        0.7959999999999999
      ],
      [
        2008,
        0.9159999999999999
      ],
      [
        2009,
        0.904
      ],
      [
        2010,
        0.909
      ],
      [
        2011,
        1.023
      ],
      [
        2012,
        1.016
      ],
      [
        2013,
        1.1159999999999999
      ],
      [
        2014,
        1.15
      ],
      [
        2015,
        0.9890000000000001
      ],
      [
        2016,
        1.0270000000000001
      ],
      [
        2017,
        1.081
      ],
      [
        2018,
        1.1840000000000002
      ],
      [
        2019,
        1.179
      ],
      [
        2020,
        1.25
      ],
      [
        2021,
        1.331
      ],
      [
        2022,
        1.413
      ],
      [
        2023,
        1.5
      ],
      [
        2024,
        1.594
      ]
    ],
    "pib_hab": [
      [
        1980,
        684.569
      ],
      [
        1981,
        584.519
      ],
      [
        1982,
        541.617
      ],
      [
        1983,
        513.524
      ],
      [
        1984,
        490.13699999999994
      ],
      [
        1985,
        482.69699999999995
      ],
      [
        1986,
        629.744
      ],
      [
        1987,
        741.2760000000001
      ],
      [
        1988,
        772.133
      ],
      [
        1989,
        731.08
      ],
      [
        1990,
        868.945
      ],
      [
        1991,
        895.707
      ],
      [
        1992,
        955.4739999999999
      ],
      [
        1993,
        916.695
      ],
      [
        1994,
        660.355
      ],
      [
        1995,
        806.805
      ],
      [
        1996,
        789.145
      ],
      [
        1997,
        714.2719999999999
      ],
      [
        1998,
        701.452
      ],
      [
        1999,
        703.067
      ],
      [
        2000,
        628.071
      ],
      [
        2001,
        675.05
      ],
      [
        2002,
        757.3989999999999
      ],
      [
        2003,
        949.68
      ],
      [
        2004,
        1055.357
      ],
      [
        2005,
        1085.6589999999999
      ],
      [
        2006,
        1110.984
      ],
      [
        2007,
        1251.857
      ],
      [
        2008,
        1403.796
      ],
      [
        2009,
        1351.145
      ],
      [
        2010,
        1322.638
      ],
      [
        2011,
        1450.1589999999999
      ],
      [
        2012,
        1403.4170000000001
      ],
      [
        2013,
        1500.731
      ],
      [
        2014,
        1505.1779999999999
      ],
      [
        2015,
        1259.8339999999998
      ],
      [
        2016,
        1274.441
      ],
      [
        2017,
        1304.769
      ],
      [
        2018,
        1391.3829999999998
      ],
      [
        2019,
        1349.7939999999999
      ],
      [
        2020,
        1392.9379999999999
      ],
      [
        2021,
        1445.068
      ],
      [
        2022,
        1494.8670000000002
      ],
      [
        2023,
        1546.6589999999999
      ],
      [
        2024,
        1602.2179999999998
      ]
    ],
    "pib_ppa": [
      [
        1980,
        0.34
      ],
      [
        1981,
        0.39299999999999996
      ],
      [
        1982,
        0.434
      ],
      [
        1983,
        0.465
      ],
      [
        1984,
        0.502
      ],
      [
        1985,
        0.532
      ],
      [
        1986,
        0.555
      ],
      [
        1987,
        0.581
      ],
      [
        1988,
        0.632
      ],
      [
        1989,
        0.6509999999999999
      ],
      [
        1990,
        0.725
      ],
      [
        1991,
        0.7040000000000001
      ],
      [
        1992,
        0.773
      ],
      [
        1993,
        0.8109999999999999
      ],
      [
        1994,
        0.795
      ],
      [
        1995,
        0.858
      ],
      [
        1996,
        0.8690000000000001
      ],
      [
        1997,
        0.9229999999999999
      ],
      [
        1998,
        0.9329999999999999
      ],
      [
        1999,
        0.972
      ],
      [
        2000,
        0.985
      ],
      [
        2001,
        1.061
      ],
      [
        2002,
        1.127
      ],
      [
        2003,
        1.171
      ],
      [
        2004,
        1.24
      ],
      [
        2005,
        1.3519999999999999
      ],
      [
        2006,
        1.367
      ],
      [
        2007,
        1.415
      ],
      [
        2008,
        1.5
      ],
      [
        2009,
        1.561
      ],
      [
        2010,
        1.6380000000000001
      ],
      [
        2011,
        1.742
      ],
      [
        2012,
        1.8319999999999999
      ],
      [
        2013,
        1.9469999999999998
      ],
      [
        2014,
        2.025
      ],
      [
        2015,
        2.072
      ],
      [
        2016,
        2.166
      ],
      [
        2017,
        2.299
      ],
      [
        2018,
        2.441
      ],
      [
        2019,
        2.53
      ],
      [
        2020,
        2.516
      ],
      [
        2021,
        2.645
      ]
    ],
    "pop_pauvrete": [
      [
        1960,
        "NA"
      ],
      [
        1961,
        "NA"
      ],
      [
        1962,
        "NA"
      ],
      [
        1963,
        "NA"
      ],
      [
        1964,
        "NA"
      ],
      [
        1965,
        "NA"
      ],
      [
        1966,
        "NA"
      ],
      [
        1967,
        "NA"
      ],
      [
        1968,
        "NA"
      ],
      [
        1969,
        "NA"
      ],
      [
        1970,
        "NA"
      ],
      [
        1971,
        "NA"
      ],
      [
        1972,
        "NA"
      ],
      [
        1973,
        "NA"
      ],
      [
        1974,
        "NA"
      ],
      [
        1975,
        "NA"
      ],
      [
        1976,
        "NA"
      ],
      [
        1977,
        "NA"
      ],
      [
        1978,
        "NA"
      ],
      [
        1979,
        "NA"
      ],
      [
        1980,
        "NA"
      ],
      [
        1981,
        "NA"
      ],
      [
        1982,
        "NA"
      ],
      [
        1983,
        "NA"
      ],
      [
        1984,
        "NA"
      ],
      [
        1985,
        "NA"
      ],
      [
        1986,
        "NA"
      ],
      [
        1987,
        "NA"
      ],
      [
        1988,
        "NA"
      ],
      [
        1989,
        "NA"
      ],
      [
        1990,
        "NA"
      ],
      [
        1991,
        "NA"
      ],
      [
        1992,
        "NA"
      ],
      [
        1993,
        "NA"
      ],
      [
        1994,
        "NA"
      ],
      [
        1995,
        "NA"
      ],
      [
        1996,
        "NA"
      ],
      [
        1997,
        "NA"
      ],
      [
        1998,
        "NA"
      ],
      [
        1999,
        "NA"
      ],
      [
        2000,
        "NA"
      ],
      [
        2001,
        "NA"
      ],
      [
        2002,
        "NA"
      ],
      [
        2003,
        "NA"
      ],
      [
        2004,
        13.5
      ],
      [
        2005,
        "NA"
      ],
      [
        2006,
        "NA"
      ],
      [
        2007,
        "NA"
      ],
      [
        2008,
        "NA"
      ],
      [
        2009,
        "NA"
      ],
      [
        2010,
        "NA"
      ],
      [
        2011,
        "NA"
      ],
      [
        2012,
        "NA"
      ],
      [
        2013,
        "NA"
      ],
      [
        2014,
        17.6
      ],
      [
        2015,
        "NA"
      ],
      [
        2016,
        "NA"
      ],
      [
        2017,
        "NA"
      ],
      [
        2018,
        "NA"
      ],
      [
        2019,
        "NA"
      ]
    ],
    "pop_rurale": [
      [
        1960,
        87.449
      ],
      [
        1961,
        86.652
      ],
      [
        1962,
        85.811
      ],
      [
        1963,
        84.926
      ],
      [
        1964,
        83.99600000000001
      ],
      [
        1965,
        83.022
      ],
      [
        1966,
        82.0
      ],
      [
        1967,
        81.66
      ],
      [
        1968,
        81.315
      ],
      [
        1969,
        80.965
      ],
      [
        1970,
        80.61
      ],
      [
        1971,
        80.25
      ],
      [
        1972,
        79.885
      ],
      [
        1973,
        79.516
      ],
      [
        1974,
        79.141
      ],
      [
        1975,
        78.76100000000001
      ],
      [
        1976,
        78.375
      ],
      [
        1977,
        77.986
      ],
      [
        1978,
        77.59
      ],
      [
        1979,
        77.19
      ],
      [
        1980,
        76.785
      ],
      [
        1981,
        76.351
      ],
      [
        1982,
        75.905
      ],
      [
        1983,
        75.452
      ],
      [
        1984,
        74.994
      ],
      [
        1985,
        74.531
      ],
      [
        1986,
        74.062
      ],
      [
        1987,
        73.587
      ],
      [
        1988,
        73.107
      ],
      [
        1989,
        72.622
      ],
      [
        1990,
        72.131
      ],
      [
        1991,
        71.634
      ],
      [
        1992,
        71.565
      ],
      [
        1993,
        71.61
      ],
      [
        1994,
        71.654
      ],
      [
        1995,
        71.699
      ],
      [
        1996,
        71.743
      ],
      [
        1997,
        71.78699999999999
      ],
      [
        1998,
        71.832
      ],
      [
        1999,
        71.876
      ],
      [
        2000,
        71.92
      ],
      [
        2001,
        71.964
      ],
      [
        2002,
        72.008
      ],
      [
        2003,
        72.053
      ],
      [
        2004,
        72.097
      ],
      [
        2005,
        72.125
      ],
      [
        2006,
        72.137
      ],
      [
        2007,
        72.133
      ],
      [
        2008,
        72.11399999999999
      ],
      [
        2009,
        72.079
      ],
      [
        2010,
        72.027
      ],
      [
        2011,
        71.96
      ],
      [
        2012,
        71.877
      ],
      [
        2013,
        71.777
      ],
      [
        2014,
        71.66199999999999
      ],
      [
        2015,
        71.53
      ],
      [
        2016,
        71.381
      ],
      [
        2017,
        71.21600000000001
      ],
      [
        2018,
        71.035
      ],
      [
        2019,
        "NA"
      ]
    ],
    "pop_tot": [
      [
        1950,
        0.159459
      ],
      [
        1951,
        0.163139
      ],
      [
        1952,
        0.166541
      ],
      [
        1953,
        0.169752
      ],
      [
        1954,
        0.172853
      ],
      [
        1955,
        0.175903
      ],
      [
        1956,
        0.178946
      ],
      [
        1957,
        0.18199200000000001
      ],
      [
        1958,
        0.185043
      ],
      [
        1959,
        0.188097
      ],
      [
        1960,
        0.191121
      ],
      [
        1961,
        0.194139
      ],
      [
        1962,
        0.197198
      ],
      [
        1963,
        0.200372
      ],
      [
        1964,
        0.203753
      ],
      [
        1965,
        0.20742399999999997
      ],
      [
        1966,
        0.21147800000000003
      ],
      [
        1967,
        0.215897
      ],
      [
        1968,
        0.220575
      ],
      [
        1969,
        0.225325
      ],
      [
        1970,
        0.230054
      ],
      [
        1971,
        0.234644
      ],
      [
        1972,
        0.239235
      ],
      [
        1973,
        0.24420799999999998
      ],
      [
        1974,
        0.250104
      ],
      [
        1975,
        0.25729
      ],
      [
        1976,
        0.265953
      ],
      [
        1977,
        0.2759
      ],
      [
        1978,
        0.286634
      ],
      [
        1979,
        0.29744699999999996
      ],
      [
        1980,
        0.307829
      ],
      [
        1981,
        0.317606
      ],
      [
        1982,
        0.326946
      ],
      [
        1983,
        0.336096
      ],
      [
        1984,
        0.345466
      ],
      [
        1985,
        0.355337
      ],
      [
        1986,
        0.36576
      ],
      [
        1987,
        0.376654
      ],
      [
        1988,
        0.387963
      ],
      [
        1989,
        0.39963200000000004
      ],
      [
        1990,
        0.41159399999999996
      ],
      [
        1991,
        0.423872
      ],
      [
        1992,
        0.43644799999999995
      ],
      [
        1993,
        0.44927399999999995
      ],
      [
        1994,
        0.46227700000000005
      ],
      [
        1995,
        0.475394
      ],
      [
        1996,
        0.488627
      ],
      [
        1997,
        0.501953
      ],
      [
        1998,
        0.515385
      ],
      [
        1999,
        0.528848
      ],
      [
        2000,
        0.542357
      ],
      [
        2001,
        0.555888
      ],
      [
        2002,
        0.5694790000000001
      ],
      [
        2003,
        0.5832109999999999
      ],
      [
        2004,
        0.597228
      ],
      [
        2005,
        0.6116269999999999
      ],
      [
        2006,
        0.626425
      ],
      [
        2007,
        0.64162
      ],
      [
        2008,
        0.6572290000000001
      ],
      [
        2009,
        0.6732520000000001
      ],
      [
        2010,
        0.689692
      ],
      [
        2011,
        0.706569
      ],
      [
        2012,
        0.7238709999999999
      ],
      [
        2013,
        0.741505
      ],
      [
        2014,
        0.75939
      ],
      [
        2015,
        0.777424
      ],
      [
        2016,
        0.795592
      ],
      [
        2017,
        0.8138920000000001
      ],
      [
        2018,
        0.8323219999999999
      ],
      [
        2019,
        0.8508859999999999
      ],
      [
        2020,
        0.8696010000000001
      ],
      [
        2021,
        0.888451
      ],
      [
        2022,
        0.9074190000000001
      ],
      [
        2023,
        0.926501
      ],
      [
        2024,
        0.945702
      ],
      [
        2025,
        0.965003
      ],
      [
        2026,
        0.984417
      ],
      [
        2027,
        1.0039280000000002
      ],
      [
        2028,
        1.02354
      ],
      [
        2029,
        1.0432750000000002
      ],
      [
        2030,
        1.063114
      ],
      [
        2031,
        1.0830609999999998
      ],
      [
        2032,
        1.103114
      ],
      [
        2033,
        1.123262
      ],
      [
        2034,
        1.14349
      ],
      [
        2035,
        1.163802
      ],
      [
        2036,
        1.1841890000000002
      ],
      [
        2037,
        1.204641
      ],
      [
        2038,
        1.22516
      ],
      [
        2039,
        1.245722
      ],
      [
        2040,
        1.266331
      ],
      [
        2041,
        1.286977
      ],
      [
        2042,
        1.307634
      ],
      [
        2043,
        1.328303
      ],
      [
        2044,
        1.348969
      ],
      [
        2045,
        1.369592
      ],
      [
        2046,
        1.390175
      ],
      [
        2047,
        1.4107040000000002
      ],
      [
        2048,
        1.431159
      ],
      [
        2049,
        1.451511
      ],
      [
        2050,
        1.471737
      ],
      [
        2051,
        1.491825
      ],
      [
        2052,
        1.511771
      ],
      [
        2053,
        1.531564
      ],
      [
        2054,
        1.551215
      ],
      [
        2055,
        1.5707440000000001
      ],
      [
        2056,
        1.5901239999999999
      ],
      [
        2057,
        1.609339
      ],
      [
        2058,
        1.628399
      ],
      [
        2059,
        1.6472630000000001
      ],
      [
        2060,
        1.665915
      ],
      [
        2061,
        1.6843549999999998
      ],
      [
        2062,
        1.7025720000000002
      ],
      [
        2063,
        1.720582
      ],
      [
        2064,
        1.738384
      ],
      [
        2065,
        1.755986
      ],
      [
        2066,
        1.773394
      ],
      [
        2067,
        1.7905799999999998
      ],
      [
        2068,
        1.8075459999999999
      ],
      [
        2069,
        1.824275
      ],
      [
        2070,
        1.840745
      ],
      [
        2071,
        1.856943
      ],
      [
        2072,
        1.872888
      ],
      [
        2073,
        1.888553
      ],
      [
        2074,
        1.903923
      ],
      [
        2075,
        1.9189900000000002
      ],
      [
        2076,
        1.933748
      ],
      [
        2077,
        1.94819
      ],
      [
        2078,
        1.962316
      ],
      [
        2079,
        1.976134
      ],
      [
        2080,
        1.989643
      ],
      [
        2081,
        2.002844
      ],
      [
        2082,
        2.01572
      ],
      [
        2083,
        2.02827
      ],
      [
        2084,
        2.040473
      ],
      [
        2085,
        2.052312
      ],
      [
        2086,
        2.063791
      ],
      [
        2087,
        2.074895
      ],
      [
        2088,
        2.0856369999999997
      ],
      [
        2089,
        2.096019
      ],
      [
        2090,
        2.106045
      ],
      [
        2091,
        2.115707
      ],
      [
        2092,
        2.12501
      ],
      [
        2093,
        2.1339520000000003
      ],
      [
        2094,
        2.142529
      ],
      [
        2095,
        2.150748
      ],
      [
        2096,
        2.1586030000000003
      ],
      [
        2097,
        2.166096
      ],
      [
        2098,
        2.173238
      ],
      [
        2099,
        2.180037
      ],
      [
        2100,
        2.186505
      ]
    ],
    "pop_urbaine": [
      [
        1960,
        12.550999999999998
      ],
      [
        1961,
        13.347999999999999
      ],
      [
        1962,
        14.189
      ],
      [
        1963,
        15.074000000000002
      ],
      [
        1964,
        16.004
      ],
      [
        1965,
        16.977999999999998
      ],
      [
        1966,
        18.0
      ],
      [
        1967,
        18.34
      ],
      [
        1968,
        18.685
      ],
      [
        1969,
        19.035
      ],
      [
        1970,
        19.39
      ],
      [
        1971,
        19.75
      ],
      [
        1972,
        20.115
      ],
      [
        1973,
        20.484
      ],
      [
        1974,
        20.859
      ],
      [
        1975,
        21.239
      ],
      [
        1976,
        21.625
      ],
      [
        1977,
        22.014
      ],
      [
        1978,
        22.41
      ],
      [
        1979,
        22.81
      ],
      [
        1980,
        23.215
      ],
      [
        1981,
        23.649
      ],
      [
        1982,
        24.095
      ],
      [
        1983,
        24.548000000000002
      ],
      [
        1984,
        25.006
      ],
      [
        1985,
        25.469
      ],
      [
        1986,
        25.938000000000002
      ],
      [
        1987,
        26.413
      ],
      [
        1988,
        26.893
      ],
      [
        1989,
        27.378
      ],
      [
        1990,
        27.869
      ],
      [
        1991,
        28.366
      ],
      [
        1992,
        28.435
      ],
      [
        1993,
        28.39
      ],
      [
        1994,
        28.346
      ],
      [
        1995,
        28.301
      ],
      [
        1996,
        28.256999999999998
      ],
      [
        1997,
        28.213
      ],
      [
        1998,
        28.168000000000003
      ],
      [
        1999,
        28.124000000000002
      ],
      [
        2000,
        28.08
      ],
      [
        2001,
        28.035999999999998
      ],
      [
        2002,
        27.991999999999997
      ],
      [
        2003,
        27.947
      ],
      [
        2004,
        27.903000000000002
      ],
      [
        2005,
        27.875
      ],
      [
        2006,
        27.863000000000003
      ],
      [
        2007,
        27.866999999999997
      ],
      [
        2008,
        27.886
      ],
      [
        2009,
        27.921
      ],
      [
        2010,
        27.973000000000003
      ],
      [
        2011,
        28.04
      ],
      [
        2012,
        28.123
      ],
      [
        2013,
        28.223000000000003
      ],
      [
        2014,
        28.338
      ],
      [
        2015,
        28.47
      ],
      [
        2016,
        28.619
      ],
      [
        2017,
        28.784000000000002
      ],
      [
        2018,
        28.965
      ],
      [
        2019,
        "NA"
      ]
    ],
    "prod_elec_renouv": [
      [
        1960,
        "NA"
      ],
      [
        1961,
        "NA"
      ],
      [
        1962,
        "NA"
      ],
      [
        1963,
        "NA"
      ],
      [
        1964,
        "NA"
      ],
      [
        1965,
        "NA"
      ],
      [
        1966,
        "NA"
      ],
      [
        1967,
        "NA"
      ],
      [
        1968,
        "NA"
      ],
      [
        1969,
        "NA"
      ],
      [
        1970,
        "NA"
      ],
      [
        1971,
        "NA"
      ],
      [
        1972,
        "NA"
      ],
      [
        1973,
        "NA"
      ],
      [
        1974,
        "NA"
      ],
      [
        1975,
        "NA"
      ],
      [
        1976,
        "NA"
      ],
      [
        1977,
        "NA"
      ],
      [
        1978,
        "NA"
      ],
      [
        1979,
        "NA"
      ],
      [
        1980,
        "NA"
      ],
      [
        1981,
        "NA"
      ],
      [
        1982,
        "NA"
      ],
      [
        1983,
        "NA"
      ],
      [
        1984,
        "NA"
      ],
      [
        1985,
        "NA"
      ],
      [
        1986,
        "NA"
      ],
      [
        1987,
        "NA"
      ],
      [
        1988,
        "NA"
      ],
      [
        1989,
        "NA"
      ],
      [
        1990,
        "NA"
      ],
      [
        1991,
        "NA"
      ],
      [
        1992,
        "NA"
      ],
      [
        1993,
        "NA"
      ],
      [
        1994,
        "NA"
      ],
      [
        1995,
        "NA"
      ],
      [
        1996,
        "NA"
      ],
      [
        1997,
        "NA"
      ],
      [
        1998,
        "NA"
      ],
      [
        1999,
        "NA"
      ],
      [
        2000,
        "NA"
      ],
      [
        2001,
        "NA"
      ],
      [
        2002,
        "NA"
      ],
      [
        2003,
        "NA"
      ],
      [
        2004,
        "NA"
      ],
      [
        2005,
        "NA"
      ],
      [
        2006,
        "NA"
      ],
      [
        2007,
        "NA"
      ],
      [
        2008,
        "NA"
      ],
      [
        2009,
        "NA"
      ],
      [
        2010,
        "NA"
      ],
      [
        2011,
        "NA"
      ],
      [
        2012,
        "NA"
      ],
      [
        2013,
        "NA"
      ],
      [
        2014,
        "NA"
      ],
      [
        2015,
        "NA"
      ],
      [
        2016,
        "NA"
      ],
      [
        2017,
        "NA"
      ],
      [
        2018,
        "NA"
      ],
      [
        2019,
        "NA"
      ]
    ],
    "rdt_cerealier": [
      [
        1960,
        "NA"
      ],
      [
        1961,
        1107.8
      ],
      [
        1962,
        1118.8
      ],
      [
        1963,
        1083.7
      ],
      [
        1964,
        1162.4
      ],
      [
        1965,
        1094.9
      ],
      [
        1966,
        1086.7
      ],
      [
        1967,
        1099.3
      ],
      [
        1968,
        1188.5
      ],
      [
        1969,
        1097.6
      ],
      [
        1970,
        1097.6
      ],
      [
        1971,
        935.0
      ],
      [
        1972,
        1008.0
      ],
      [
        1973,
        1078.7
      ],
      [
        1974,
        1129.8
      ],
      [
        1975,
        1203.0
      ],
      [
        1976,
        1157.1
      ],
      [
        1977,
        1205.5
      ],
      [
        1978,
        1161.3
      ],
      [
        1979,
        1058.8
      ],
      [
        1980,
        1058.1
      ],
      [
        1981,
        1057.8
      ],
      [
        1982,
        1058.1
      ],
      [
        1983,
        1125.0
      ],
      [
        1984,
        1110.0
      ],
      [
        1985,
        1088.8
      ],
      [
        1986,
        1117.8
      ],
      [
        1987,
        1155.5
      ],
      [
        1988,
        1157.3
      ],
      [
        1989,
        1281.3
      ],
      [
        1990,
        1267.0
      ],
      [
        1991,
        1302.3
      ],
      [
        1992,
        1292.2
      ],
      [
        1993,
        1290.9
      ],
      [
        1994,
        1292.9
      ],
      [
        1995,
        1294.7
      ],
      [
        1996,
        1295.0
      ],
      [
        1997,
        1292.8
      ],
      [
        1998,
        1279.0
      ],
      [
        1999,
        1301.1
      ],
      [
        2000,
        1322.3
      ],
      [
        2001,
        1311.6
      ],
      [
        2002,
        1309.8
      ],
      [
        2003,
        1310.8
      ],
      [
        2004,
        1311.0
      ],
      [
        2005,
        1310.1
      ],
      [
        2006,
        1277.0
      ],
      [
        2007,
        1334.5
      ],
      [
        2008,
        1285.3
      ],
      [
        2009,
        1320.2
      ],
      [
        2010,
        1358.8
      ],
      [
        2011,
        1351.4
      ],
      [
        2012,
        1315.6
      ],
      [
        2013,
        1378.6
      ],
      [
        2014,
        1364.8
      ],
      [
        2015,
        1348.2
      ],
      [
        2016,
        1354.1
      ],
      [
        2017,
        1357.1
      ],
      [
        2018,
        "NA"
      ],
      [
        2019,
        "NA"
      ]
    ],
    "recette_budg": [
      [
        1980,
        "NA"
      ],
      [
        1981,
        "NA"
      ],
      [
        1982,
        "NA"
      ],
      [
        1983,
        "NA"
      ],
      [
        1984,
        17.721
      ],
      [
        1985,
        19.855
      ],
      [
        1986,
        20.836
      ],
      [
        1987,
        19.379
      ],
      [
        1988,
        17.554000000000002
      ],
      [
        1989,
        18.379
      ],
      [
        1990,
        19.247
      ],
      [
        1991,
        17.695
      ],
      [
        1992,
        18.377
      ],
      [
        1993,
        17.559
      ],
      [
        1994,
        18.099
      ],
      [
        1995,
        14.264000000000001
      ],
      [
        1996,
        12.097999999999999
      ],
      [
        1997,
        13.245999999999999
      ],
      [
        1998,
        11.077
      ],
      [
        1999,
        11.009
      ],
      [
        2000,
        8.609
      ],
      [
        2001,
        10.865
      ],
      [
        2002,
        12.115
      ],
      [
        2003,
        10.714
      ],
      [
        2004,
        10.734000000000002
      ],
      [
        2005,
        11.763
      ],
      [
        2006,
        10.948
      ],
      [
        2007,
        11.884
      ],
      [
        2008,
        13.664000000000001
      ],
      [
        2009,
        14.022
      ],
      [
        2010,
        17.471
      ],
      [
        2011,
        14.078
      ],
      [
        2012,
        16.82
      ],
      [
        2013,
        25.315
      ],
      [
        2014,
        14.2
      ],
      [
        2015,
        21.303
      ],
      [
        2016,
        13.977
      ],
      [
        2017,
        17.188
      ],
      [
        2018,
        15.331
      ],
      [
        2019,
        17.996
      ],
      [
        2020,
        17.42
      ],
      [
        2021,
        16.570999999999998
      ],
      [
        2022,
        15.602
      ],
      [
        2023,
        15.798
      ],
      [
        2024,
        15.915999999999999
      ]
    ],
    "regime_pol": [
      [
        1816,
        "NA"
      ],
      [
        1817,
        "NA"
      ],
      [
        1818,
        "NA"
      ],
      [
        1819,
        "NA"
      ],
      [
        1820,
        "NA"
      ],
      [
        1821,
        "NA"
      ],
      [
        1822,
        "NA"
      ],
      [
        1823,
        "NA"
      ],
      [
        1824,
        "NA"
      ],
      [
        1825,
        "NA"
      ],
      [
        1826,
        "NA"
      ],
      [
        1827,
        "NA"
      ],
      [
        1828,
        "NA"
      ],
      [
        1829,
        "NA"
      ],
      [
        1830,
        "NA"
      ],
      [
        1831,
        "NA"
      ],
      [
        1832,
        "NA"
      ],
      [
        1833,
        "NA"
      ],
      [
        1834,
        "NA"
      ],
      [
        1835,
        "NA"
      ],
      [
        1836,
        "NA"
      ],
      [
        1837,
        "NA"
      ],
      [
        1838,
        "NA"
      ],
      [
        1839,
        "NA"
      ],
      [
        1840,
        "NA"
      ],
      [
        1841,
        "NA"
      ],
      [
        1842,
        "NA"
      ],
      [
        1843,
        "NA"
      ],
      [
        1844,
        "NA"
      ],
      [
        1845,
        "NA"
      ],
      [
        1846,
        "NA"
      ],
      [
        1847,
        "NA"
      ],
      [
        1848,
        "NA"
      ],
      [
        1849,
        "NA"
      ],
      [
        1850,
        "NA"
      ],
      [
        1851,
        "NA"
      ],
      [
        1852,
        "NA"
      ],
      [
        1853,
        "NA"
      ],
      [
        1854,
        "NA"
      ],
      [
        1855,
        "NA"
      ],
      [
        1856,
        "NA"
      ],
      [
        1857,
        "NA"
      ],
      [
        1858,
        "NA"
      ],
      [
        1859,
        "NA"
      ],
      [
        1860,
        "NA"
      ],
      [
        1861,
        "NA"
      ],
      [
        1862,
        "NA"
      ],
      [
        1863,
        "NA"
      ],
      [
        1864,
        "NA"
      ],
      [
        1865,
        "NA"
      ],
      [
        1866,
        "NA"
      ],
      [
        1867,
        "NA"
      ],
      [
        1868,
        "NA"
      ],
      [
        1869,
        "NA"
      ],
      [
        1870,
        "NA"
      ],
      [
        1871,
        "NA"
      ],
      [
        1872,
        "NA"
      ],
      [
        1873,
        "NA"
      ],
      [
        1874,
        "NA"
      ],
      [
        1875,
        "NA"
      ],
      [
        1876,
        "NA"
      ],
      [
        1877,
        "NA"
      ],
      [
        1878,
        "NA"
      ],
      [
        1879,
        "NA"
      ],
      [
        1880,
        "NA"
      ],
      [
        1881,
        "NA"
      ],
      [
        1882,
        "NA"
      ],
      [
        1883,
        "NA"
      ],
      [
        1884,
        "NA"
      ],
      [
        1885,
        "NA"
      ],
      [
        1886,
        "NA"
      ],
      [
        1887,
        "NA"
      ],
      [
        1888,
        "NA"
      ],
      [
        1889,
        "NA"
      ],
      [
        1890,
        "NA"
      ],
      [
        1891,
        "NA"
      ],
      [
        1892,
        "NA"
      ],
      [
        1893,
        "NA"
      ],
      [
        1894,
        "NA"
      ],
      [
        1895,
        "NA"
      ],
      [
        1896,
        "NA"
      ],
      [
        1897,
        "NA"
      ],
      [
        1898,
        "NA"
      ],
      [
        1899,
        "NA"
      ],
      [
        1900,
        "NA"
      ],
      [
        1901,
        "NA"
      ],
      [
        1902,
        "NA"
      ],
      [
        1903,
        "NA"
      ],
      [
        1904,
        "NA"
      ],
      [
        1905,
        "NA"
      ],
      [
        1906,
        "NA"
      ],
      [
        1907,
        "NA"
      ],
      [
        1908,
        "NA"
      ],
      [
        1909,
        "NA"
      ],
      [
        1910,
        "NA"
      ],
      [
        1911,
        "NA"
      ],
      [
        1912,
        "NA"
      ],
      [
        1913,
        "NA"
      ],
      [
        1914,
        "NA"
      ],
      [
        1915,
        "NA"
      ],
      [
        1916,
        "NA"
      ],
      [
        1917,
        "NA"
      ],
      [
        1918,
        "NA"
      ],
      [
        1919,
        "NA"
      ],
      [
        1920,
        "NA"
      ],
      [
        1921,
        "NA"
      ],
      [
        1922,
        "NA"
      ],
      [
        1923,
        "NA"
      ],
      [
        1924,
        "NA"
      ],
      [
        1925,
        "NA"
      ],
      [
        1926,
        "NA"
      ],
      [
        1927,
        "NA"
      ],
      [
        1928,
        "NA"
      ],
      [
        1929,
        "NA"
      ],
      [
        1930,
        "NA"
      ],
      [
        1931,
        "NA"
      ],
      [
        1932,
        "NA"
      ],
      [
        1933,
        "NA"
      ],
      [
        1934,
        "NA"
      ],
      [
        1935,
        "NA"
      ],
      [
        1936,
        "NA"
      ],
      [
        1937,
        "NA"
      ],
      [
        1938,
        "NA"
      ],
      [
        1939,
        "NA"
      ],
      [
        1940,
        "NA"
      ],
      [
        1941,
        "NA"
      ],
      [
        1942,
        "NA"
      ],
      [
        1943,
        "NA"
      ],
      [
        1944,
        "NA"
      ],
      [
        1945,
        "NA"
      ],
      [
        1946,
        "NA"
      ],
      [
        1947,
        "NA"
      ],
      [
        1948,
        "NA"
      ],
      [
        1949,
        "NA"
      ],
      [
        1950,
        "NA"
      ],
      [
        1951,
        "NA"
      ],
      [
        1952,
        "NA"
      ],
      [
        1953,
        "NA"
      ],
      [
        1954,
        "NA"
      ],
      [
        1955,
        "NA"
      ],
      [
        1956,
        "NA"
      ],
      [
        1957,
        "NA"
      ],
      [
        1958,
        "NA"
      ],
      [
        1959,
        "NA"
      ],
      [
        1960,
        "NA"
      ],
      [
        1961,
        "NA"
      ],
      [
        1962,
        "NA"
      ],
      [
        1963,
        "NA"
      ],
      [
        1964,
        "NA"
      ],
      [
        1965,
        "NA"
      ],
      [
        1966,
        "NA"
      ],
      [
        1967,
        "NA"
      ],
      [
        1968,
        "NA"
      ],
      [
        1969,
        "NA"
      ],
      [
        1970,
        "NA"
      ],
      [
        1971,
        "NA"
      ],
      [
        1972,
        "NA"
      ],
      [
        1973,
        "NA"
      ],
      [
        1974,
        "NA"
      ],
      [
        1975,
        5.0
      ],
      [
        1976,
        -4.0
      ],
      [
        1977,
        -4.0
      ],
      [
        1978,
        -5.0
      ],
      [
        1979,
        -5.0
      ],
      [
        1980,
        -5.0
      ],
      [
        1981,
        -5.0
      ],
      [
        1982,
        -6.0
      ],
      [
        1983,
        -6.0
      ],
      [
        1984,
        -6.0
      ],
      [
        1985,
        -7.0
      ],
      [
        1986,
        -7.0
      ],
      [
        1987,
        -7.0
      ],
      [
        1988,
        -7.0
      ],
      [
        1989,
        -7.0
      ],
      [
        1990,
        4.0
      ],
      [
        1991,
        4.0
      ],
      [
        1992,
        4.0
      ],
      [
        1993,
        4.0
      ],
      [
        1994,
        4.0
      ],
      [
        1995,
        0.0
      ],
      [
        1996,
        4.0
      ],
      [
        1997,
        4.0
      ],
      [
        1998,
        4.0
      ],
      [
        1999,
        -2.0
      ],
      [
        2000,
        -1.0
      ],
      [
        2001,
        0.0
      ],
      [
        2002,
        4.0
      ],
      [
        2003,
        4.0
      ],
      [
        2004,
        6.0
      ],
      [
        2005,
        6.0
      ],
      [
        2006,
        9.0
      ],
      [
        2007,
        9.0
      ],
      [
        2008,
        9.0
      ],
      [
        2009,
        9.0
      ],
      [
        2010,
        9.0
      ],
      [
        2011,
        9.0
      ],
      [
        2012,
        9.0
      ],
      [
        2013,
        9.0
      ],
      [
        2014,
        9.0
      ],
      [
        2015,
        9.0
      ]
    ],
    "sous_nutri": [
      [
        1960,
        "NA"
      ],
      [
        1961,
        "NA"
      ],
      [
        1962,
        "NA"
      ],
      [
        1963,
        "NA"
      ],
      [
        1964,
        "NA"
      ],
      [
        1965,
        "NA"
      ],
      [
        1966,
        "NA"
      ],
      [
        1967,
        "NA"
      ],
      [
        1968,
        "NA"
      ],
      [
        1969,
        "NA"
      ],
      [
        1970,
        227.1
      ],
      [
        1971,
        221.9
      ],
      [
        1972,
        217.6
      ],
      [
        1973,
        212.7
      ],
      [
        1974,
        207.8
      ],
      [
        1975,
        203.0
      ],
      [
        1976,
        197.9
      ],
      [
        1977,
        192.6
      ],
      [
        1978,
        186.9
      ],
      [
        1979,
        181.1
      ],
      [
        1980,
        175.2
      ],
      [
        1981,
        169.4
      ],
      [
        1982,
        163.6
      ],
      [
        1983,
        157.8
      ],
      [
        1984,
        152.3
      ],
      [
        1985,
        147.3
      ],
      [
        1986,
        142.3
      ],
      [
        1987,
        137.7
      ],
      [
        1988,
        133.4
      ],
      [
        1989,
        129.3
      ],
      [
        1990,
        125.3
      ],
      [
        1991,
        121.3
      ],
      [
        1992,
        117.4
      ],
      [
        1993,
        113.7
      ],
      [
        1994,
        110.6
      ],
      [
        1995,
        108.1
      ],
      [
        1996,
        106.0
      ],
      [
        1997,
        104.3
      ],
      [
        1998,
        103.1
      ],
      [
        1999,
        102.3
      ],
      [
        2000,
        101.9
      ],
      [
        2001,
        101.9
      ],
      [
        2002,
        102.0
      ],
      [
        2003,
        101.8
      ],
      [
        2004,
        100.9
      ],
      [
        2005,
        99.3
      ],
      [
        2006,
        97.3
      ],
      [
        2007,
        95.2
      ],
      [
        2008,
        92.4
      ],
      [
        2009,
        89.8
      ],
      [
        2010,
        87.1
      ],
      [
        2011,
        84.9
      ],
      [
        2012,
        82.3
      ],
      [
        2013,
        79.5
      ],
      [
        2014,
        77.1
      ],
      [
        2015,
        74.9
      ],
      [
        2016,
        72.3
      ],
      [
        2017,
        69.9
      ],
      [
        2018,
        67.5
      ],
      [
        2019,
        "NA"
      ]
    ],
    "volume_exp_biens": [
      [
        1980,
        -61.845
      ],
      [
        1981,
        46.724
      ],
      [
        1982,
        18.102
      ],
      [
        1983,
        -10.892999999999999
      ],
      [
        1984,
        -67.9
      ],
      [
        1985,
        241.505
      ],
      [
        1986,
        30.045
      ],
      [
        1987,
        -51.641999999999996
      ],
      [
        1988,
        113.545
      ],
      [
        1989,
        -15.136
      ],
      [
        1990,
        -14.113
      ],
      [
        1991,
        55.235
      ],
      [
        1992,
        -15.890999999999998
      ],
      [
        1993,
        20.322
      ],
      [
        1994,
        -36.037
      ],
      [
        1995,
        20.315
      ],
      [
        1996,
        -31.901
      ],
      [
        1997,
        35.428000000000004
      ],
      [
        1998,
        9.451
      ],
      [
        1999,
        -22.914
      ],
      [
        2000,
        -2.639
      ],
      [
        2001,
        -20.148
      ],
      [
        2002,
        11.064
      ],
      [
        2003,
        -33.662
      ],
      [
        2004,
        -4.602
      ],
      [
        2005,
        10.765
      ],
      [
        2006,
        12.05
      ],
      [
        2007,
        17.163
      ],
      [
        2008,
        -36.137
      ],
      [
        2009,
        27.184
      ],
      [
        2010,
        20.313
      ],
      [
        2011,
        -24.302
      ],
      [
        2012,
        -28.069000000000003
      ],
      [
        2013,
        25.844
      ],
      [
        2014,
        51.162
      ],
      [
        2015,
        -20.688000000000002
      ],
      [
        2016,
        31.455
      ],
      [
        2017,
        -1.003
      ],
      [
        2018,
        8.135
      ],
      [
        2019,
        7.678999999999999
      ],
      [
        2020,
        -4.037
      ],
      [
        2021,
        6.862
      ],
      [
        2022,
        7.077999999999999
      ],
      [
        2023,
        7.047999999999999
      ],
      [
        2024,
        8.607999999999999
      ]
    ],
    "volume_exp_bs": [
      [
        1980,
        -52.937
      ],
      [
        1981,
        21.801
      ],
      [
        1982,
        27.678
      ],
      [
        1983,
        -13.094000000000001
      ],
      [
        1984,
        -54.6
      ],
      [
        1985,
        134.0
      ],
      [
        1986,
        4.6
      ],
      [
        1987,
        -51.693999999999996
      ],
      [
        1988,
        99.134
      ],
      [
        1989,
        -6.49
      ],
      [
        1990,
        -10.241
      ],
      [
        1991,
        47.968
      ],
      [
        1992,
        -7.718999999999999
      ],
      [
        1993,
        20.197
      ],
      [
        1994,
        -16.94
      ],
      [
        1995,
        10.312000000000001
      ],
      [
        1996,
        -10.645
      ],
      [
        1997,
        4.5169999999999995
      ],
      [
        1998,
        -28.721
      ],
      [
        1999,
        7.404
      ],
      [
        2000,
        11.241
      ],
      [
        2001,
        -22.051
      ],
      [
        2002,
        9.252
      ],
      [
        2003,
        -17.267
      ],
      [
        2004,
        21.807
      ],
      [
        2005,
        21.026999999999997
      ],
      [
        2006,
        6.52
      ],
      [
        2007,
        5.742000000000001
      ],
      [
        2008,
        -3.103
      ],
      [
        2009,
        -4.739
      ],
      [
        2010,
        14.004000000000001
      ],
      [
        2011,
        -1.837
      ],
      [
        2012,
        -10.382
      ],
      [
        2013,
        20.061
      ],
      [
        2014,
        24.162
      ],
      [
        2015,
        -7.417999999999999
      ],
      [
        2016,
        -1.712
      ],
      [
        2017,
        3.987
      ],
      [
        2018,
        16.227
      ],
      [
        2019,
        5.975
      ],
      [
        2020,
        3.0610000000000004
      ],
      [
        2021,
        4.933
      ],
      [
        2022,
        4.9910000000000005
      ],
      [
        2023,
        4.413
      ],
      [
        2024,
        4.475
      ]
    ],
    "volume_import_biens": [
      [
        1980,
        -12.265
      ],
      [
        1981,
        18.371
      ],
      [
        1982,
        6.5329999999999995
      ],
      [
        1983,
        -1.4609999999999999
      ],
      [
        1984,
        62.7
      ],
      [
        1985,
        18.317
      ],
      [
        1986,
        -4.5889999999999995
      ],
      [
        1987,
        0.521
      ],
      [
        1988,
        13.555
      ],
      [
        1989,
        -15.107000000000001
      ],
      [
        1990,
        18.977999999999998
      ],
      [
        1991,
        10.707
      ],
      [
        1992,
        14.515999999999998
      ],
      [
        1993,
        -9.994
      ],
      [
        1994,
        -12.083
      ],
      [
        1995,
        5.87
      ],
      [
        1996,
        -3.29
      ],
      [
        1997,
        4.992
      ],
      [
        1998,
        -1.485
      ],
      [
        1999,
        -3.4360000000000004
      ],
      [
        2000,
        2.897
      ],
      [
        2001,
        9.339
      ],
      [
        2002,
        11.425
      ],
      [
        2003,
        10.703
      ],
      [
        2004,
        7.377000000000001
      ],
      [
        2005,
        6.301
      ],
      [
        2006,
        3.6319999999999997
      ],
      [
        2007,
        0.322
      ],
      [
        2008,
        17.266
      ],
      [
        2009,
        11.662
      ],
      [
        2010,
        0.174
      ],
      [
        2011,
        -1.3780000000000001
      ],
      [
        2012,
        4.88
      ],
      [
        2013,
        6.595
      ],
      [
        2014,
        -1.348
      ],
      [
        2015,
        -5.041
      ],
      [
        2016,
        3.3089999999999997
      ],
      [
        2017,
        12.25
      ],
      [
        2018,
        10.555
      ],
      [
        2019,
        26.820999999999998
      ],
      [
        2020,
        2.8569999999999998
      ],
      [
        2021,
        0.775
      ],
      [
        2022,
        -1.301
      ],
      [
        2023,
        3.9610000000000003
      ],
      [
        2024,
        6.367000000000001
      ]
    ],
    "volume_import_bs": [
      [
        1980,
        3.2289999999999996
      ],
      [
        1981,
        54.02
      ],
      [
        1982,
        -1.528
      ],
      [
        1983,
        -16.19
      ],
      [
        1984,
        66.5
      ],
      [
        1985,
        18.3
      ],
      [
        1986,
        -4.6
      ],
      [
        1987,
        -23.033
      ],
      [
        1988,
        14.359000000000002
      ],
      [
        1989,
        -10.017000000000001
      ],
      [
        1990,
        15.167
      ],
      [
        1991,
        4.244
      ],
      [
        1992,
        13.502
      ],
      [
        1993,
        -6.526
      ],
      [
        1994,
        -6.925
      ],
      [
        1995,
        3.7489999999999997
      ],
      [
        1996,
        -4.621
      ],
      [
        1997,
        4.414
      ],
      [
        1998,
        -10.88
      ],
      [
        1999,
        -2.2769999999999997
      ],
      [
        2000,
        -8.225
      ],
      [
        2001,
        6.932
      ],
      [
        2002,
        10.229
      ],
      [
        2003,
        10.183
      ],
      [
        2004,
        5.0280000000000005
      ],
      [
        2005,
        6.622000000000001
      ],
      [
        2006,
        6.822
      ],
      [
        2007,
        0.621
      ],
      [
        2008,
        16.397000000000002
      ],
      [
        2009,
        10.334000000000001
      ],
      [
        2010,
        2.617
      ],
      [
        2011,
        0.415
      ],
      [
        2012,
        3.725
      ],
      [
        2013,
        6.058
      ],
      [
        2014,
        -6.206
      ],
      [
        2015,
        -2.7030000000000003
      ],
      [
        2016,
        2.6
      ],
      [
        2017,
        11.805
      ],
      [
        2018,
        9.39
      ],
      [
        2019,
        21.915
      ],
      [
        2020,
        2.9219999999999997
      ],
      [
        2021,
        0.9790000000000001
      ],
      [
        2022,
        -0.856
      ],
      [
        2023,
        3.793
      ],
      [
        2024,
        5.502000000000001
      ]
    ],
    "vuln_clim_ferdi": [
      [
        2018,
        52.6329869146445
      ]
    ],
    "vuln_clim_ndgain": [
      [
        1995,
        0.5127766662797849
      ],
      [
        1996,
        0.511029541732536
      ],
      [
        1997,
        0.5110623218750829
      ],
      [
        1998,
        0.508208758564482
      ],
      [
        1999,
        0.507263313085103
      ],
      [
        2000,
        0.501317325172306
      ],
      [
        2001,
        0.4979498571076629
      ],
      [
        2002,
        0.5020593325438449
      ],
      [
        2003,
        0.502943351663139
      ],
      [
        2004,
        0.500820955045488
      ],
      [
        2005,
        0.493188382321975
      ],
      [
        2006,
        0.482009302342875
      ],
      [
        2007,
        0.476568335843332
      ],
      [
        2008,
        0.473044987473761
      ],
      [
        2009,
        0.476809906281032
      ],
      [
        2010,
        0.479186246069176
      ],
      [
        2011,
        0.4807148085478351
      ],
      [
        2012,
        0.477344626330382
      ],
      [
        2013,
        0.486123194777204
      ],
      [
        2014,
        0.481956215890901
      ],
      [
        2015,
        0.481491519598834
      ],
      [
        2016,
        0.480850978681866
      ]
    ]
  }
}