Year,AGO,BDI,BEN,BFA,BWA,CAF,CIV,CMR,COD,COG,COM,CPV,DJI,DZA,EGY,ERI,ESH,ETH,GAB,GHA,GIN,GMB,GNB,GNQ,KEN,LBR,LBY,LSO,MAR,MDG,MLI,MOZ,MRT,MUS,MWI,NAM,NER,NGA,RWA,SDN,SEN,SLE,SOM,SSD,STP,SWZ,SYC,TCD,TGO,TUN,TZA,UGA,ZAF,ZMB,ZWE
2013,1.0,2.0,3.0,2.0,3.0,2.0,2.0,1.0,1.0,1.0,2.0,3.0,1.0,1.0,2.0,1.0,1.0,1.0,1.0,3.0,2.0,1.0,1.0,1.0,2.0,2.0,2.0,3.0,2.0,2.0,1.0,2.0,1.0,3.0,2.0,3.0,2.0,2.0,1.0,1.0,3.0,3.0,1.0,1.0,3.0,1.0,2.0,1.0,2.0,2.0,2.0,2.0,3.0,2.0,1.0
2014,1.0,2.0,3.0,2.0,3.0,1.0,2.0,1.0,1.0,1.0,2.0,3.0,1.0,1.0,1.0,1.0,1.0,1.0,1.0,3.0,2.0,1.0,1.0,1.0,2.0,2.0,2.0,3.0,2.0,2.0,2.0,2.0,1.0,3.0,2.0,3.0,2.0,2.0,1.0,1.0,3.0,2.0,1.0,1.0,3.0,1.0,2.0,1.0,2.0,2.0,2.0,2.0,3.0,2.0,1.0
2015,1.0,1.0,3.0,2.0,3.0,1.0,2.0,1.0,1.0,1.0,2.0,3.0,1.0,1.0,1.0,1.0,1.0,1.0,1.0,3.0,2.0,1.0,2.0,1.0,2.0,2.0,1.0,3.0,2.0,2.0,2.0,2.0,1.0,3.0,2.0,3.0,2.0,2.0,1.0,1.0,3.0,2.0,1.0,1.0,3.0,1.0,2.0,1.0,2.0,3.0,2.0,1.0,3.0,2.0,1.0
2016,1.0,1.0,3.0,2.0,3.0,1.0,2.0,1.0,1.0,1.0,2.0,3.0,1.0,1.0,1.0,1.0,1.0,1.0,1.0,3.0,2.0,1.0,2.0,1.0,2.0,2.0,1.0,2.0,2.0,2.0,2.0,2.0,1.0,3.0,2.0,3.0,2.0,2.0,1.0,1.0,3.0,2.0,1.0,1.0,3.0,1.0,2.0,1.0,2.0,3.0,2.0,1.0,3.0,2.0,2.0
2017,1.0,1.0,3.0,2.0,3.0,1.0,2.0,1.0,1.0,1.0,2.0,3.0,1.0,1.0,1.0,1.0,1.0,1.0,1.0,3.0,2.0,1.0,2.0,1.0,2.0,2.0,1.0,2.0,2.0,2.0,2.0,2.0,1.0,3.0,2.0,3.0,2.0,2.0,1.0,1.0,3.0,2.0,1.0,1.0,3.0,1.0,2.0,1.0,2.0,3.0,2.0,1.0,3.0,2.0,2.0
2018,1.0,1.0,3.0,2.0,3.0,1.0,2.0,1.0,1.0,1.0,2.0,3.0,1.0,1.0,1.0,1.0,1.0,1.0,1.0,3.0,2.0,2.0,2.0,1.0,2.0,2.0,1.0,2.0,2.0,2.0,2.0,2.0,1.0,3.0,2.0,3.0,2.0,2.0,1.0,1.0,3.0,2.0,1.0,1.0,3.0,1.0,2.0,1.0,2.0,3.0,2.0,2.0,3.0,2.0,1.0
