{
  "country": "COG",
  "country_name": "République du Congo",
  "indicators": {
    "abo_mobile": [
      [
        1960,
        0.0
      ],
      [
        1961,
        "NA"
      ],
      [
        1962,
        "NA"
      ],
      [
        1963,
        "NA"
      ],
      [
        1964,
        "NA"
      ],
      [
        1965,
        0.0
      ],
      [
        1966,
        "NA"
      ],
      [
        1967,
        "NA"
      ],
      [
        1968,
        "NA"
      ],
      [
        1969,
        "NA"
      ],
      [
        1970,
        0.0
      ],
      [
        1971,
        "NA"
      ],
      [
        1972,
        "NA"
      ],
      [
        1973,
        "NA"
      ],
      [
        1974,
        "NA"
      ],
      [
        1975,
        0.0
      ],
      [
        1976,
        0.0
      ],
      [
        1977,
        0.0
      ],
      [
        1978,
        0.0
      ],
      [
        1979,
        0.0
      ],
      [
        1980,
        0.0
      ],
      [
        1981,
        0.0
      ],
      [
        1982,
        0.0
      ],
      [
        1983,
        0.0
      ],
      [
        1984,
        0.0
      ],
      [
        1985,
        0.0
      ],
      [
        1986,
        0.0
      ],
      [
        1987,
        0.0
      ],
      [
        1988,
        0.0
      ],
      [
        1989,
        0.0
      ],
      [
        1990,
        0.0
      ],
      [
        1991,
        0.0
      ],
      [
        1992,
        0.0
      ],
      [
        1993,
        0.0
      ],
      [
        1994,
        0.0
      ],
      [
        1995,
        0.0
      ],
      [
        1996,
        0.001
      ],
      [
        1997,
        "NA"
      ],
      [
        1998,
        0.00339
      ],
      [
        1999,
        0.005
      ],
      [
        2000,
        0.07
      ],
      [
        2001,
        0.15
      ],
      [
        2002,
        0.2218
      ],
      [
        2003,
        0.33
      ],
      [
        2004,
        0.383653
      ],
      [
        2005,
        0.558192
      ],
      [
        2006,
        0.917499
      ],
      [
        2007,
        1.287631
      ],
      [
        2008,
        1.807
      ],
      [
        2009,
        2.9483040000000003
      ],
      [
        2010,
        3.718748
      ],
      [
        2011,
        3.884757
      ],
      [
        2012,
        4.2831339999999996
      ],
      [
        2013,
        4.659762000000001
      ],
      [
        2014,
        4.9301
      ],
      [
        2015,
        5.216
      ],
      [
        2016,
        5.4239999999999995
      ],
      [
        2017,
        5.056
      ],
      [
        2018,
        5.0
      ],
      [
        2019,
        "NA"
      ]
    ],
    "acces_elec": [
      [
        1960,
        "NA"
      ],
      [
        1961,
        "NA"
      ],
      [
        1962,
        "NA"
      ],
      [
        1963,
        "NA"
      ],
      [
        1964,
        "NA"
      ],
      [
        1965,
        "NA"
      ],
      [
        1966,
        "NA"
      ],
      [
        1967,
        "NA"
      ],
      [
        1968,
        "NA"
      ],
      [
        1969,
        "NA"
      ],
      [
        1970,
        "NA"
      ],
      [
        1971,
        "NA"
      ],
      [
        1972,
        "NA"
      ],
      [
        1973,
        "NA"
      ],
      [
        1974,
        "NA"
      ],
      [
        1975,
        "NA"
      ],
      [
        1976,
        "NA"
      ],
      [
        1977,
        "NA"
      ],
      [
        1978,
        "NA"
      ],
      [
        1979,
        "NA"
      ],
      [
        1980,
        "NA"
      ],
      [
        1981,
        "NA"
      ],
      [
        1982,
        "NA"
      ],
      [
        1983,
        "NA"
      ],
      [
        1984,
        "NA"
      ],
      [
        1985,
        "NA"
      ],
      [
        1986,
        "NA"
      ],
      [
        1987,
        "NA"
      ],
      [
        1988,
        "NA"
      ],
      [
        1989,
        "NA"
      ],
      [
        1990,
        "NA"
      ],
      [
        1991,
        "NA"
      ],
      [
        1992,
        "NA"
      ],
      [
        1993,
        "NA"
      ],
      [
        1994,
        "NA"
      ],
      [
        1995,
        "NA"
      ],
      [
        1996,
        "NA"
      ],
      [
        1997,
        "NA"
      ],
      [
        1998,
        "NA"
      ],
      [
        1999,
        "NA"
      ],
      [
        2000,
        "NA"
      ],
      [
        2001,
        "NA"
      ],
      [
        2002,
        "NA"
      ],
      [
        2003,
        "NA"
      ],
      [
        2004,
        "NA"
      ],
      [
        2005,
        "NA"
      ],
      [
        2006,
        33.8859786987
      ],
      [
        2007,
        35.977230072
      ],
      [
        2008,
        38.0755386353
      ],
      [
        2009,
        37.1
      ],
      [
        2010,
        42.3396759033
      ],
      [
        2011,
        44.5286712646
      ],
      [
        2012,
        41.6
      ],
      [
        2013,
        49.051120758100005
      ],
      [
        2014,
        52.3896827698
      ],
      [
        2015,
        60.4
      ],
      [
        2016,
        60.7406959534
      ],
      [
        2017,
        64.70985412600001
      ],
      [
        2018,
        68.5184326172
      ],
      [
        2019,
        "NA"
      ]
    ],
    "alpha_adulte": [
      [
        1960,
        "NA"
      ],
      [
        1961,
        "NA"
      ],
      [
        1962,
        "NA"
      ],
      [
        1963,
        "NA"
      ],
      [
        1964,
        "NA"
      ],
      [
        1965,
        "NA"
      ],
      [
        1966,
        "NA"
      ],
      [
        1967,
        "NA"
      ],
      [
        1968,
        "NA"
      ],
      [
        1969,
        "NA"
      ],
      [
        1970,
        "NA"
      ],
      [
        1971,
        "NA"
      ],
      [
        1972,
        "NA"
      ],
      [
        1973,
        "NA"
      ],
      [
        1974,
        "NA"
      ],
      [
        1975,
        "NA"
      ],
      [
        1976,
        "NA"
      ],
      [
        1977,
        "NA"
      ],
      [
        1978,
        "NA"
      ],
      [
        1979,
        "NA"
      ],
      [
        1980,
        "NA"
      ],
      [
        1981,
        "NA"
      ],
      [
        1982,
        "NA"
      ],
      [
        1983,
        "NA"
      ],
      [
        1984,
        "NA"
      ],
      [
        1985,
        "NA"
      ],
      [
        1986,
        "NA"
      ],
      [
        1987,
        "NA"
      ],
      [
        1988,
        "NA"
      ],
      [
        1989,
        "NA"
      ],
      [
        1990,
        "NA"
      ],
      [
        1991,
        "NA"
      ],
      [
        1992,
        "NA"
      ],
      [
        1993,
        "NA"
      ],
      [
        1994,
        "NA"
      ],
      [
        1995,
        "NA"
      ],
      [
        1996,
        "NA"
      ],
      [
        1997,
        "NA"
      ],
      [
        1998,
        "NA"
      ],
      [
        1999,
        "NA"
      ],
      [
        2000,
        "NA"
      ],
      [
        2001,
        "NA"
      ],
      [
        2002,
        "NA"
      ],
      [
        2003,
        "NA"
      ],
      [
        2004,
        "NA"
      ],
      [
        2005,
        "NA"
      ],
      [
        2006,
        "NA"
      ],
      [
        2007,
        "NA"
      ],
      [
        2008,
        "NA"
      ],
      [
        2009,
        "NA"
      ],
      [
        2010,
        "NA"
      ],
      [
        2011,
        79.31116999999999
      ],
      [
        2012,
        "NA"
      ],
      [
        2013,
        "NA"
      ],
      [
        2014,
        "NA"
      ],
      [
        2015,
        "NA"
      ],
      [
        2016,
        "NA"
      ],
      [
        2017,
        "NA"
      ],
      [
        2018,
        80.29876
      ],
      [
        2019,
        "NA"
      ]
    ],
    "alpha_jeune": [
      [
        1960,
        "NA"
      ],
      [
        1961,
        "NA"
      ],
      [
        1962,
        "NA"
      ],
      [
        1963,
        "NA"
      ],
      [
        1964,
        "NA"
      ],
      [
        1965,
        "NA"
      ],
      [
        1966,
        "NA"
      ],
      [
        1967,
        "NA"
      ],
      [
        1968,
        "NA"
      ],
      [
        1969,
        "NA"
      ],
      [
        1970,
        "NA"
      ],
      [
        1971,
        "NA"
      ],
      [
        1972,
        "NA"
      ],
      [
        1973,
        "NA"
      ],
      [
        1974,
        "NA"
      ],
      [
        1975,
        "NA"
      ],
      [
        1976,
        "NA"
      ],
      [
        1977,
        "NA"
      ],
      [
        1978,
        "NA"
      ],
      [
        1979,
        "NA"
      ],
      [
        1980,
        "NA"
      ],
      [
        1981,
        "NA"
      ],
      [
        1982,
        "NA"
      ],
      [
        1983,
        "NA"
      ],
      [
        1984,
        "NA"
      ],
      [
        1985,
        "NA"
      ],
      [
        1986,
        "NA"
      ],
      [
        1987,
        "NA"
      ],
      [
        1988,
        "NA"
      ],
      [
        1989,
        "NA"
      ],
      [
        1990,
        "NA"
      ],
      [
        1991,
        "NA"
      ],
      [
        1992,
        "NA"
      ],
      [
        1993,
        "NA"
      ],
      [
        1994,
        "NA"
      ],
      [
        1995,
        "NA"
      ],
      [
        1996,
        "NA"
      ],
      [
        1997,
        "NA"
      ],
      [
        1998,
        "NA"
      ],
      [
        1999,
        "NA"
      ],
      [
        2000,
        "NA"
      ],
      [
        2001,
        "NA"
      ],
      [
        2002,
        "NA"
      ],
      [
        2003,
        "NA"
      ],
      [
        2004,
        "NA"
      ],
      [
        2005,
        "NA"
      ],
      [
        2006,
        "NA"
      ],
      [
        2007,
        "NA"
      ],
      [
        2008,
        "NA"
      ],
      [
        2009,
        "NA"
      ],
      [
        2010,
        "NA"
      ],
      [
        2011,
        80.91395
      ],
      [
        2012,
        "NA"
      ],
      [
        2013,
        "NA"
      ],
      [
        2014,
        "NA"
      ],
      [
        2015,
        "NA"
      ],
      [
        2016,
        "NA"
      ],
      [
        2017,
        "NA"
      ],
      [
        2018,
        82.05479
      ],
      [
        2019,
        "NA"
      ]
    ],
    "bidonvilles": [
      [
        1960,
        "NA"
      ],
      [
        1961,
        "NA"
      ],
      [
        1962,
        "NA"
      ],
      [
        1963,
        "NA"
      ],
      [
        1964,
        "NA"
      ],
      [
        1965,
        "NA"
      ],
      [
        1966,
        "NA"
      ],
      [
        1967,
        "NA"
      ],
      [
        1968,
        "NA"
      ],
      [
        1969,
        "NA"
      ],
      [
        1970,
        "NA"
      ],
      [
        1971,
        "NA"
      ],
      [
        1972,
        "NA"
      ],
      [
        1973,
        "NA"
      ],
      [
        1974,
        "NA"
      ],
      [
        1975,
        "NA"
      ],
      [
        1976,
        "NA"
      ],
      [
        1977,
        "NA"
      ],
      [
        1978,
        "NA"
      ],
      [
        1979,
        "NA"
      ],
      [
        1980,
        "NA"
      ],
      [
        1981,
        "NA"
      ],
      [
        1982,
        "NA"
      ],
      [
        1983,
        "NA"
      ],
      [
        1984,
        "NA"
      ],
      [
        1985,
        "NA"
      ],
      [
        1986,
        "NA"
      ],
      [
        1987,
        "NA"
      ],
      [
        1988,
        "NA"
      ],
      [
        1989,
        "NA"
      ],
      [
        1990,
        "NA"
      ],
      [
        1991,
        "NA"
      ],
      [
        1992,
        "NA"
      ],
      [
        1993,
        "NA"
      ],
      [
        1994,
        "NA"
      ],
      [
        1995,
        "NA"
      ],
      [
        1996,
        "NA"
      ],
      [
        1997,
        "NA"
      ],
      [
        1998,
        "NA"
      ],
      [
        1999,
        "NA"
      ],
      [
        2000,
        "NA"
      ],
      [
        2001,
        "NA"
      ],
      [
        2002,
        "NA"
      ],
      [
        2003,
        "NA"
      ],
      [
        2004,
        "NA"
      ],
      [
        2005,
        53.4
      ],
      [
        2006,
        "NA"
      ],
      [
        2007,
        51.7
      ],
      [
        2008,
        "NA"
      ],
      [
        2009,
        49.9
      ],
      [
        2010,
        "NA"
      ],
      [
        2011,
        "NA"
      ],
      [
        2012,
        "NA"
      ],
      [
        2013,
        "NA"
      ],
      [
        2014,
        46.9
      ],
      [
        2015,
        "NA"
      ],
      [
        2016,
        "NA"
      ],
      [
        2017,
        "NA"
      ],
      [
        2018,
        "NA"
      ],
      [
        2019,
        "NA"
      ]
    ],
    "compte_adulte": [
      [
        1960,
        "NA"
      ],
      [
        1961,
        "NA"
      ],
      [
        1962,
        "NA"
      ],
      [
        1963,
        "NA"
      ],
      [
        1964,
        "NA"
      ],
      [
        1965,
        "NA"
      ],
      [
        1966,
        "NA"
      ],
      [
        1967,
        "NA"
      ],
      [
        1968,
        "NA"
      ],
      [
        1969,
        "NA"
      ],
      [
        1970,
        "NA"
      ],
      [
        1971,
        "NA"
      ],
      [
        1972,
        "NA"
      ],
      [
        1973,
        "NA"
      ],
      [
        1974,
        "NA"
      ],
      [
        1975,
        "NA"
      ],
      [
        1976,
        "NA"
      ],
      [
        1977,
        "NA"
      ],
      [
        1978,
        "NA"
      ],
      [
        1979,
        "NA"
      ],
      [
        1980,
        "NA"
      ],
      [
        1981,
        "NA"
      ],
      [
        1982,
        "NA"
      ],
      [
        1983,
        "NA"
      ],
      [
        1984,
        "NA"
      ],
      [
        1985,
        "NA"
      ],
      [
        1986,
        "NA"
      ],
      [
        1987,
        "NA"
      ],
      [
        1988,
        "NA"
      ],
      [
        1989,
        "NA"
      ],
      [
        1990,
        "NA"
      ],
      [
        1991,
        "NA"
      ],
      [
        1992,
        "NA"
      ],
      [
        1993,
        "NA"
      ],
      [
        1994,
        "NA"
      ],
      [
        1995,
        "NA"
      ],
      [
        1996,
        "NA"
      ],
      [
        1997,
        "NA"
      ],
      [
        1998,
        "NA"
      ],
      [
        1999,
        "NA"
      ],
      [
        2000,
        "NA"
      ],
      [
        2001,
        "NA"
      ],
      [
        2002,
        "NA"
      ],
      [
        2003,
        "NA"
      ],
      [
        2004,
        "NA"
      ],
      [
        2005,
        "NA"
      ],
      [
        2006,
        "NA"
      ],
      [
        2007,
        "NA"
      ],
      [
        2008,
        "NA"
      ],
      [
        2009,
        "NA"
      ],
      [
        2010,
        "NA"
      ],
      [
        2011,
        13.063489913900002
      ],
      [
        2012,
        "NA"
      ],
      [
        2013,
        "NA"
      ],
      [
        2014,
        21.2439632416
      ],
      [
        2015,
        "NA"
      ],
      [
        2016,
        "NA"
      ],
      [
        2017,
        26.694852829000002
      ],
      [
        2018,
        "NA"
      ],
      [
        2019,
        "NA"
      ]
    ],
    "compte_jeune": [
      [
        1960,
        "NA"
      ],
      [
        1961,
        "NA"
      ],
      [
        1962,
        "NA"
      ],
      [
        1963,
        "NA"
      ],
      [
        1964,
        "NA"
      ],
      [
        1965,
        "NA"
      ],
      [
        1966,
        "NA"
      ],
      [
        1967,
        "NA"
      ],
      [
        1968,
        "NA"
      ],
      [
        1969,
        "NA"
      ],
      [
        1970,
        "NA"
      ],
      [
        1971,
        "NA"
      ],
      [
        1972,
        "NA"
      ],
      [
        1973,
        "NA"
      ],
      [
        1974,
        "NA"
      ],
      [
        1975,
        "NA"
      ],
      [
        1976,
        "NA"
      ],
      [
        1977,
        "NA"
      ],
      [
        1978,
        "NA"
      ],
      [
        1979,
        "NA"
      ],
      [
        1980,
        "NA"
      ],
      [
        1981,
        "NA"
      ],
      [
        1982,
        "NA"
      ],
      [
        1983,
        "NA"
      ],
      [
        1984,
        "NA"
      ],
      [
        1985,
        "NA"
      ],
      [
        1986,
        "NA"
      ],
      [
        1987,
        "NA"
      ],
      [
        1988,
        "NA"
      ],
      [
        1989,
        "NA"
      ],
      [
        1990,
        "NA"
      ],
      [
        1991,
        "NA"
      ],
      [
        1992,
        "NA"
      ],
      [
        1993,
        "NA"
      ],
      [
        1994,
        "NA"
      ],
      [
        1995,
        "NA"
      ],
      [
        1996,
        "NA"
      ],
      [
        1997,
        "NA"
      ],
      [
        1998,
        "NA"
      ],
      [
        1999,
        "NA"
      ],
      [
        2000,
        "NA"
      ],
      [
        2001,
        "NA"
      ],
      [
        2002,
        "NA"
      ],
      [
        2003,
        "NA"
      ],
      [
        2004,
        "NA"
      ],
      [
        2005,
        "NA"
      ],
      [
        2006,
        "NA"
      ],
      [
        2007,
        "NA"
      ],
      [
        2008,
        "NA"
      ],
      [
        2009,
        "NA"
      ],
      [
        2010,
        "NA"
      ],
      [
        2011,
        4.584810257
      ],
      [
        2012,
        "NA"
      ],
      [
        2013,
        "NA"
      ],
      [
        2014,
        7.4403128624
      ],
      [
        2015,
        "NA"
      ],
      [
        2016,
        "NA"
      ],
      [
        2017,
        25.5402832031
      ],
      [
        2018,
        "NA"
      ],
      [
        2019,
        "NA"
      ]
    ],
    "croissance_pib": [
      [
        1960,
        "NA"
      ],
      [
        1961,
        8.3507267243
      ],
      [
        1962,
        5.2023087887
      ],
      [
        1963,
        -4.029300398
      ],
      [
        1964,
        3.8167962677999996
      ],
      [
        1965,
        3.6764677363
      ],
      [
        1966,
        1.3589824624000002
      ],
      [
        1967,
        2.1162720579
      ],
      [
        1968,
        7.631326238400001
      ],
      [
        1969,
        7.5485251939
      ],
      [
        1970,
        6.3584701876
      ],
      [
        1971,
        7.753035852899999
      ],
      [
        1972,
        8.6175508443
      ],
      [
        1973,
        8.2311889443
      ],
      [
        1974,
        7.885520809400001
      ],
      [
        1975,
        7.7315968392
      ],
      [
        1976,
        0.9162867534
      ],
      [
        1977,
        -8.953427980499999
      ],
      [
        1978,
        6.3597470101999996
      ],
      [
        1979,
        9.813224739099999
      ],
      [
        1980,
        17.636605479500002
      ],
      [
        1981,
        17.6197224679
      ],
      [
        1982,
        23.597699959699998
      ],
      [
        1983,
        5.8539628399
      ],
      [
        1984,
        6.9761310563
      ],
      [
        1985,
        -1.1856608548999998
      ],
      [
        1986,
        -6.861526436799999
      ],
      [
        1987,
        0.1893766405
      ],
      [
        1988,
        1.7662634294
      ],
      [
        1989,
        2.5998765172
      ],
      [
        1990,
        1.0000035669
      ],
      [
        1991,
        2.3953674541
      ],
      [
        1992,
        2.6119480522
      ],
      [
        1993,
        -0.9796832062999999
      ],
      [
        1994,
        -5.493075745
      ],
      [
        1995,
        3.9853243781
      ],
      [
        1996,
        4.2904815556
      ],
      [
        1997,
        -0.6248121495000001
      ],
      [
        1998,
        3.7375527699
      ],
      [
        1999,
        -2.5821993575
      ],
      [
        2000,
        7.5759803922
      ],
      [
        2001,
        3.8026019002
      ],
      [
        2002,
        4.5818700615
      ],
      [
        2003,
        0.8132640747
      ],
      [
        2004,
        3.4766316228
      ],
      [
        2005,
        7.755758977999999
      ],
      [
        2006,
        6.2359970126999995
      ],
      [
        2007,
        -1.5822227504
      ],
      [
        2008,
        5.5722332351
      ],
      [
        2009,
        7.468942484099999
      ],
      [
        2010,
        8.7516014593
      ],
      [
        2011,
        3.4206656806
      ],
      [
        2012,
        3.7999713125
      ],
      [
        2013,
        3.4407052492
      ],
      [
        2014,
        6.7799161577
      ],
      [
        2015,
        2.6464858769
      ],
      [
        2016,
        -2.8000187877
      ],
      [
        2017,
        -3.1
      ],
      [
        2018,
        1.0255542075
      ],
      [
        2019,
        "NA"
      ]
    ],
    "eau_douce_agri": [
      [
        1960,
        "NA"
      ],
      [
        1961,
        "NA"
      ],
      [
        1962,
        "NA"
      ],
      [
        1963,
        "NA"
      ],
      [
        1964,
        "NA"
      ],
      [
        1965,
        "NA"
      ],
      [
        1966,
        "NA"
      ],
      [
        1967,
        "NA"
      ],
      [
        1968,
        "NA"
      ],
      [
        1969,
        "NA"
      ],
      [
        1970,
        "NA"
      ],
      [
        1971,
        "NA"
      ],
      [
        1972,
        "NA"
      ],
      [
        1973,
        "NA"
      ],
      [
        1974,
        "NA"
      ],
      [
        1975,
        "NA"
      ],
      [
        1976,
        "NA"
      ],
      [
        1977,
        "NA"
      ],
      [
        1978,
        "NA"
      ],
      [
        1979,
        "NA"
      ],
      [
        1980,
        "NA"
      ],
      [
        1981,
        "NA"
      ],
      [
        1982,
        "NA"
      ],
      [
        1983,
        "NA"
      ],
      [
        1984,
        "NA"
      ],
      [
        1985,
        "NA"
      ],
      [
        1986,
        "NA"
      ],
      [
        1987,
        11.0
      ],
      [
        1988,
        "NA"
      ],
      [
        1989,
        "NA"
      ],
      [
        1990,
        "NA"
      ],
      [
        1991,
        "NA"
      ],
      [
        1992,
        "NA"
      ],
      [
        1993,
        "NA"
      ],
      [
        1994,
        "NA"
      ],
      [
        1995,
        "NA"
      ],
      [
        1996,
        "NA"
      ],
      [
        1997,
        "NA"
      ],
      [
        1998,
        "NA"
      ],
      [
        1999,
        "NA"
      ],
      [
        2000,
        "NA"
      ],
      [
        2001,
        "NA"
      ],
      [
        2002,
        8.696
      ],
      [
        2003,
        "NA"
      ],
      [
        2004,
        "NA"
      ],
      [
        2005,
        "NA"
      ],
      [
        2006,
        "NA"
      ],
      [
        2007,
        "NA"
      ],
      [
        2008,
        "NA"
      ],
      [
        2009,
        "NA"
      ],
      [
        2010,
        "NA"
      ],
      [
        2011,
        "NA"
      ],
      [
        2012,
        "NA"
      ],
      [
        2013,
        "NA"
      ],
      [
        2014,
        "NA"
      ],
      [
        2015,
        "NA"
      ],
      [
        2016,
        "NA"
      ],
      [
        2017,
        "NA"
      ],
      [
        2018,
        "NA"
      ],
      [
        2019,
        "NA"
      ]
    ],
    "emploi_agri": [
      [
        1960,
        "NA"
      ],
      [
        1961,
        "NA"
      ],
      [
        1962,
        "NA"
      ],
      [
        1963,
        "NA"
      ],
      [
        1964,
        "NA"
      ],
      [
        1965,
        "NA"
      ],
      [
        1966,
        "NA"
      ],
      [
        1967,
        "NA"
      ],
      [
        1968,
        "NA"
      ],
      [
        1969,
        "NA"
      ],
      [
        1970,
        "NA"
      ],
      [
        1971,
        "NA"
      ],
      [
        1972,
        "NA"
      ],
      [
        1973,
        "NA"
      ],
      [
        1974,
        "NA"
      ],
      [
        1975,
        "NA"
      ],
      [
        1976,
        "NA"
      ],
      [
        1977,
        "NA"
      ],
      [
        1978,
        "NA"
      ],
      [
        1979,
        "NA"
      ],
      [
        1980,
        "NA"
      ],
      [
        1981,
        "NA"
      ],
      [
        1982,
        "NA"
      ],
      [
        1983,
        "NA"
      ],
      [
        1984,
        "NA"
      ],
      [
        1985,
        "NA"
      ],
      [
        1986,
        "NA"
      ],
      [
        1987,
        "NA"
      ],
      [
        1988,
        "NA"
      ],
      [
        1989,
        "NA"
      ],
      [
        1990,
        "NA"
      ],
      [
        1991,
        42.3950004578
      ],
      [
        1992,
        42.3590011597
      ],
      [
        1993,
        42.4199981689
      ],
      [
        1994,
        42.6500015259
      ],
      [
        1995,
        42.5229988098
      ],
      [
        1996,
        42.361000061
      ],
      [
        1997,
        42.4179992676
      ],
      [
        1998,
        42.2319984436
      ],
      [
        1999,
        42.3689994812
      ],
      [
        2000,
        41.8250007629
      ],
      [
        2001,
        41.4819984436
      ],
      [
        2002,
        41.087001800500005
      ],
      [
        2003,
        40.938999175999996
      ],
      [
        2004,
        40.608001709
      ],
      [
        2005,
        39.96900177
      ],
      [
        2006,
        39.432998657199995
      ],
      [
        2007,
        39.456001281700004
      ],
      [
        2008,
        38.8909988403
      ],
      [
        2009,
        38.1769981384
      ],
      [
        2010,
        37.422000885
      ],
      [
        2011,
        36.9959983826
      ],
      [
        2012,
        36.4900016785
      ],
      [
        2013,
        36.0050010681
      ],
      [
        2014,
        35.3880004883
      ],
      [
        2015,
        34.962001800500005
      ],
      [
        2016,
        34.9819984436
      ],
      [
        2017,
        34.938999175999996
      ],
      [
        2018,
        34.6030006409
      ],
      [
        2019,
        34.1300010681
      ]
    ],
    "enseignant_primaire": [
      [
        1960,
        "NA"
      ],
      [
        1961,
        "NA"
      ],
      [
        1962,
        "NA"
      ],
      [
        1963,
        "NA"
      ],
      [
        1964,
        "NA"
      ],
      [
        1965,
        "NA"
      ],
      [
        1966,
        "NA"
      ],
      [
        1967,
        "NA"
      ],
      [
        1968,
        "NA"
      ],
      [
        1969,
        "NA"
      ],
      [
        1970,
        "NA"
      ],
      [
        1971,
        "NA"
      ],
      [
        1972,
        "NA"
      ],
      [
        1973,
        "NA"
      ],
      [
        1974,
        "NA"
      ],
      [
        1975,
        "NA"
      ],
      [
        1976,
        "NA"
      ],
      [
        1977,
        "NA"
      ],
      [
        1978,
        "NA"
      ],
      [
        1979,
        "NA"
      ],
      [
        1980,
        "NA"
      ],
      [
        1981,
        "NA"
      ],
      [
        1982,
        "NA"
      ],
      [
        1983,
        "NA"
      ],
      [
        1984,
        "NA"
      ],
      [
        1985,
        "NA"
      ],
      [
        1986,
        "NA"
      ],
      [
        1987,
        "NA"
      ],
      [
        1988,
        "NA"
      ],
      [
        1989,
        "NA"
      ],
      [
        1990,
        "NA"
      ],
      [
        1991,
        "NA"
      ],
      [
        1992,
        "NA"
      ],
      [
        1993,
        "NA"
      ],
      [
        1994,
        "NA"
      ],
      [
        1995,
        "NA"
      ],
      [
        1996,
        "NA"
      ],
      [
        1997,
        "NA"
      ],
      [
        1998,
        "NA"
      ],
      [
        1999,
        "NA"
      ],
      [
        2000,
        64.55294
      ],
      [
        2001,
        "NA"
      ],
      [
        2002,
        "NA"
      ],
      [
        2003,
        57.11179
      ],
      [
        2004,
        62.170590000000004
      ],
      [
        2005,
        "NA"
      ],
      [
        2006,
        88.99645
      ],
      [
        2007,
        "NA"
      ],
      [
        2008,
        "NA"
      ],
      [
        2009,
        "NA"
      ],
      [
        2010,
        86.77772
      ],
      [
        2011,
        79.32375
      ],
      [
        2012,
        80.31706
      ],
      [
        2013,
        "NA"
      ],
      [
        2014,
        "NA"
      ],
      [
        2015,
        "NA"
      ],
      [
        2016,
        "NA"
      ],
      [
        2017,
        "NA"
      ],
      [
        2018,
        "NA"
      ],
      [
        2019,
        "NA"
      ]
    ],
    "enseignant_secondaire": [
      [
        1960,
        "NA"
      ],
      [
        1961,
        "NA"
      ],
      [
        1962,
        "NA"
      ],
      [
        1963,
        "NA"
      ],
      [
        1964,
        "NA"
      ],
      [
        1965,
        "NA"
      ],
      [
        1966,
        "NA"
      ],
      [
        1967,
        "NA"
      ],
      [
        1968,
        "NA"
      ],
      [
        1969,
        "NA"
      ],
      [
        1970,
        "NA"
      ],
      [
        1971,
        "NA"
      ],
      [
        1972,
        "NA"
      ],
      [
        1973,
        "NA"
      ],
      [
        1974,
        "NA"
      ],
      [
        1975,
        "NA"
      ],
      [
        1976,
        "NA"
      ],
      [
        1977,
        "NA"
      ],
      [
        1978,
        "NA"
      ],
      [
        1979,
        "NA"
      ],
      [
        1980,
        "NA"
      ],
      [
        1981,
        "NA"
      ],
      [
        1982,
        "NA"
      ],
      [
        1983,
        "NA"
      ],
      [
        1984,
        "NA"
      ],
      [
        1985,
        "NA"
      ],
      [
        1986,
        "NA"
      ],
      [
        1987,
        "NA"
      ],
      [
        1988,
        "NA"
      ],
      [
        1989,
        "NA"
      ],
      [
        1990,
        "NA"
      ],
      [
        1991,
        "NA"
      ],
      [
        1992,
        "NA"
      ],
      [
        1993,
        "NA"
      ],
      [
        1994,
        "NA"
      ],
      [
        1995,
        "NA"
      ],
      [
        1996,
        "NA"
      ],
      [
        1997,
        "NA"
      ],
      [
        1998,
        "NA"
      ],
      [
        1999,
        "NA"
      ],
      [
        2000,
        "NA"
      ],
      [
        2001,
        "NA"
      ],
      [
        2002,
        "NA"
      ],
      [
        2003,
        "NA"
      ],
      [
        2004,
        "NA"
      ],
      [
        2005,
        "NA"
      ],
      [
        2006,
        "NA"
      ],
      [
        2007,
        "NA"
      ],
      [
        2008,
        "NA"
      ],
      [
        2009,
        "NA"
      ],
      [
        2010,
        "NA"
      ],
      [
        2011,
        "NA"
      ],
      [
        2012,
        59.21276999999999
      ],
      [
        2013,
        "NA"
      ],
      [
        2014,
        "NA"
      ],
      [
        2015,
        "NA"
      ],
      [
        2016,
        "NA"
      ],
      [
        2017,
        "NA"
      ],
      [
        2018,
        "NA"
      ],
      [
        2019,
        "NA"
      ]
    ],
    "frag_pol": [
      [
        2006,
        1.0
      ],
      [
        2007,
        1.0
      ],
      [
        2008,
        1.0
      ],
      [
        2009,
        1.0
      ],
      [
        2010,
        1.0
      ],
      [
        2011,
        1.0
      ],
      [
        2012,
        1.0
      ],
      [
        2013,
        1.0
      ],
      [
        2014,
        1.0
      ],
      [
        2015,
        0.0
      ],
      [
        2016,
        0.0
      ],
      [
        2017,
        0.0
      ]
    ],
    "idh": [
      [
        1990,
        0.536
      ],
      [
        1991,
        0.535
      ],
      [
        1992,
        0.535
      ],
      [
        1993,
        0.528
      ],
      [
        1994,
        0.524
      ],
      [
        1995,
        0.507
      ],
      [
        1996,
        0.504
      ],
      [
        1997,
        0.505
      ],
      [
        1998,
        0.509
      ],
      [
        1999,
        0.496
      ],
      [
        2000,
        0.49
      ],
      [
        2001,
        0.495
      ],
      [
        2002,
        0.4970000000000001
      ],
      [
        2003,
        0.498
      ],
      [
        2004,
        0.501
      ],
      [
        2005,
        0.5
      ],
      [
        2006,
        0.503
      ],
      [
        2007,
        0.52
      ],
      [
        2008,
        0.536
      ],
      [
        2009,
        0.55
      ],
      [
        2010,
        0.557
      ],
      [
        2011,
        0.56
      ],
      [
        2012,
        0.573
      ],
      [
        2013,
        0.5820000000000001
      ],
      [
        2014,
        0.595
      ],
      [
        2015,
        0.613
      ],
      [
        2016,
        0.612
      ],
      [
        2017,
        0.606
      ]
    ],
    "lib_monde": [
      [
        2013,
        1.0
      ],
      [
        2014,
        1.0
      ],
      [
        2015,
        1.0
      ],
      [
        2016,
        1.0
      ],
      [
        2017,
        1.0
      ],
      [
        2018,
        1.0
      ]
    ],
    "migration": [
      [
        1955,
        0.0
      ],
      [
        1960,
        0.0
      ],
      [
        1965,
        0.0
      ],
      [
        1970,
        0.0
      ],
      [
        1975,
        0.0
      ],
      [
        1980,
        -0.894
      ],
      [
        1985,
        0.21899999999999997
      ],
      [
        1990,
        0.18100000000000002
      ],
      [
        1995,
        1.78
      ],
      [
        2000,
        3.38
      ],
      [
        2005,
        3.051
      ],
      [
        2010,
        4.649
      ],
      [
        2015,
        -2.6289999999999996
      ],
      [
        2020,
        -0.7709999999999999
      ],
      [
        2025,
        -0.34
      ],
      [
        2030,
        -0.151
      ],
      [
        2035,
        -0.134
      ],
      [
        2040,
        -0.12
      ],
      [
        2045,
        -0.10800000000000001
      ],
      [
        2050,
        -0.098
      ],
      [
        2055,
        -0.08900000000000001
      ],
      [
        2060,
        -0.08199999999999999
      ],
      [
        2065,
        -0.075
      ],
      [
        2070,
        -0.07
      ],
      [
        2075,
        -0.065
      ],
      [
        2080,
        -0.061
      ],
      [
        2085,
        -0.057
      ],
      [
        2090,
        -0.054000000000000006
      ],
      [
        2095,
        -0.051
      ],
      [
        2100,
        -0.049
      ]
    ],
    "mortal_infant": [
      [
        1960,
        183.3
      ],
      [
        1961,
        179.3
      ],
      [
        1962,
        175.3
      ],
      [
        1963,
        171.3
      ],
      [
        1964,
        167.3
      ],
      [
        1965,
        162.8
      ],
      [
        1966,
        158.5
      ],
      [
        1967,
        153.9
      ],
      [
        1968,
        149.3
      ],
      [
        1969,
        144.9
      ],
      [
        1970,
        140.9
      ],
      [
        1971,
        137.2
      ],
      [
        1972,
        133.5
      ],
      [
        1973,
        130.1
      ],
      [
        1974,
        126.6
      ],
      [
        1975,
        123.5
      ],
      [
        1976,
        120.3
      ],
      [
        1977,
        117.5
      ],
      [
        1978,
        114.5
      ],
      [
        1979,
        111.4
      ],
      [
        1980,
        108.7
      ],
      [
        1981,
        105.8
      ],
      [
        1982,
        102.8
      ],
      [
        1983,
        99.7
      ],
      [
        1984,
        96.7
      ],
      [
        1985,
        94.0
      ],
      [
        1986,
        91.7
      ],
      [
        1987,
        90.0
      ],
      [
        1988,
        89.2
      ],
      [
        1989,
        89.2
      ],
      [
        1990,
        90.2
      ],
      [
        1991,
        91.8
      ],
      [
        1992,
        94.3
      ],
      [
        1993,
        97.3
      ],
      [
        1994,
        100.7
      ],
      [
        1995,
        104.6
      ],
      [
        1996,
        108.4
      ],
      [
        1997,
        112.0
      ],
      [
        1998,
        114.6
      ],
      [
        1999,
        115.5
      ],
      [
        2000,
        114.3
      ],
      [
        2001,
        111.2
      ],
      [
        2002,
        106.4
      ],
      [
        2003,
        100.2
      ],
      [
        2004,
        93.2
      ],
      [
        2005,
        86.1
      ],
      [
        2006,
        79.4
      ],
      [
        2007,
        73.6
      ],
      [
        2008,
        68.8
      ],
      [
        2009,
        65.1
      ],
      [
        2010,
        62.5
      ],
      [
        2011,
        60.7
      ],
      [
        2012,
        59.2
      ],
      [
        2013,
        57.9
      ],
      [
        2014,
        56.4
      ],
      [
        2015,
        54.9
      ],
      [
        2016,
        53.3
      ],
      [
        2017,
        51.6
      ],
      [
        2018,
        50.1
      ],
      [
        2019,
        "NA"
      ]
    ],
    "pib": [
      [
        1980,
        2.083
      ],
      [
        1981,
        1.7080000000000002
      ],
      [
        1982,
        1.489
      ],
      [
        1983,
        1.354
      ],
      [
        1984,
        1.245
      ],
      [
        1985,
        1.276
      ],
      [
        1986,
        1.746
      ],
      [
        1987,
        2.121
      ],
      [
        1988,
        2.2569999999999997
      ],
      [
        1989,
        2.384
      ],
      [
        1990,
        2.799
      ],
      [
        1991,
        2.725
      ],
      [
        1992,
        2.9330000000000003
      ],
      [
        1993,
        2.6839999999999997
      ],
      [
        1994,
        1.7690000000000001
      ],
      [
        1995,
        2.116
      ],
      [
        1996,
        2.54
      ],
      [
        1997,
        2.323
      ],
      [
        1998,
        1.949
      ],
      [
        1999,
        2.3569999999999998
      ],
      [
        2000,
        3.22
      ],
      [
        2001,
        2.7939999999999996
      ],
      [
        2002,
        3.02
      ],
      [
        2003,
        3.503
      ],
      [
        2004,
        4.655
      ],
      [
        2005,
        6.093
      ],
      [
        2006,
        7.739
      ],
      [
        2007,
        7.446000000000001
      ],
      [
        2008,
        10.216000000000001
      ],
      [
        2009,
        9.366
      ],
      [
        2010,
        12.302999999999999
      ],
      [
        2011,
        14.814
      ],
      [
        2012,
        13.664000000000001
      ],
      [
        2013,
        14.026
      ],
      [
        2014,
        14.1
      ],
      [
        2015,
        8.554
      ],
      [
        2016,
        7.787000000000001
      ],
      [
        2017,
        8.932
      ],
      [
        2018,
        11.664000000000001
      ],
      [
        2019,
        11.575999999999999
      ],
      [
        2020,
        11.54
      ],
      [
        2021,
        11.475
      ],
      [
        2022,
        11.218
      ],
      [
        2023,
        11.29
      ],
      [
        2024,
        11.597999999999999
      ]
    ],
    "pib_hab": [
      [
        1980,
        1311.065
      ],
      [
        1981,
        1042.618
      ],
      [
        1982,
        881.785
      ],
      [
        1983,
        777.7330000000001
      ],
      [
        1984,
        693.686
      ],
      [
        1985,
        690.061
      ],
      [
        1986,
        915.602
      ],
      [
        1987,
        1079.073
      ],
      [
        1988,
        1113.618
      ],
      [
        1989,
        1107.124
      ],
      [
        1990,
        1260.674
      ],
      [
        1991,
        1191.066
      ],
      [
        1992,
        1250.849
      ],
      [
        1993,
        1116.788
      ],
      [
        1994,
        718.177
      ],
      [
        1995,
        837.921
      ],
      [
        1996,
        981.466
      ],
      [
        1997,
        875.4119999999999
      ],
      [
        1998,
        716.86
      ],
      [
        1999,
        845.612
      ],
      [
        2000,
        1126.961
      ],
      [
        2001,
        954.1339999999999
      ],
      [
        2002,
        1006.064
      ],
      [
        2003,
        1138.4569999999999
      ],
      [
        2004,
        1475.973
      ],
      [
        2005,
        1884.795
      ],
      [
        2006,
        2335.518
      ],
      [
        2007,
        2192.487
      ],
      [
        2008,
        2934.697
      ],
      [
        2009,
        2624.967
      ],
      [
        2010,
        3363.8909999999996
      ],
      [
        2011,
        3951.7209999999995
      ],
      [
        2012,
        3556.0229999999997
      ],
      [
        2013,
        3561.1059999999998
      ],
      [
        2014,
        3492.5040000000004
      ],
      [
        2015,
        2067.0860000000002
      ],
      [
        2016,
        1835.8110000000001
      ],
      [
        2017,
        2054.526
      ],
      [
        2018,
        2617.516
      ],
      [
        2019,
        2534.492
      ],
      [
        2020,
        2464.874
      ],
      [
        2021,
        2391.237
      ],
      [
        2022,
        2280.663
      ],
      [
        2023,
        2239.223
      ],
      [
        2024,
        2244.353
      ]
    ],
    "pib_ppa": [
      [
        1980,
        3.135
      ],
      [
        1981,
        3.522
      ],
      [
        1982,
        3.8289999999999997
      ],
      [
        1983,
        4.075
      ],
      [
        1984,
        4.322
      ],
      [
        1985,
        4.564
      ],
      [
        1986,
        4.765
      ],
      [
        1987,
        4.996
      ],
      [
        1988,
        6.305
      ],
      [
        1989,
        7.946000000000001
      ],
      [
        1990,
        8.327
      ],
      [
        1991,
        8.814
      ],
      [
        1992,
        9.251
      ],
      [
        1993,
        9.377
      ],
      [
        1994,
        9.051
      ],
      [
        1995,
        9.609
      ],
      [
        1996,
        10.205
      ],
      [
        1997,
        10.315999999999999
      ],
      [
        1998,
        10.822000000000001
      ],
      [
        1999,
        10.695
      ],
      [
        2000,
        11.762
      ],
      [
        2001,
        12.478
      ],
      [
        2002,
        13.255999999999998
      ],
      [
        2003,
        13.612
      ],
      [
        2004,
        14.464
      ],
      [
        2005,
        16.070999999999998
      ],
      [
        2006,
        17.59
      ],
      [
        2007,
        17.777
      ],
      [
        2008,
        19.133
      ],
      [
        2009,
        20.791
      ],
      [
        2010,
        22.866
      ],
      [
        2011,
        24.136
      ],
      [
        2012,
        25.541
      ],
      [
        2013,
        26.839000000000002
      ],
      [
        2014,
        29.206
      ],
      [
        2015,
        30.283
      ],
      [
        2016,
        29.730999999999998
      ],
      [
        2017,
        29.754
      ],
      [
        2018,
        30.964000000000002
      ],
      [
        2019,
        31.219
      ],
      [
        2020,
        30.701999999999998
      ],
      [
        2021,
        32.375
      ]
    ],
    "pop_pauvrete": [
      [
        1960,
        "NA"
      ],
      [
        1961,
        "NA"
      ],
      [
        1962,
        "NA"
      ],
      [
        1963,
        "NA"
      ],
      [
        1964,
        "NA"
      ],
      [
        1965,
        "NA"
      ],
      [
        1966,
        "NA"
      ],
      [
        1967,
        "NA"
      ],
      [
        1968,
        "NA"
      ],
      [
        1969,
        "NA"
      ],
      [
        1970,
        "NA"
      ],
      [
        1971,
        "NA"
      ],
      [
        1972,
        "NA"
      ],
      [
        1973,
        "NA"
      ],
      [
        1974,
        "NA"
      ],
      [
        1975,
        "NA"
      ],
      [
        1976,
        "NA"
      ],
      [
        1977,
        "NA"
      ],
      [
        1978,
        "NA"
      ],
      [
        1979,
        "NA"
      ],
      [
        1980,
        "NA"
      ],
      [
        1981,
        "NA"
      ],
      [
        1982,
        "NA"
      ],
      [
        1983,
        "NA"
      ],
      [
        1984,
        "NA"
      ],
      [
        1985,
        "NA"
      ],
      [
        1986,
        "NA"
      ],
      [
        1987,
        "NA"
      ],
      [
        1988,
        "NA"
      ],
      [
        1989,
        "NA"
      ],
      [
        1990,
        "NA"
      ],
      [
        1991,
        "NA"
      ],
      [
        1992,
        "NA"
      ],
      [
        1993,
        "NA"
      ],
      [
        1994,
        "NA"
      ],
      [
        1995,
        "NA"
      ],
      [
        1996,
        "NA"
      ],
      [
        1997,
        "NA"
      ],
      [
        1998,
        "NA"
      ],
      [
        1999,
        "NA"
      ],
      [
        2000,
        "NA"
      ],
      [
        2001,
        "NA"
      ],
      [
        2002,
        "NA"
      ],
      [
        2003,
        "NA"
      ],
      [
        2004,
        "NA"
      ],
      [
        2005,
        53.4
      ],
      [
        2006,
        "NA"
      ],
      [
        2007,
        "NA"
      ],
      [
        2008,
        "NA"
      ],
      [
        2009,
        "NA"
      ],
      [
        2010,
        "NA"
      ],
      [
        2011,
        37.0
      ],
      [
        2012,
        "NA"
      ],
      [
        2013,
        "NA"
      ],
      [
        2014,
        "NA"
      ],
      [
        2015,
        "NA"
      ],
      [
        2016,
        "NA"
      ],
      [
        2017,
        "NA"
      ],
      [
        2018,
        "NA"
      ],
      [
        2019,
        "NA"
      ]
    ],
    "pop_rurale": [
      [
        1960,
        68.399
      ],
      [
        1961,
        67.682
      ],
      [
        1962,
        66.955
      ],
      [
        1963,
        66.22
      ],
      [
        1964,
        65.476
      ],
      [
        1965,
        64.727
      ],
      [
        1966,
        63.968999999999994
      ],
      [
        1967,
        63.20399999999999
      ],
      [
        1968,
        62.431000000000004
      ],
      [
        1969,
        61.655
      ],
      [
        1970,
        60.871
      ],
      [
        1971,
        60.081
      ],
      [
        1972,
        59.285
      ],
      [
        1973,
        58.486000000000004
      ],
      [
        1974,
        57.643
      ],
      [
        1975,
        56.736000000000004
      ],
      [
        1976,
        55.823
      ],
      [
        1977,
        54.909
      ],
      [
        1978,
        53.99
      ],
      [
        1979,
        53.068000000000005
      ],
      [
        1980,
        52.143
      ],
      [
        1981,
        51.218999999999994
      ],
      [
        1982,
        50.293
      ],
      [
        1983,
        49.367
      ],
      [
        1984,
        48.44
      ],
      [
        1985,
        47.778999999999996
      ],
      [
        1986,
        47.358000000000004
      ],
      [
        1987,
        46.93600000000001
      ],
      [
        1988,
        46.515
      ],
      [
        1989,
        46.095
      ],
      [
        1990,
        45.676
      ],
      [
        1991,
        45.257
      ],
      [
        1992,
        44.838
      ],
      [
        1993,
        44.42
      ],
      [
        1994,
        44.004
      ],
      [
        1995,
        43.586999999999996
      ],
      [
        1996,
        43.168
      ],
      [
        1997,
        42.701
      ],
      [
        1998,
        42.233999999999995
      ],
      [
        1999,
        41.769
      ],
      [
        2000,
        41.305
      ],
      [
        2001,
        40.844
      ],
      [
        2002,
        40.383
      ],
      [
        2003,
        39.924
      ],
      [
        2004,
        39.467
      ],
      [
        2005,
        39.012
      ],
      [
        2006,
        38.559
      ],
      [
        2007,
        38.107
      ],
      [
        2008,
        37.654
      ],
      [
        2009,
        37.2
      ],
      [
        2010,
        36.744
      ],
      [
        2011,
        36.288000000000004
      ],
      [
        2012,
        35.830999999999996
      ],
      [
        2013,
        35.373000000000005
      ],
      [
        2014,
        34.915
      ],
      [
        2015,
        34.457
      ],
      [
        2016,
        33.999
      ],
      [
        2017,
        33.541
      ],
      [
        2018,
        33.084
      ],
      [
        2019,
        "NA"
      ]
    ],
    "pop_tot": [
      [
        1950,
        0.8272520000000001
      ],
      [
        1951,
        0.8424709999999999
      ],
      [
        1952,
        0.858406
      ],
      [
        1953,
        0.8751049999999999
      ],
      [
        1954,
        0.8926290000000001
      ],
      [
        1955,
        0.9110290000000001
      ],
      [
        1956,
        0.930378
      ],
      [
        1957,
        0.950716
      ],
      [
        1958,
        0.972103
      ],
      [
        1959,
        0.994598
      ],
      [
        1960,
        1.018253
      ],
      [
        1961,
        1.043116
      ],
      [
        1962,
        1.069238
      ],
      [
        1963,
        1.096638
      ],
      [
        1964,
        1.125352
      ],
      [
        1965,
        1.155392
      ],
      [
        1966,
        1.186785
      ],
      [
        1967,
        1.219541
      ],
      [
        1968,
        1.25376
      ],
      [
        1969,
        1.2895219999999998
      ],
      [
        1970,
        1.326885
      ],
      [
        1971,
        1.365899
      ],
      [
        1972,
        1.4065219999999998
      ],
      [
        1973,
        1.4486370000000002
      ],
      [
        1974,
        1.492055
      ],
      [
        1975,
        1.5366540000000002
      ],
      [
        1976,
        1.582358
      ],
      [
        1977,
        1.629209
      ],
      [
        1978,
        1.677332
      ],
      [
        1979,
        1.726866
      ],
      [
        1980,
        1.7779340000000001
      ],
      [
        1981,
        1.830632
      ],
      [
        1982,
        1.884875
      ],
      [
        1983,
        1.9404430000000001
      ],
      [
        1984,
        1.996995
      ],
      [
        1985,
        2.054312
      ],
      [
        1986,
        2.112361
      ],
      [
        1987,
        2.171321
      ],
      [
        1988,
        2.231465
      ],
      [
        1989,
        2.2931660000000003
      ],
      [
        1990,
        2.356737
      ],
      [
        1991,
        2.422305
      ],
      [
        1992,
        2.489952
      ],
      [
        1993,
        2.559873
      ],
      [
        1994,
        2.632345
      ],
      [
        1995,
        2.707537
      ],
      [
        1996,
        2.7858099999999997
      ],
      [
        1997,
        2.86728
      ],
      [
        1998,
        2.951647
      ],
      [
        1999,
        3.0384330000000004
      ],
      [
        2000,
        3.127411
      ],
      [
        2001,
        3.2179330000000004
      ],
      [
        2002,
        3.3103870000000004
      ],
      [
        2003,
        3.406922
      ],
      [
        2004,
        3.510468
      ],
      [
        2005,
        3.622775
      ],
      [
        2006,
        3.745141
      ],
      [
        2007,
        3.876119
      ],
      [
        2008,
        4.011486
      ],
      [
        2009,
        4.145391
      ],
      [
        2010,
        4.273731
      ],
      [
        2011,
        4.394844
      ],
      [
        2012,
        4.510198999999999
      ],
      [
        2013,
        4.622762000000001
      ],
      [
        2014,
        4.7369759999999985
      ],
      [
        2015,
        4.856095
      ],
      [
        2016,
        4.980996
      ],
      [
        2017,
        5.110695
      ],
      [
        2018,
        5.244358999999999
      ],
      [
        2019,
        5.380508
      ],
      [
        2020,
        5.518087
      ],
      [
        2021,
        5.657013
      ],
      [
        2022,
        5.797805
      ],
      [
        2023,
        5.94075
      ],
      [
        2024,
        6.086284
      ],
      [
        2025,
        6.234724
      ],
      [
        2026,
        6.386127
      ],
      [
        2027,
        6.5403720000000005
      ],
      [
        2028,
        6.697436
      ],
      [
        2029,
        6.857281
      ],
      [
        2030,
        7.019831
      ],
      [
        2031,
        7.185078000000002
      ],
      [
        2032,
        7.3529789999999995
      ],
      [
        2033,
        7.523401
      ],
      [
        2034,
        7.69619
      ],
      [
        2035,
        7.8712100000000005
      ],
      [
        2036,
        8.048358
      ],
      [
        2037,
        8.227576
      ],
      [
        2038,
        8.408767999999998
      ],
      [
        2039,
        8.591824
      ],
      [
        2040,
        8.776648
      ],
      [
        2041,
        8.963175999999997
      ],
      [
        2042,
        9.151311
      ],
      [
        2043,
        9.340927
      ],
      [
        2044,
        9.531884
      ],
      [
        2045,
        9.724082
      ],
      [
        2046,
        9.917442
      ],
      [
        2047,
        10.111925
      ],
      [
        2048,
        10.307508
      ],
      [
        2049,
        10.504196
      ],
      [
        2050,
        10.701994
      ],
      [
        2051,
        10.900865
      ],
      [
        2052,
        11.100779
      ],
      [
        2053,
        11.301739
      ],
      [
        2054,
        11.503735
      ],
      [
        2055,
        11.706763
      ],
      [
        2056,
        11.910789999999999
      ],
      [
        2057,
        12.115795
      ],
      [
        2058,
        12.321862
      ],
      [
        2059,
        12.529069
      ],
      [
        2060,
        12.73746
      ],
      [
        2061,
        12.947065
      ],
      [
        2062,
        13.157789999999999
      ],
      [
        2063,
        13.369464
      ],
      [
        2064,
        13.581868
      ],
      [
        2065,
        13.794826
      ],
      [
        2066,
        14.008221
      ],
      [
        2067,
        14.222017999999998
      ],
      [
        2068,
        14.436276999999999
      ],
      [
        2069,
        14.651092000000002
      ],
      [
        2070,
        14.866501000000001
      ],
      [
        2071,
        15.082466
      ],
      [
        2072,
        15.298807
      ],
      [
        2073,
        15.515303
      ],
      [
        2074,
        15.731645
      ],
      [
        2075,
        15.947582
      ],
      [
        2076,
        16.162966
      ],
      [
        2077,
        16.377741
      ],
      [
        2078,
        16.591776000000007
      ],
      [
        2079,
        16.804976
      ],
      [
        2080,
        17.01724
      ],
      [
        2081,
        17.22847
      ],
      [
        2082,
        17.438561
      ],
      [
        2083,
        17.647437999999994
      ],
      [
        2084,
        17.855031
      ],
      [
        2085,
        18.061287
      ],
      [
        2086,
        18.266132
      ],
      [
        2087,
        18.469520000000003
      ],
      [
        2088,
        18.67136
      ],
      [
        2089,
        18.871583
      ],
      [
        2090,
        19.070131
      ],
      [
        2091,
        19.266964
      ],
      [
        2092,
        19.462073999999998
      ],
      [
        2093,
        19.655455000000003
      ],
      [
        2094,
        19.847122
      ],
      [
        2095,
        20.037076000000006
      ],
      [
        2096,
        20.225354
      ],
      [
        2097,
        20.411964
      ],
      [
        2098,
        20.596921
      ],
      [
        2099,
        20.780263
      ],
      [
        2100,
        20.961988
      ]
    ],
    "pop_urbaine": [
      [
        1960,
        31.601
      ],
      [
        1961,
        32.318000000000005
      ],
      [
        1962,
        33.045
      ],
      [
        1963,
        33.78
      ],
      [
        1964,
        34.524
      ],
      [
        1965,
        35.273
      ],
      [
        1966,
        36.031
      ],
      [
        1967,
        36.796
      ],
      [
        1968,
        37.569
      ],
      [
        1969,
        38.345
      ],
      [
        1970,
        39.129
      ],
      [
        1971,
        39.919000000000004
      ],
      [
        1972,
        40.715
      ],
      [
        1973,
        41.513999999999996
      ],
      [
        1974,
        42.357
      ],
      [
        1975,
        43.263999999999996
      ],
      [
        1976,
        44.177
      ],
      [
        1977,
        45.091
      ],
      [
        1978,
        46.01
      ],
      [
        1979,
        46.931999999999995
      ],
      [
        1980,
        47.857
      ],
      [
        1981,
        48.781000000000006
      ],
      [
        1982,
        49.707
      ],
      [
        1983,
        50.633
      ],
      [
        1984,
        51.56
      ],
      [
        1985,
        52.221000000000004
      ],
      [
        1986,
        52.641999999999996
      ],
      [
        1987,
        53.06399999999999
      ],
      [
        1988,
        53.485
      ],
      [
        1989,
        53.905
      ],
      [
        1990,
        54.324
      ],
      [
        1991,
        54.743
      ],
      [
        1992,
        55.162
      ],
      [
        1993,
        55.58
      ],
      [
        1994,
        55.996
      ],
      [
        1995,
        56.413000000000004
      ],
      [
        1996,
        56.832
      ],
      [
        1997,
        57.299
      ],
      [
        1998,
        57.766000000000005
      ],
      [
        1999,
        58.231
      ],
      [
        2000,
        58.695
      ],
      [
        2001,
        59.156000000000006
      ],
      [
        2002,
        59.617
      ],
      [
        2003,
        60.076
      ],
      [
        2004,
        60.533
      ],
      [
        2005,
        60.988
      ],
      [
        2006,
        61.441
      ],
      [
        2007,
        61.893
      ],
      [
        2008,
        62.346000000000004
      ],
      [
        2009,
        62.8
      ],
      [
        2010,
        63.256
      ],
      [
        2011,
        63.711999999999996
      ],
      [
        2012,
        64.169
      ],
      [
        2013,
        64.627
      ],
      [
        2014,
        65.085
      ],
      [
        2015,
        65.543
      ],
      [
        2016,
        66.001
      ],
      [
        2017,
        66.459
      ],
      [
        2018,
        66.916
      ],
      [
        2019,
        "NA"
      ]
    ],
    "prod_elec_renouv": [
      [
        1960,
        "NA"
      ],
      [
        1961,
        "NA"
      ],
      [
        1962,
        "NA"
      ],
      [
        1963,
        "NA"
      ],
      [
        1964,
        "NA"
      ],
      [
        1965,
        "NA"
      ],
      [
        1966,
        "NA"
      ],
      [
        1967,
        "NA"
      ],
      [
        1968,
        "NA"
      ],
      [
        1969,
        "NA"
      ],
      [
        1970,
        "NA"
      ],
      [
        1971,
        0.0
      ],
      [
        1972,
        0.0
      ],
      [
        1973,
        0.0
      ],
      [
        1974,
        0.0
      ],
      [
        1975,
        0.0
      ],
      [
        1976,
        0.0
      ],
      [
        1977,
        0.0
      ],
      [
        1978,
        0.0
      ],
      [
        1979,
        0.0
      ],
      [
        1980,
        0.0
      ],
      [
        1981,
        0.0
      ],
      [
        1982,
        0.0
      ],
      [
        1983,
        0.0
      ],
      [
        1984,
        0.0
      ],
      [
        1985,
        0.0
      ],
      [
        1986,
        0.0
      ],
      [
        1987,
        0.0
      ],
      [
        1988,
        0.0
      ],
      [
        1989,
        0.0
      ],
      [
        1990,
        0.0
      ],
      [
        1991,
        0.0
      ],
      [
        1992,
        0.0
      ],
      [
        1993,
        0.0
      ],
      [
        1994,
        0.0
      ],
      [
        1995,
        0.0
      ],
      [
        1996,
        0.0
      ],
      [
        1997,
        0.0
      ],
      [
        1998,
        0.0
      ],
      [
        1999,
        0.0
      ],
      [
        2000,
        0.0
      ],
      [
        2001,
        0.0
      ],
      [
        2002,
        0.0
      ],
      [
        2003,
        0.0
      ],
      [
        2004,
        0.0
      ],
      [
        2005,
        0.0
      ],
      [
        2006,
        0.0
      ],
      [
        2007,
        0.0
      ],
      [
        2008,
        0.0
      ],
      [
        2009,
        0.0
      ],
      [
        2010,
        0.0
      ],
      [
        2011,
        0.0
      ],
      [
        2012,
        0.0
      ],
      [
        2013,
        0.0
      ],
      [
        2014,
        0.0
      ],
      [
        2015,
        0.0
      ],
      [
        2016,
        "NA"
      ],
      [
        2017,
        "NA"
      ],
      [
        2018,
        "NA"
      ],
      [
        2019,
        "NA"
      ]
    ],
    "rdt_cerealier": [
      [
        1960,
        "NA"
      ],
      [
        1961,
        714.3
      ],
      [
        1962,
        711.3
      ],
      [
        1963,
        916.7
      ],
      [
        1964,
        932.6
      ],
      [
        1965,
        1020.4
      ],
      [
        1966,
        1000.0
      ],
      [
        1967,
        1090.9
      ],
      [
        1968,
        1347.8
      ],
      [
        1969,
        952.4
      ],
      [
        1970,
        888.9
      ],
      [
        1971,
        952.4
      ],
      [
        1972,
        894.3
      ],
      [
        1973,
        679.4
      ],
      [
        1974,
        706.2
      ],
      [
        1975,
        647.7
      ],
      [
        1976,
        648.2
      ],
      [
        1977,
        658.7
      ],
      [
        1978,
        457.6
      ],
      [
        1979,
        689.7
      ],
      [
        1980,
        845.4
      ],
      [
        1981,
        978.1
      ],
      [
        1982,
        646.7
      ],
      [
        1983,
        746.2
      ],
      [
        1984,
        677.9
      ],
      [
        1985,
        767.8
      ],
      [
        1986,
        854.6
      ],
      [
        1987,
        770.3
      ],
      [
        1988,
        801.9
      ],
      [
        1989,
        834.9
      ],
      [
        1990,
        624.3
      ],
      [
        1991,
        635.2
      ],
      [
        1992,
        639.2
      ],
      [
        1993,
        646.5
      ],
      [
        1994,
        654.4
      ],
      [
        1995,
        735.6
      ],
      [
        1996,
        746.3
      ],
      [
        1997,
        746.3
      ],
      [
        1998,
        755.8
      ],
      [
        1999,
        736.4
      ],
      [
        2000,
        753.9
      ],
      [
        2001,
        775.0
      ],
      [
        2002,
        772.0
      ],
      [
        2003,
        780.7
      ],
      [
        2004,
        776.4
      ],
      [
        2005,
        770.6
      ],
      [
        2006,
        777.8
      ],
      [
        2007,
        764.1
      ],
      [
        2008,
        771.4
      ],
      [
        2009,
        791.4
      ],
      [
        2010,
        785.0
      ],
      [
        2011,
        794.3
      ],
      [
        2012,
        809.8
      ],
      [
        2013,
        830.9
      ],
      [
        2014,
        823.6
      ],
      [
        2015,
        819.1
      ],
      [
        2016,
        824.3
      ],
      [
        2017,
        828.9
      ],
      [
        2018,
        "NA"
      ],
      [
        2019,
        "NA"
      ]
    ],
    "recette_budg": [
      [
        1980,
        "NA"
      ],
      [
        1981,
        "NA"
      ],
      [
        1982,
        "NA"
      ],
      [
        1983,
        "NA"
      ],
      [
        1984,
        "NA"
      ],
      [
        1985,
        "NA"
      ],
      [
        1986,
        "NA"
      ],
      [
        1987,
        "NA"
      ],
      [
        1988,
        "NA"
      ],
      [
        1989,
        21.9
      ],
      [
        1990,
        27.372
      ],
      [
        1991,
        25.491999999999997
      ],
      [
        1992,
        22.459
      ],
      [
        1993,
        24.099
      ],
      [
        1994,
        23.473000000000003
      ],
      [
        1995,
        24.619
      ],
      [
        1996,
        27.853
      ],
      [
        1997,
        28.595
      ],
      [
        1998,
        22.871
      ],
      [
        1999,
        26.951
      ],
      [
        2000,
        26.666
      ],
      [
        2001,
        30.846
      ],
      [
        2002,
        27.337
      ],
      [
        2003,
        30.195
      ],
      [
        2004,
        30.369
      ],
      [
        2005,
        38.798
      ],
      [
        2006,
        44.427
      ],
      [
        2007,
        44.316
      ],
      [
        2008,
        54.802
      ],
      [
        2009,
        30.269000000000002
      ],
      [
        2010,
        41.193999999999996
      ],
      [
        2011,
        46.424
      ],
      [
        2012,
        49.096000000000004
      ],
      [
        2013,
        50.631
      ],
      [
        2014,
        48.074
      ],
      [
        2015,
        32.647
      ],
      [
        2016,
        34.055
      ],
      [
        2017,
        27.851999999999997
      ],
      [
        2018,
        29.156
      ],
      [
        2019,
        31.480999999999998
      ],
      [
        2020,
        32.048
      ],
      [
        2021,
        32.673
      ],
      [
        2022,
        34.195
      ],
      [
        2023,
        34.684
      ],
      [
        2024,
        35.083
      ]
    ],
    "regime_pol": [
      [
        1816,
        -20.0
      ],
      [
        1817,
        -20.0
      ],
      [
        1818,
        -20.0
      ],
      [
        1819,
        -20.0
      ],
      [
        1820,
        -20.0
      ],
      [
        1821,
        -20.0
      ],
      [
        1822,
        -20.0
      ],
      [
        1823,
        -20.0
      ],
      [
        1824,
        -20.0
      ],
      [
        1825,
        -20.0
      ],
      [
        1826,
        -20.0
      ],
      [
        1827,
        -20.0
      ],
      [
        1828,
        -20.0
      ],
      [
        1829,
        -20.0
      ],
      [
        1830,
        -20.0
      ],
      [
        1831,
        -20.0
      ],
      [
        1832,
        -20.0
      ],
      [
        1833,
        -20.0
      ],
      [
        1834,
        -20.0
      ],
      [
        1835,
        -20.0
      ],
      [
        1836,
        -20.0
      ],
      [
        1837,
        -20.0
      ],
      [
        1838,
        -20.0
      ],
      [
        1839,
        -20.0
      ],
      [
        1840,
        -20.0
      ],
      [
        1841,
        -20.0
      ],
      [
        1842,
        -20.0
      ],
      [
        1843,
        -20.0
      ],
      [
        1844,
        -20.0
      ],
      [
        1845,
        -20.0
      ],
      [
        1846,
        -20.0
      ],
      [
        1847,
        -20.0
      ],
      [
        1848,
        -20.0
      ],
      [
        1849,
        -20.0
      ],
      [
        1850,
        -20.0
      ],
      [
        1851,
        -20.0
      ],
      [
        1852,
        -20.0
      ],
      [
        1853,
        -20.0
      ],
      [
        1854,
        -20.0
      ],
      [
        1855,
        -20.0
      ],
      [
        1856,
        -20.0
      ],
      [
        1857,
        -20.0
      ],
      [
        1858,
        -20.0
      ],
      [
        1859,
        -20.0
      ],
      [
        1860,
        -20.0
      ],
      [
        1861,
        -20.0
      ],
      [
        1862,
        -20.0
      ],
      [
        1863,
        -20.0
      ],
      [
        1864,
        -20.0
      ],
      [
        1865,
        -20.0
      ],
      [
        1866,
        -20.0
      ],
      [
        1867,
        -20.0
      ],
      [
        1868,
        -20.0
      ],
      [
        1869,
        -20.0
      ],
      [
        1870,
        -20.0
      ],
      [
        1871,
        -20.0
      ],
      [
        1872,
        -20.0
      ],
      [
        1873,
        -20.0
      ],
      [
        1874,
        -20.0
      ],
      [
        1875,
        -20.0
      ],
      [
        1876,
        -20.0
      ],
      [
        1877,
        -20.0
      ],
      [
        1878,
        -20.0
      ],
      [
        1879,
        -20.0
      ],
      [
        1880,
        -20.0
      ],
      [
        1881,
        -20.0
      ],
      [
        1882,
        -20.0
      ],
      [
        1883,
        -20.0
      ],
      [
        1884,
        -20.0
      ],
      [
        1885,
        -20.0
      ],
      [
        1886,
        -20.0
      ],
      [
        1887,
        -20.0
      ],
      [
        1888,
        -20.0
      ],
      [
        1889,
        -20.0
      ],
      [
        1890,
        -20.0
      ],
      [
        1891,
        -20.0
      ],
      [
        1892,
        -20.0
      ],
      [
        1893,
        -20.0
      ],
      [
        1894,
        -20.0
      ],
      [
        1895,
        -20.0
      ],
      [
        1896,
        -20.0
      ],
      [
        1897,
        -20.0
      ],
      [
        1898,
        -20.0
      ],
      [
        1899,
        -20.0
      ],
      [
        1900,
        -20.0
      ],
      [
        1901,
        -20.0
      ],
      [
        1902,
        -20.0
      ],
      [
        1903,
        -20.0
      ],
      [
        1904,
        -20.0
      ],
      [
        1905,
        -20.0
      ],
      [
        1906,
        -20.0
      ],
      [
        1907,
        -20.0
      ],
      [
        1908,
        -20.0
      ],
      [
        1909,
        -20.0
      ],
      [
        1910,
        -20.0
      ],
      [
        1911,
        -20.0
      ],
      [
        1912,
        -20.0
      ],
      [
        1913,
        -20.0
      ],
      [
        1914,
        -20.0
      ],
      [
        1915,
        -20.0
      ],
      [
        1916,
        -20.0
      ],
      [
        1917,
        -20.0
      ],
      [
        1918,
        -20.0
      ],
      [
        1919,
        -20.0
      ],
      [
        1920,
        -20.0
      ],
      [
        1921,
        -20.0
      ],
      [
        1922,
        -20.0
      ],
      [
        1923,
        -20.0
      ],
      [
        1924,
        -20.0
      ],
      [
        1925,
        -20.0
      ],
      [
        1926,
        -20.0
      ],
      [
        1927,
        -20.0
      ],
      [
        1928,
        -20.0
      ],
      [
        1929,
        -20.0
      ],
      [
        1930,
        -20.0
      ],
      [
        1931,
        -20.0
      ],
      [
        1932,
        -20.0
      ],
      [
        1933,
        -20.0
      ],
      [
        1934,
        -20.0
      ],
      [
        1935,
        -20.0
      ],
      [
        1936,
        -20.0
      ],
      [
        1937,
        -20.0
      ],
      [
        1938,
        -20.0
      ],
      [
        1939,
        -20.0
      ],
      [
        1940,
        -20.0
      ],
      [
        1941,
        -20.0
      ],
      [
        1942,
        -20.0
      ],
      [
        1943,
        -20.0
      ],
      [
        1944,
        -20.0
      ],
      [
        1945,
        -20.0
      ],
      [
        1946,
        -20.0
      ],
      [
        1947,
        -20.0
      ],
      [
        1948,
        -20.0
      ],
      [
        1949,
        -20.0
      ],
      [
        1950,
        -20.0
      ],
      [
        1951,
        -20.0
      ],
      [
        1952,
        -20.0
      ],
      [
        1953,
        -20.0
      ],
      [
        1954,
        -20.0
      ],
      [
        1955,
        -20.0
      ],
      [
        1956,
        -20.0
      ],
      [
        1957,
        -20.0
      ],
      [
        1958,
        -20.0
      ],
      [
        1959,
        -20.0
      ],
      [
        1960,
        4.0
      ],
      [
        1961,
        4.0
      ],
      [
        1962,
        4.0
      ],
      [
        1963,
        -7.0
      ],
      [
        1964,
        -7.0
      ],
      [
        1965,
        -7.0
      ],
      [
        1966,
        -7.0
      ],
      [
        1967,
        -7.0
      ],
      [
        1968,
        -7.0
      ],
      [
        1969,
        -7.0
      ],
      [
        1970,
        -7.0
      ],
      [
        1971,
        -7.0
      ],
      [
        1972,
        -7.0
      ],
      [
        1973,
        -7.0
      ],
      [
        1974,
        -7.0
      ],
      [
        1975,
        -7.0
      ],
      [
        1976,
        -7.0
      ],
      [
        1977,
        -7.0
      ],
      [
        1978,
        -7.0
      ],
      [
        1979,
        -8.0
      ],
      [
        1980,
        -8.0
      ],
      [
        1981,
        -8.0
      ],
      [
        1982,
        -8.0
      ],
      [
        1983,
        -8.0
      ],
      [
        1984,
        -8.0
      ],
      [
        1985,
        -8.0
      ],
      [
        1986,
        -8.0
      ],
      [
        1987,
        -8.0
      ],
      [
        1988,
        -8.0
      ],
      [
        1989,
        -8.0
      ],
      [
        1990,
        -8.0
      ],
      [
        1991,
        -1.0
      ],
      [
        1992,
        5.0
      ],
      [
        1993,
        5.0
      ],
      [
        1994,
        5.0
      ],
      [
        1995,
        5.0
      ],
      [
        1996,
        5.0
      ],
      [
        1997,
        -6.0
      ],
      [
        1998,
        -6.0
      ],
      [
        1999,
        -6.0
      ],
      [
        2000,
        -6.0
      ],
      [
        2001,
        -5.0
      ],
      [
        2002,
        -4.0
      ],
      [
        2003,
        -4.0
      ],
      [
        2004,
        -4.0
      ],
      [
        2005,
        -4.0
      ],
      [
        2006,
        -4.0
      ],
      [
        2007,
        -4.0
      ],
      [
        2008,
        -4.0
      ],
      [
        2009,
        -4.0
      ],
      [
        2010,
        -4.0
      ],
      [
        2011,
        -4.0
      ],
      [
        2012,
        -4.0
      ],
      [
        2013,
        -4.0
      ],
      [
        2014,
        -4.0
      ],
      [
        2015,
        -4.0
      ]
    ],
    "sous_nutri": [
      [
        1960,
        183.3
      ],
      [
        1961,
        179.3
      ],
      [
        1962,
        175.3
      ],
      [
        1963,
        171.3
      ],
      [
        1964,
        167.3
      ],
      [
        1965,
        162.8
      ],
      [
        1966,
        158.5
      ],
      [
        1967,
        153.9
      ],
      [
        1968,
        149.3
      ],
      [
        1969,
        144.9
      ],
      [
        1970,
        140.9
      ],
      [
        1971,
        137.2
      ],
      [
        1972,
        133.5
      ],
      [
        1973,
        130.1
      ],
      [
        1974,
        126.6
      ],
      [
        1975,
        123.5
      ],
      [
        1976,
        120.3
      ],
      [
        1977,
        117.5
      ],
      [
        1978,
        114.5
      ],
      [
        1979,
        111.4
      ],
      [
        1980,
        108.7
      ],
      [
        1981,
        105.8
      ],
      [
        1982,
        102.8
      ],
      [
        1983,
        99.7
      ],
      [
        1984,
        96.7
      ],
      [
        1985,
        94.0
      ],
      [
        1986,
        91.7
      ],
      [
        1987,
        90.0
      ],
      [
        1988,
        89.2
      ],
      [
        1989,
        89.2
      ],
      [
        1990,
        90.2
      ],
      [
        1991,
        91.8
      ],
      [
        1992,
        94.3
      ],
      [
        1993,
        97.3
      ],
      [
        1994,
        100.7
      ],
      [
        1995,
        104.6
      ],
      [
        1996,
        108.4
      ],
      [
        1997,
        112.0
      ],
      [
        1998,
        114.6
      ],
      [
        1999,
        115.5
      ],
      [
        2000,
        114.3
      ],
      [
        2001,
        111.2
      ],
      [
        2002,
        106.4
      ],
      [
        2003,
        100.2
      ],
      [
        2004,
        93.2
      ],
      [
        2005,
        86.1
      ],
      [
        2006,
        79.4
      ],
      [
        2007,
        73.6
      ],
      [
        2008,
        68.8
      ],
      [
        2009,
        65.1
      ],
      [
        2010,
        62.5
      ],
      [
        2011,
        60.7
      ],
      [
        2012,
        59.2
      ],
      [
        2013,
        57.9
      ],
      [
        2014,
        56.4
      ],
      [
        2015,
        54.9
      ],
      [
        2016,
        53.3
      ],
      [
        2017,
        51.6
      ],
      [
        2018,
        50.1
      ],
      [
        2019,
        "NA"
      ]
    ],
    "volume_exp_biens": [
      [
        1980,
        23.375
      ],
      [
        1981,
        3.6719999999999997
      ],
      [
        1982,
        -14.273
      ],
      [
        1983,
        -10.597999999999999
      ],
      [
        1984,
        -9.591000000000001
      ],
      [
        1985,
        0.8340000000000001
      ],
      [
        1986,
        34.493
      ],
      [
        1987,
        19.461
      ],
      [
        1988,
        4.6080000000000005
      ],
      [
        1989,
        15.249
      ],
      [
        1990,
        19.656
      ],
      [
        1991,
        -8.357999999999999
      ],
      [
        1992,
        8.315
      ],
      [
        1993,
        11.11
      ],
      [
        1994,
        -7.449
      ],
      [
        1995,
        0.04
      ],
      [
        1996,
        12.345
      ],
      [
        1997,
        14.949000000000002
      ],
      [
        1998,
        5.284
      ],
      [
        1999,
        8.466000000000001
      ],
      [
        2000,
        5.787000000000001
      ],
      [
        2001,
        -18.664
      ],
      [
        2002,
        13.914000000000001
      ],
      [
        2003,
        -6.7989999999999995
      ],
      [
        2004,
        -12.390999999999998
      ],
      [
        2005,
        23.086
      ],
      [
        2006,
        10.404000000000002
      ],
      [
        2007,
        -17.107
      ],
      [
        2008,
        -4.047
      ],
      [
        2009,
        21.965999999999998
      ],
      [
        2010,
        7.66
      ],
      [
        2011,
        -3.5469999999999997
      ],
      [
        2012,
        -11.254000000000001
      ],
      [
        2013,
        -8.277999999999999
      ],
      [
        2014,
        3.488
      ],
      [
        2015,
        -12.125
      ],
      [
        2016,
        -14.228
      ],
      [
        2017,
        29.113000000000003
      ],
      [
        2018,
        28.396
      ],
      [
        2019,
        1.3519999999999999
      ],
      [
        2020,
        8.504
      ],
      [
        2021,
        -2.426
      ],
      [
        2022,
        -9.783999999999999
      ],
      [
        2023,
        -7.33
      ],
      [
        2024,
        -1.764
      ]
    ],
    "volume_exp_bs": [
      [
        1980,
        9.67
      ],
      [
        1981,
        3.313
      ],
      [
        1982,
        -14.57
      ],
      [
        1983,
        -10.907
      ],
      [
        1984,
        -9.904
      ],
      [
        1985,
        0.484
      ],
      [
        1986,
        34.027
      ],
      [
        1987,
        19.047
      ],
      [
        1988,
        4.246
      ],
      [
        1989,
        13.536
      ],
      [
        1990,
        19.711
      ],
      [
        1991,
        -8.357999999999999
      ],
      [
        1992,
        8.315
      ],
      [
        1993,
        11.11
      ],
      [
        1994,
        -7.449
      ],
      [
        1995,
        0.04
      ],
      [
        1996,
        12.345
      ],
      [
        1997,
        14.949000000000002
      ],
      [
        1998,
        5.284
      ],
      [
        1999,
        8.466000000000001
      ],
      [
        2000,
        5.787000000000001
      ],
      [
        2001,
        -18.664
      ],
      [
        2002,
        13.914000000000001
      ],
      [
        2003,
        -6.7989999999999995
      ],
      [
        2004,
        -12.390999999999998
      ],
      [
        2005,
        23.086
      ],
      [
        2006,
        10.404000000000002
      ],
      [
        2007,
        -17.107
      ],
      [
        2008,
        -4.047
      ],
      [
        2009,
        21.965999999999998
      ],
      [
        2010,
        7.66
      ],
      [
        2011,
        -3.5469999999999997
      ],
      [
        2012,
        -11.254000000000001
      ],
      [
        2013,
        -8.277999999999999
      ],
      [
        2014,
        3.488
      ],
      [
        2015,
        -12.125
      ],
      [
        2016,
        -14.228
      ],
      [
        2017,
        29.113000000000003
      ],
      [
        2018,
        28.396
      ],
      [
        2019,
        1.3519999999999999
      ],
      [
        2020,
        8.504
      ],
      [
        2021,
        -2.426
      ],
      [
        2022,
        -9.783999999999999
      ],
      [
        2023,
        -7.33
      ],
      [
        2024,
        -1.764
      ]
    ],
    "volume_import_biens": [
      [
        1980,
        19.635
      ],
      [
        1981,
        4.101
      ],
      [
        1982,
        -13.918
      ],
      [
        1983,
        -10.227
      ],
      [
        1984,
        -9.216000000000001
      ],
      [
        1985,
        1.251
      ],
      [
        1986,
        34.971
      ],
      [
        1987,
        17.562
      ],
      [
        1988,
        2.946
      ],
      [
        1989,
        15.527000000000001
      ],
      [
        1990,
        0.401
      ],
      [
        1991,
        35.806
      ],
      [
        1992,
        -30.346999999999998
      ],
      [
        1993,
        66.257
      ],
      [
        1994,
        31.108
      ],
      [
        1995,
        -9.01
      ],
      [
        1996,
        20.009
      ],
      [
        1997,
        12.106
      ],
      [
        1998,
        1.834
      ],
      [
        1999,
        5.309
      ],
      [
        2000,
        9.381
      ],
      [
        2001,
        -11.844000000000001
      ],
      [
        2002,
        35.198
      ],
      [
        2003,
        -1.486
      ],
      [
        2004,
        2.35
      ],
      [
        2005,
        5.059
      ],
      [
        2006,
        3.554
      ],
      [
        2007,
        4.66
      ],
      [
        2008,
        3.533
      ],
      [
        2009,
        21.761999999999997
      ],
      [
        2010,
        20.421
      ],
      [
        2011,
        1.235
      ],
      [
        2012,
        -15.764000000000001
      ],
      [
        2013,
        -2.835
      ],
      [
        2014,
        40.164
      ],
      [
        2015,
        44.611999999999995
      ],
      [
        2016,
        2.444
      ],
      [
        2017,
        -39.8
      ],
      [
        2018,
        -7.702000000000001
      ],
      [
        2019,
        0.282
      ],
      [
        2020,
        6.487
      ],
      [
        2021,
        3.918
      ],
      [
        2022,
        2.7319999999999998
      ],
      [
        2023,
        1.649
      ],
      [
        2024,
        0.672
      ]
    ],
    "volume_import_bs": [
      [
        1980,
        31.43
      ],
      [
        1981,
        2.025
      ],
      [
        1982,
        -15.635
      ],
      [
        1983,
        -12.017999999999999
      ],
      [
        1984,
        -11.027000000000001
      ],
      [
        1985,
        -0.769
      ],
      [
        1986,
        32.434
      ],
      [
        1987,
        19.956
      ],
      [
        1988,
        5.042
      ],
      [
        1989,
        31.508000000000003
      ],
      [
        1990,
        -6.734
      ],
      [
        1991,
        49.788000000000004
      ],
      [
        1992,
        -38.644
      ],
      [
        1993,
        87.17399999999999
      ],
      [
        1994,
        49.258
      ],
      [
        1995,
        -7.136
      ],
      [
        1996,
        14.915
      ],
      [
        1997,
        -0.152
      ],
      [
        1998,
        5.715
      ],
      [
        1999,
        2.211
      ],
      [
        2000,
        4.582
      ],
      [
        2001,
        8.496
      ],
      [
        2002,
        6.2170000000000005
      ],
      [
        2003,
        4.0760000000000005
      ],
      [
        2004,
        -2.17
      ],
      [
        2005,
        17.581
      ],
      [
        2006,
        12.276
      ],
      [
        2007,
        8.228
      ],
      [
        2008,
        -7.95
      ],
      [
        2009,
        34.150999999999996
      ],
      [
        2010,
        21.024
      ],
      [
        2011,
        -0.733
      ],
      [
        2012,
        -13.392000000000001
      ],
      [
        2013,
        5.445
      ],
      [
        2014,
        32.246
      ],
      [
        2015,
        33.765
      ],
      [
        2016,
        0.13699999999999998
      ],
      [
        2017,
        -37.564
      ],
      [
        2018,
        5.892
      ],
      [
        2019,
        -0.451
      ],
      [
        2020,
        4.785
      ],
      [
        2021,
        1.275
      ],
      [
        2022,
        0.659
      ],
      [
        2023,
        -0.32899999999999996
      ],
      [
        2024,
        -0.444
      ]
    ],
    "vuln_clim_ferdi": [
      [
        2018,
        47.5720293703128
      ]
    ],
    "vuln_clim_ndgain": [
      [
        1995,
        0.5422225688251551
      ],
      [
        1996,
        0.5406562603554721
      ],
      [
        1997,
        0.540018808982643
      ],
      [
        1998,
        0.539003376570709
      ],
      [
        1999,
        0.538901867388621
      ],
      [
        2000,
        0.538635530970134
      ],
      [
        2001,
        0.539278871708832
      ],
      [
        2002,
        0.540280445211339
      ],
      [
        2003,
        0.541172336741739
      ],
      [
        2004,
        0.544458186709693
      ],
      [
        2005,
        0.5424635459792609
      ],
      [
        2006,
        0.539432223891815
      ],
      [
        2007,
        0.5386560947203309
      ],
      [
        2008,
        0.536097978125717
      ],
      [
        2009,
        0.536749894108631
      ],
      [
        2010,
        0.533380202668813
      ],
      [
        2011,
        0.538056696994775
      ],
      [
        2012,
        0.534755863786475
      ],
      [
        2013,
        0.532064105087928
      ],
      [
        2014,
        0.5274843621674079
      ],
      [
        2015,
        0.5252801489661321
      ],
      [
        2016,
        0.5224642637477329
      ]
    ]
  }
}