{
  "country": "GAB",
  "country_name": "Gabon",
  "indicators": {
    "abo_mobile": [
      [
        1960,
        0.0
      ],
      [
        1961,
        "NA"
      ],
      [
        1962,
        "NA"
      ],
      [
        1963,
        "NA"
      ],
      [
        1964,
        "NA"
      ],
      [
        1965,
        0.0
      ],
      [
        1966,
        "NA"
      ],
      [
        1967,
        "NA"
      ],
      [
        1968,
        "NA"
      ],
      [
        1969,
        "NA"
      ],
      [
        1970,
        0.0
      ],
      [
        1971,
        "NA"
      ],
      [
        1972,
        "NA"
      ],
      [
        1973,
        "NA"
      ],
      [
        1974,
        "NA"
      ],
      [
        1975,
        0.0
      ],
      [
        1976,
        0.0
      ],
      [
        1977,
        0.0
      ],
      [
        1978,
        0.0
      ],
      [
        1979,
        0.0
      ],
      [
        1980,
        0.0
      ],
      [
        1981,
        0.0
      ],
      [
        1982,
        0.0
      ],
      [
        1983,
        0.0
      ],
      [
        1984,
        0.0
      ],
      [
        1985,
        0.0
      ],
      [
        1986,
        0.0
      ],
      [
        1987,
        0.0
      ],
      [
        1988,
        0.0
      ],
      [
        1989,
        0.0
      ],
      [
        1990,
        0.0
      ],
      [
        1991,
        0.0
      ],
      [
        1992,
        0.00028
      ],
      [
        1993,
        0.0012
      ],
      [
        1994,
        0.002581
      ],
      [
        1995,
        0.004
      ],
      [
        1996,
        0.0068
      ],
      [
        1997,
        0.0095
      ],
      [
        1998,
        0.009694
      ],
      [
        1999,
        0.008891
      ],
      [
        2000,
        0.12
      ],
      [
        2001,
        0.15
      ],
      [
        2002,
        0.279289
      ],
      [
        2003,
        0.3
      ],
      [
        2004,
        0.489367
      ],
      [
        2005,
        0.73669
      ],
      [
        2006,
        0.8979870000000001
      ],
      [
        2007,
        1.169
      ],
      [
        2008,
        1.3
      ],
      [
        2009,
        1.45
      ],
      [
        2010,
        1.61
      ],
      [
        2011,
        2.370227
      ],
      [
        2012,
        2.557728
      ],
      [
        2013,
        2.745229
      ],
      [
        2014,
        2.932731
      ],
      [
        2015,
        2.821555
      ],
      [
        2016,
        2.962486
      ],
      [
        2017,
        2.663243
      ],
      [
        2018,
        2.930554
      ],
      [
        2019,
        "NA"
      ]
    ],
    "acces_elec": [
      [
        1960,
        "NA"
      ],
      [
        1961,
        "NA"
      ],
      [
        1962,
        "NA"
      ],
      [
        1963,
        "NA"
      ],
      [
        1964,
        "NA"
      ],
      [
        1965,
        "NA"
      ],
      [
        1966,
        "NA"
      ],
      [
        1967,
        "NA"
      ],
      [
        1968,
        "NA"
      ],
      [
        1969,
        "NA"
      ],
      [
        1970,
        "NA"
      ],
      [
        1971,
        "NA"
      ],
      [
        1972,
        "NA"
      ],
      [
        1973,
        "NA"
      ],
      [
        1974,
        "NA"
      ],
      [
        1975,
        "NA"
      ],
      [
        1976,
        "NA"
      ],
      [
        1977,
        "NA"
      ],
      [
        1978,
        "NA"
      ],
      [
        1979,
        "NA"
      ],
      [
        1980,
        "NA"
      ],
      [
        1981,
        "NA"
      ],
      [
        1982,
        "NA"
      ],
      [
        1983,
        "NA"
      ],
      [
        1984,
        "NA"
      ],
      [
        1985,
        "NA"
      ],
      [
        1986,
        "NA"
      ],
      [
        1987,
        "NA"
      ],
      [
        1988,
        "NA"
      ],
      [
        1989,
        "NA"
      ],
      [
        1990,
        "NA"
      ],
      [
        1991,
        "NA"
      ],
      [
        1992,
        "NA"
      ],
      [
        1993,
        "NA"
      ],
      [
        1994,
        "NA"
      ],
      [
        1995,
        "NA"
      ],
      [
        1996,
        "NA"
      ],
      [
        1997,
        "NA"
      ],
      [
        1998,
        "NA"
      ],
      [
        1999,
        "NA"
      ],
      [
        2000,
        73.6
      ],
      [
        2001,
        76.5015716553
      ],
      [
        2002,
        77.4398956299
      ],
      [
        2003,
        78.3594665527
      ],
      [
        2004,
        79.2558135986
      ],
      [
        2005,
        81.6
      ],
      [
        2006,
        80.9823684692
      ],
      [
        2007,
        81.8330612183
      ],
      [
        2008,
        82.6908187866
      ],
      [
        2009,
        83.5672149658
      ],
      [
        2010,
        92.23134613040001
      ],
      [
        2011,
        90.49788665770001
      ],
      [
        2012,
        89.3
      ],
      [
        2013,
        86.4
      ],
      [
        2014,
        88.5421447754
      ],
      [
        2015,
        89.64735412600001
      ],
      [
        2016,
        90.7703704834
      ],
      [
        2017,
        91.9022827148
      ],
      [
        2018,
        93.03568267819999
      ],
      [
        2019,
        "NA"
      ]
    ],
    "alpha_adulte": [
      [
        1960,
        "NA"
      ],
      [
        1961,
        "NA"
      ],
      [
        1962,
        "NA"
      ],
      [
        1963,
        "NA"
      ],
      [
        1964,
        "NA"
      ],
      [
        1965,
        "NA"
      ],
      [
        1966,
        "NA"
      ],
      [
        1967,
        "NA"
      ],
      [
        1968,
        "NA"
      ],
      [
        1969,
        "NA"
      ],
      [
        1970,
        "NA"
      ],
      [
        1971,
        "NA"
      ],
      [
        1972,
        "NA"
      ],
      [
        1973,
        "NA"
      ],
      [
        1974,
        "NA"
      ],
      [
        1975,
        "NA"
      ],
      [
        1976,
        "NA"
      ],
      [
        1977,
        "NA"
      ],
      [
        1978,
        "NA"
      ],
      [
        1979,
        "NA"
      ],
      [
        1980,
        "NA"
      ],
      [
        1981,
        "NA"
      ],
      [
        1982,
        "NA"
      ],
      [
        1983,
        "NA"
      ],
      [
        1984,
        "NA"
      ],
      [
        1985,
        "NA"
      ],
      [
        1986,
        "NA"
      ],
      [
        1987,
        "NA"
      ],
      [
        1988,
        "NA"
      ],
      [
        1989,
        "NA"
      ],
      [
        1990,
        "NA"
      ],
      [
        1991,
        "NA"
      ],
      [
        1992,
        "NA"
      ],
      [
        1993,
        72.23366999999999
      ],
      [
        1994,
        "NA"
      ],
      [
        1995,
        "NA"
      ],
      [
        1996,
        "NA"
      ],
      [
        1997,
        "NA"
      ],
      [
        1998,
        "NA"
      ],
      [
        1999,
        "NA"
      ],
      [
        2000,
        "NA"
      ],
      [
        2001,
        "NA"
      ],
      [
        2002,
        "NA"
      ],
      [
        2003,
        "NA"
      ],
      [
        2004,
        "NA"
      ],
      [
        2005,
        "NA"
      ],
      [
        2006,
        "NA"
      ],
      [
        2007,
        "NA"
      ],
      [
        2008,
        "NA"
      ],
      [
        2009,
        "NA"
      ],
      [
        2010,
        "NA"
      ],
      [
        2011,
        "NA"
      ],
      [
        2012,
        82.2838
      ],
      [
        2013,
        "NA"
      ],
      [
        2014,
        "NA"
      ],
      [
        2015,
        "NA"
      ],
      [
        2016,
        "NA"
      ],
      [
        2017,
        "NA"
      ],
      [
        2018,
        84.66716
      ],
      [
        2019,
        "NA"
      ]
    ],
    "alpha_jeune": [
      [
        1960,
        "NA"
      ],
      [
        1961,
        "NA"
      ],
      [
        1962,
        "NA"
      ],
      [
        1963,
        "NA"
      ],
      [
        1964,
        "NA"
      ],
      [
        1965,
        "NA"
      ],
      [
        1966,
        "NA"
      ],
      [
        1967,
        "NA"
      ],
      [
        1968,
        "NA"
      ],
      [
        1969,
        "NA"
      ],
      [
        1970,
        "NA"
      ],
      [
        1971,
        "NA"
      ],
      [
        1972,
        "NA"
      ],
      [
        1973,
        "NA"
      ],
      [
        1974,
        "NA"
      ],
      [
        1975,
        "NA"
      ],
      [
        1976,
        "NA"
      ],
      [
        1977,
        "NA"
      ],
      [
        1978,
        "NA"
      ],
      [
        1979,
        "NA"
      ],
      [
        1980,
        "NA"
      ],
      [
        1981,
        "NA"
      ],
      [
        1982,
        "NA"
      ],
      [
        1983,
        "NA"
      ],
      [
        1984,
        "NA"
      ],
      [
        1985,
        "NA"
      ],
      [
        1986,
        "NA"
      ],
      [
        1987,
        "NA"
      ],
      [
        1988,
        "NA"
      ],
      [
        1989,
        "NA"
      ],
      [
        1990,
        "NA"
      ],
      [
        1991,
        "NA"
      ],
      [
        1992,
        "NA"
      ],
      [
        1993,
        93.20872
      ],
      [
        1994,
        "NA"
      ],
      [
        1995,
        "NA"
      ],
      [
        1996,
        "NA"
      ],
      [
        1997,
        "NA"
      ],
      [
        1998,
        "NA"
      ],
      [
        1999,
        "NA"
      ],
      [
        2000,
        "NA"
      ],
      [
        2001,
        "NA"
      ],
      [
        2002,
        "NA"
      ],
      [
        2003,
        "NA"
      ],
      [
        2004,
        "NA"
      ],
      [
        2005,
        "NA"
      ],
      [
        2006,
        "NA"
      ],
      [
        2007,
        "NA"
      ],
      [
        2008,
        "NA"
      ],
      [
        2009,
        "NA"
      ],
      [
        2010,
        "NA"
      ],
      [
        2011,
        "NA"
      ],
      [
        2012,
        88.50414
      ],
      [
        2013,
        "NA"
      ],
      [
        2014,
        "NA"
      ],
      [
        2015,
        "NA"
      ],
      [
        2016,
        "NA"
      ],
      [
        2017,
        "NA"
      ],
      [
        2018,
        89.78366
      ],
      [
        2019,
        "NA"
      ]
    ],
    "bidonvilles": [
      [
        1960,
        "NA"
      ],
      [
        1961,
        "NA"
      ],
      [
        1962,
        "NA"
      ],
      [
        1963,
        "NA"
      ],
      [
        1964,
        "NA"
      ],
      [
        1965,
        "NA"
      ],
      [
        1966,
        "NA"
      ],
      [
        1967,
        "NA"
      ],
      [
        1968,
        "NA"
      ],
      [
        1969,
        "NA"
      ],
      [
        1970,
        "NA"
      ],
      [
        1971,
        "NA"
      ],
      [
        1972,
        "NA"
      ],
      [
        1973,
        "NA"
      ],
      [
        1974,
        "NA"
      ],
      [
        1975,
        "NA"
      ],
      [
        1976,
        "NA"
      ],
      [
        1977,
        "NA"
      ],
      [
        1978,
        "NA"
      ],
      [
        1979,
        "NA"
      ],
      [
        1980,
        "NA"
      ],
      [
        1981,
        "NA"
      ],
      [
        1982,
        "NA"
      ],
      [
        1983,
        "NA"
      ],
      [
        1984,
        "NA"
      ],
      [
        1985,
        "NA"
      ],
      [
        1986,
        "NA"
      ],
      [
        1987,
        "NA"
      ],
      [
        1988,
        "NA"
      ],
      [
        1989,
        "NA"
      ],
      [
        1990,
        "NA"
      ],
      [
        1991,
        "NA"
      ],
      [
        1992,
        "NA"
      ],
      [
        1993,
        "NA"
      ],
      [
        1994,
        "NA"
      ],
      [
        1995,
        "NA"
      ],
      [
        1996,
        "NA"
      ],
      [
        1997,
        "NA"
      ],
      [
        1998,
        "NA"
      ],
      [
        1999,
        "NA"
      ],
      [
        2000,
        "NA"
      ],
      [
        2001,
        "NA"
      ],
      [
        2002,
        "NA"
      ],
      [
        2003,
        "NA"
      ],
      [
        2004,
        "NA"
      ],
      [
        2005,
        38.7
      ],
      [
        2006,
        "NA"
      ],
      [
        2007,
        "NA"
      ],
      [
        2008,
        "NA"
      ],
      [
        2009,
        "NA"
      ],
      [
        2010,
        "NA"
      ],
      [
        2011,
        "NA"
      ],
      [
        2012,
        "NA"
      ],
      [
        2013,
        "NA"
      ],
      [
        2014,
        37.0
      ],
      [
        2015,
        "NA"
      ],
      [
        2016,
        "NA"
      ],
      [
        2017,
        "NA"
      ],
      [
        2018,
        "NA"
      ],
      [
        2019,
        "NA"
      ]
    ],
    "compte_adulte": [
      [
        1960,
        "NA"
      ],
      [
        1961,
        "NA"
      ],
      [
        1962,
        "NA"
      ],
      [
        1963,
        "NA"
      ],
      [
        1964,
        "NA"
      ],
      [
        1965,
        "NA"
      ],
      [
        1966,
        "NA"
      ],
      [
        1967,
        "NA"
      ],
      [
        1968,
        "NA"
      ],
      [
        1969,
        "NA"
      ],
      [
        1970,
        "NA"
      ],
      [
        1971,
        "NA"
      ],
      [
        1972,
        "NA"
      ],
      [
        1973,
        "NA"
      ],
      [
        1974,
        "NA"
      ],
      [
        1975,
        "NA"
      ],
      [
        1976,
        "NA"
      ],
      [
        1977,
        "NA"
      ],
      [
        1978,
        "NA"
      ],
      [
        1979,
        "NA"
      ],
      [
        1980,
        "NA"
      ],
      [
        1981,
        "NA"
      ],
      [
        1982,
        "NA"
      ],
      [
        1983,
        "NA"
      ],
      [
        1984,
        "NA"
      ],
      [
        1985,
        "NA"
      ],
      [
        1986,
        "NA"
      ],
      [
        1987,
        "NA"
      ],
      [
        1988,
        "NA"
      ],
      [
        1989,
        "NA"
      ],
      [
        1990,
        "NA"
      ],
      [
        1991,
        "NA"
      ],
      [
        1992,
        "NA"
      ],
      [
        1993,
        "NA"
      ],
      [
        1994,
        "NA"
      ],
      [
        1995,
        "NA"
      ],
      [
        1996,
        "NA"
      ],
      [
        1997,
        "NA"
      ],
      [
        1998,
        "NA"
      ],
      [
        1999,
        "NA"
      ],
      [
        2000,
        "NA"
      ],
      [
        2001,
        "NA"
      ],
      [
        2002,
        "NA"
      ],
      [
        2003,
        "NA"
      ],
      [
        2004,
        "NA"
      ],
      [
        2005,
        "NA"
      ],
      [
        2006,
        "NA"
      ],
      [
        2007,
        "NA"
      ],
      [
        2008,
        "NA"
      ],
      [
        2009,
        "NA"
      ],
      [
        2010,
        "NA"
      ],
      [
        2011,
        22.872549056999997
      ],
      [
        2012,
        "NA"
      ],
      [
        2013,
        "NA"
      ],
      [
        2014,
        37.4291000366
      ],
      [
        2015,
        "NA"
      ],
      [
        2016,
        "NA"
      ],
      [
        2017,
        59.1204338074
      ],
      [
        2018,
        "NA"
      ],
      [
        2019,
        "NA"
      ]
    ],
    "compte_jeune": [
      [
        1960,
        "NA"
      ],
      [
        1961,
        "NA"
      ],
      [
        1962,
        "NA"
      ],
      [
        1963,
        "NA"
      ],
      [
        1964,
        "NA"
      ],
      [
        1965,
        "NA"
      ],
      [
        1966,
        "NA"
      ],
      [
        1967,
        "NA"
      ],
      [
        1968,
        "NA"
      ],
      [
        1969,
        "NA"
      ],
      [
        1970,
        "NA"
      ],
      [
        1971,
        "NA"
      ],
      [
        1972,
        "NA"
      ],
      [
        1973,
        "NA"
      ],
      [
        1974,
        "NA"
      ],
      [
        1975,
        "NA"
      ],
      [
        1976,
        "NA"
      ],
      [
        1977,
        "NA"
      ],
      [
        1978,
        "NA"
      ],
      [
        1979,
        "NA"
      ],
      [
        1980,
        "NA"
      ],
      [
        1981,
        "NA"
      ],
      [
        1982,
        "NA"
      ],
      [
        1983,
        "NA"
      ],
      [
        1984,
        "NA"
      ],
      [
        1985,
        "NA"
      ],
      [
        1986,
        "NA"
      ],
      [
        1987,
        "NA"
      ],
      [
        1988,
        "NA"
      ],
      [
        1989,
        "NA"
      ],
      [
        1990,
        "NA"
      ],
      [
        1991,
        "NA"
      ],
      [
        1992,
        "NA"
      ],
      [
        1993,
        "NA"
      ],
      [
        1994,
        "NA"
      ],
      [
        1995,
        "NA"
      ],
      [
        1996,
        "NA"
      ],
      [
        1997,
        "NA"
      ],
      [
        1998,
        "NA"
      ],
      [
        1999,
        "NA"
      ],
      [
        2000,
        "NA"
      ],
      [
        2001,
        "NA"
      ],
      [
        2002,
        "NA"
      ],
      [
        2003,
        "NA"
      ],
      [
        2004,
        "NA"
      ],
      [
        2005,
        "NA"
      ],
      [
        2006,
        "NA"
      ],
      [
        2007,
        "NA"
      ],
      [
        2008,
        "NA"
      ],
      [
        2009,
        "NA"
      ],
      [
        2010,
        "NA"
      ],
      [
        2011,
        10.8676490784
      ],
      [
        2012,
        "NA"
      ],
      [
        2013,
        "NA"
      ],
      [
        2014,
        23.0909824371
      ],
      [
        2015,
        "NA"
      ],
      [
        2016,
        "NA"
      ],
      [
        2017,
        57.227355957
      ],
      [
        2018,
        "NA"
      ],
      [
        2019,
        "NA"
      ]
    ],
    "croissance_pib": [
      [
        1960,
        "NA"
      ],
      [
        1961,
        14.766843186800001
      ],
      [
        1962,
        7.449211596900001
      ],
      [
        1963,
        6.092435284
      ],
      [
        1964,
        4.5544536344
      ],
      [
        1965,
        8.3333356604
      ],
      [
        1966,
        4.5080045667
      ],
      [
        1967,
        4.1151528543
      ],
      [
        1968,
        2.5088008806
      ],
      [
        1969,
        8.0829104338
      ],
      [
        1970,
        8.679342175599999
      ],
      [
        1971,
        10.258730911699999
      ],
      [
        1972,
        11.336970683099999
      ],
      [
        1973,
        10.1824336186
      ],
      [
        1974,
        39.487095178800004
      ],
      [
        1975,
        19.19011491
      ],
      [
        1976,
        35.6253379698
      ],
      [
        1977,
        -12.5820911682
      ],
      [
        1978,
        -24.04920607
      ],
      [
        1979,
        0.4744052797
      ],
      [
        1980,
        2.5529371577
      ],
      [
        1981,
        5.0953292789999995
      ],
      [
        1982,
        -3.0975203978
      ],
      [
        1983,
        5.6082406793
      ],
      [
        1984,
        7.508902308400001
      ],
      [
        1985,
        -2.3329493327
      ],
      [
        1986,
        -0.8035977339
      ],
      [
        1987,
        -17.1460422149
      ],
      [
        1988,
        12.845353248099999
      ],
      [
        1989,
        8.5453099898
      ],
      [
        1990,
        5.192237276499999
      ],
      [
        1991,
        6.112503482999999
      ],
      [
        1992,
        -3.0901456515
      ],
      [
        1993,
        3.9465550079000002
      ],
      [
        1994,
        3.7127548411
      ],
      [
        1995,
        4.973847763399999
      ],
      [
        1996,
        3.6250490202999996
      ],
      [
        1997,
        5.7383673948
      ],
      [
        1998,
        3.4778335872
      ],
      [
        1999,
        -8.932622802300001
      ],
      [
        2000,
        -1.8829663976
      ],
      [
        2001,
        2.1352334219999998
      ],
      [
        2002,
        -0.2490331685
      ],
      [
        2003,
        2.2473300115
      ],
      [
        2004,
        0.6895430585
      ],
      [
        2005,
        2.6762033331
      ],
      [
        2006,
        -2.8065783557
      ],
      [
        2007,
        6.0081080249
      ],
      [
        2008,
        -3.3084306488
      ],
      [
        2009,
        0.1303311198
      ],
      [
        2010,
        7.0898873146
      ],
      [
        2011,
        7.0917533426
      ],
      [
        2012,
        5.2510769175
      ],
      [
        2013,
        5.6386990034
      ],
      [
        2014,
        4.3149644411
      ],
      [
        2015,
        3.8788993951
      ],
      [
        2016,
        2.0914422083
      ],
      [
        2017,
        0.47976227060000004
      ],
      [
        2018,
        0.8358049693999999
      ],
      [
        2019,
        "NA"
      ]
    ],
    "eau_douce_agri": [
      [
        1960,
        "NA"
      ],
      [
        1961,
        "NA"
      ],
      [
        1962,
        "NA"
      ],
      [
        1963,
        "NA"
      ],
      [
        1964,
        "NA"
      ],
      [
        1965,
        "NA"
      ],
      [
        1966,
        "NA"
      ],
      [
        1967,
        "NA"
      ],
      [
        1968,
        "NA"
      ],
      [
        1969,
        "NA"
      ],
      [
        1970,
        "NA"
      ],
      [
        1971,
        "NA"
      ],
      [
        1972,
        "NA"
      ],
      [
        1973,
        "NA"
      ],
      [
        1974,
        "NA"
      ],
      [
        1975,
        "NA"
      ],
      [
        1976,
        "NA"
      ],
      [
        1977,
        "NA"
      ],
      [
        1978,
        "NA"
      ],
      [
        1979,
        "NA"
      ],
      [
        1980,
        "NA"
      ],
      [
        1981,
        "NA"
      ],
      [
        1982,
        "NA"
      ],
      [
        1983,
        "NA"
      ],
      [
        1984,
        "NA"
      ],
      [
        1985,
        "NA"
      ],
      [
        1986,
        "NA"
      ],
      [
        1987,
        6.0
      ],
      [
        1988,
        "NA"
      ],
      [
        1989,
        "NA"
      ],
      [
        1990,
        "NA"
      ],
      [
        1991,
        "NA"
      ],
      [
        1992,
        "NA"
      ],
      [
        1993,
        "NA"
      ],
      [
        1994,
        "NA"
      ],
      [
        1995,
        "NA"
      ],
      [
        1996,
        "NA"
      ],
      [
        1997,
        "NA"
      ],
      [
        1998,
        "NA"
      ],
      [
        1999,
        "NA"
      ],
      [
        2000,
        33.5
      ],
      [
        2001,
        "NA"
      ],
      [
        2002,
        "NA"
      ],
      [
        2003,
        "NA"
      ],
      [
        2004,
        "NA"
      ],
      [
        2005,
        28.97
      ],
      [
        2006,
        "NA"
      ],
      [
        2007,
        "NA"
      ],
      [
        2008,
        "NA"
      ],
      [
        2009,
        "NA"
      ],
      [
        2010,
        "NA"
      ],
      [
        2011,
        "NA"
      ],
      [
        2012,
        "NA"
      ],
      [
        2013,
        "NA"
      ],
      [
        2014,
        "NA"
      ],
      [
        2015,
        "NA"
      ],
      [
        2016,
        "NA"
      ],
      [
        2017,
        "NA"
      ],
      [
        2018,
        "NA"
      ],
      [
        2019,
        "NA"
      ]
    ],
    "emploi_agri": [
      [
        1960,
        "NA"
      ],
      [
        1961,
        "NA"
      ],
      [
        1962,
        "NA"
      ],
      [
        1963,
        "NA"
      ],
      [
        1964,
        "NA"
      ],
      [
        1965,
        "NA"
      ],
      [
        1966,
        "NA"
      ],
      [
        1967,
        "NA"
      ],
      [
        1968,
        "NA"
      ],
      [
        1969,
        "NA"
      ],
      [
        1970,
        "NA"
      ],
      [
        1971,
        "NA"
      ],
      [
        1972,
        "NA"
      ],
      [
        1973,
        "NA"
      ],
      [
        1974,
        "NA"
      ],
      [
        1975,
        "NA"
      ],
      [
        1976,
        "NA"
      ],
      [
        1977,
        "NA"
      ],
      [
        1978,
        "NA"
      ],
      [
        1979,
        "NA"
      ],
      [
        1980,
        "NA"
      ],
      [
        1981,
        "NA"
      ],
      [
        1982,
        "NA"
      ],
      [
        1983,
        "NA"
      ],
      [
        1984,
        "NA"
      ],
      [
        1985,
        "NA"
      ],
      [
        1986,
        "NA"
      ],
      [
        1987,
        "NA"
      ],
      [
        1988,
        "NA"
      ],
      [
        1989,
        "NA"
      ],
      [
        1990,
        "NA"
      ],
      [
        1991,
        43.9570007324
      ],
      [
        1992,
        43.7869987488
      ],
      [
        1993,
        43.5159988403
      ],
      [
        1994,
        43.0149993896
      ],
      [
        1995,
        42.659999847399995
      ],
      [
        1996,
        42.2729988098
      ],
      [
        1997,
        41.8619995117
      ],
      [
        1998,
        41.5180015564
      ],
      [
        1999,
        41.3050003052
      ],
      [
        2000,
        40.9869995117
      ],
      [
        2001,
        40.5960006714
      ],
      [
        2002,
        40.2220001221
      ],
      [
        2003,
        39.8219985962
      ],
      [
        2004,
        39.452999115
      ],
      [
        2005,
        39.0320014954
      ],
      [
        2006,
        38.7560005188
      ],
      [
        2007,
        38.3199996948
      ],
      [
        2008,
        38.0250015259
      ],
      [
        2009,
        37.6930007935
      ],
      [
        2010,
        37.2210006714
      ],
      [
        2011,
        36.733001709
      ],
      [
        2012,
        36.326000213600004
      ],
      [
        2013,
        35.8899993896
      ],
      [
        2014,
        35.442001342800005
      ],
      [
        2015,
        34.90599823
      ],
      [
        2016,
        34.3979988098
      ],
      [
        2017,
        33.8810005188
      ],
      [
        2018,
        33.34400177
      ],
      [
        2019,
        32.831001281700004
      ]
    ],
    "enseignant_primaire": [
      [
        1960,
        "NA"
      ],
      [
        1961,
        "NA"
      ],
      [
        1962,
        "NA"
      ],
      [
        1963,
        "NA"
      ],
      [
        1964,
        "NA"
      ],
      [
        1965,
        "NA"
      ],
      [
        1966,
        "NA"
      ],
      [
        1967,
        "NA"
      ],
      [
        1968,
        "NA"
      ],
      [
        1969,
        "NA"
      ],
      [
        1970,
        "NA"
      ],
      [
        1971,
        "NA"
      ],
      [
        1972,
        "NA"
      ],
      [
        1973,
        "NA"
      ],
      [
        1974,
        "NA"
      ],
      [
        1975,
        "NA"
      ],
      [
        1976,
        "NA"
      ],
      [
        1977,
        "NA"
      ],
      [
        1978,
        "NA"
      ],
      [
        1979,
        "NA"
      ],
      [
        1980,
        "NA"
      ],
      [
        1981,
        "NA"
      ],
      [
        1982,
        "NA"
      ],
      [
        1983,
        "NA"
      ],
      [
        1984,
        "NA"
      ],
      [
        1985,
        "NA"
      ],
      [
        1986,
        "NA"
      ],
      [
        1987,
        "NA"
      ],
      [
        1988,
        "NA"
      ],
      [
        1989,
        "NA"
      ],
      [
        1990,
        "NA"
      ],
      [
        1991,
        "NA"
      ],
      [
        1992,
        "NA"
      ],
      [
        1993,
        "NA"
      ],
      [
        1994,
        "NA"
      ],
      [
        1995,
        "NA"
      ],
      [
        1996,
        "NA"
      ],
      [
        1997,
        "NA"
      ],
      [
        1998,
        "NA"
      ],
      [
        1999,
        "NA"
      ],
      [
        2000,
        "NA"
      ],
      [
        2001,
        95.25838
      ],
      [
        2002,
        "NA"
      ],
      [
        2003,
        100.0
      ],
      [
        2004,
        "NA"
      ],
      [
        2005,
        "NA"
      ],
      [
        2006,
        "NA"
      ],
      [
        2007,
        "NA"
      ],
      [
        2008,
        "NA"
      ],
      [
        2009,
        "NA"
      ],
      [
        2010,
        "NA"
      ],
      [
        2011,
        "NA"
      ],
      [
        2012,
        "NA"
      ],
      [
        2013,
        "NA"
      ],
      [
        2014,
        "NA"
      ],
      [
        2015,
        "NA"
      ],
      [
        2016,
        "NA"
      ],
      [
        2017,
        "NA"
      ],
      [
        2018,
        "NA"
      ],
      [
        2019,
        "NA"
      ]
    ],
    "enseignant_secondaire": [
      [
        1960,
        "NA"
      ],
      [
        1961,
        "NA"
      ],
      [
        1962,
        "NA"
      ],
      [
        1963,
        "NA"
      ],
      [
        1964,
        "NA"
      ],
      [
        1965,
        "NA"
      ],
      [
        1966,
        "NA"
      ],
      [
        1967,
        "NA"
      ],
      [
        1968,
        "NA"
      ],
      [
        1969,
        "NA"
      ],
      [
        1970,
        "NA"
      ],
      [
        1971,
        "NA"
      ],
      [
        1972,
        "NA"
      ],
      [
        1973,
        "NA"
      ],
      [
        1974,
        "NA"
      ],
      [
        1975,
        "NA"
      ],
      [
        1976,
        "NA"
      ],
      [
        1977,
        "NA"
      ],
      [
        1978,
        "NA"
      ],
      [
        1979,
        "NA"
      ],
      [
        1980,
        "NA"
      ],
      [
        1981,
        "NA"
      ],
      [
        1982,
        "NA"
      ],
      [
        1983,
        "NA"
      ],
      [
        1984,
        "NA"
      ],
      [
        1985,
        "NA"
      ],
      [
        1986,
        "NA"
      ],
      [
        1987,
        "NA"
      ],
      [
        1988,
        "NA"
      ],
      [
        1989,
        "NA"
      ],
      [
        1990,
        "NA"
      ],
      [
        1991,
        "NA"
      ],
      [
        1992,
        "NA"
      ],
      [
        1993,
        "NA"
      ],
      [
        1994,
        "NA"
      ],
      [
        1995,
        "NA"
      ],
      [
        1996,
        "NA"
      ],
      [
        1997,
        "NA"
      ],
      [
        1998,
        "NA"
      ],
      [
        1999,
        "NA"
      ],
      [
        2000,
        "NA"
      ],
      [
        2001,
        "NA"
      ],
      [
        2002,
        "NA"
      ],
      [
        2003,
        "NA"
      ],
      [
        2004,
        "NA"
      ],
      [
        2005,
        "NA"
      ],
      [
        2006,
        "NA"
      ],
      [
        2007,
        "NA"
      ],
      [
        2008,
        "NA"
      ],
      [
        2009,
        "NA"
      ],
      [
        2010,
        "NA"
      ],
      [
        2011,
        "NA"
      ],
      [
        2012,
        "NA"
      ],
      [
        2013,
        "NA"
      ],
      [
        2014,
        "NA"
      ],
      [
        2015,
        "NA"
      ],
      [
        2016,
        "NA"
      ],
      [
        2017,
        "NA"
      ],
      [
        2018,
        "NA"
      ],
      [
        2019,
        "NA"
      ]
    ],
    "frag_pol": [
      [
        2006,
        0.0
      ],
      [
        2007,
        0.0
      ],
      [
        2008,
        0.0
      ],
      [
        2009,
        0.0
      ],
      [
        2010,
        0.0
      ],
      [
        2011,
        0.0
      ],
      [
        2012,
        0.0
      ],
      [
        2013,
        0.0
      ],
      [
        2014,
        0.0
      ],
      [
        2015,
        0.0
      ],
      [
        2016,
        0.0
      ],
      [
        2017,
        0.0
      ]
    ],
    "idh": [
      [
        1990,
        0.62
      ],
      [
        1991,
        0.625
      ],
      [
        1992,
        0.624
      ],
      [
        1993,
        0.626
      ],
      [
        1994,
        0.63
      ],
      [
        1995,
        0.632
      ],
      [
        1996,
        0.634
      ],
      [
        1997,
        0.637
      ],
      [
        1998,
        0.64
      ],
      [
        1999,
        0.636
      ],
      [
        2000,
        0.633
      ],
      [
        2001,
        0.636
      ],
      [
        2002,
        0.639
      ],
      [
        2003,
        0.6409999999999999
      ],
      [
        2004,
        0.6409999999999999
      ],
      [
        2005,
        0.647
      ],
      [
        2006,
        0.647
      ],
      [
        2007,
        0.652
      ],
      [
        2008,
        0.653
      ],
      [
        2009,
        0.6609999999999999
      ],
      [
        2010,
        0.665
      ],
      [
        2011,
        0.67
      ],
      [
        2012,
        0.6779999999999999
      ],
      [
        2013,
        0.687
      ],
      [
        2014,
        0.693
      ],
      [
        2015,
        0.6940000000000001
      ],
      [
        2016,
        0.698
      ],
      [
        2017,
        0.7020000000000001
      ]
    ],
    "lib_monde": [
      [
        2013,
        1.0
      ],
      [
        2014,
        1.0
      ],
      [
        2015,
        1.0
      ],
      [
        2016,
        1.0
      ],
      [
        2017,
        1.0
      ],
      [
        2018,
        1.0
      ]
    ],
    "migration": [
      [
        1955,
        1.253
      ],
      [
        1960,
        1.218
      ],
      [
        1965,
        3.639
      ],
      [
        1970,
        5.768
      ],
      [
        1975,
        0.97
      ],
      [
        1980,
        1.455
      ],
      [
        1985,
        1.287
      ],
      [
        1990,
        1.126
      ],
      [
        1995,
        0.983
      ],
      [
        2000,
        1.6540000000000001
      ],
      [
        2005,
        3.7910000000000004
      ],
      [
        2010,
        8.452
      ],
      [
        2015,
        11.234000000000002
      ],
      [
        2020,
        1.5619999999999998
      ],
      [
        2025,
        0.424
      ],
      [
        2030,
        0.382
      ],
      [
        2035,
        0.348
      ],
      [
        2040,
        0.319
      ],
      [
        2045,
        0.294
      ],
      [
        2050,
        0.272
      ],
      [
        2055,
        0.254
      ],
      [
        2060,
        0.23800000000000002
      ],
      [
        2065,
        0.225
      ],
      [
        2070,
        0.214
      ],
      [
        2075,
        0.205
      ],
      [
        2080,
        0.196
      ],
      [
        2085,
        0.18899999999999997
      ],
      [
        2090,
        0.182
      ],
      [
        2095,
        0.177
      ],
      [
        2100,
        0.17300000000000001
      ]
    ],
    "mortal_infant": [
      [
        1960,
        "NA"
      ],
      [
        1961,
        "NA"
      ],
      [
        1962,
        "NA"
      ],
      [
        1963,
        "NA"
      ],
      [
        1964,
        "NA"
      ],
      [
        1965,
        "NA"
      ],
      [
        1966,
        "NA"
      ],
      [
        1967,
        "NA"
      ],
      [
        1968,
        "NA"
      ],
      [
        1969,
        "NA"
      ],
      [
        1970,
        "NA"
      ],
      [
        1971,
        "NA"
      ],
      [
        1972,
        "NA"
      ],
      [
        1973,
        "NA"
      ],
      [
        1974,
        "NA"
      ],
      [
        1975,
        "NA"
      ],
      [
        1976,
        "NA"
      ],
      [
        1977,
        "NA"
      ],
      [
        1978,
        125.8
      ],
      [
        1979,
        121.6
      ],
      [
        1980,
        117.3
      ],
      [
        1981,
        113.1
      ],
      [
        1982,
        109.4
      ],
      [
        1983,
        105.8
      ],
      [
        1984,
        102.8
      ],
      [
        1985,
        100.3
      ],
      [
        1986,
        98.1
      ],
      [
        1987,
        96.2
      ],
      [
        1988,
        94.8
      ],
      [
        1989,
        93.6
      ],
      [
        1990,
        92.6
      ],
      [
        1991,
        91.9
      ],
      [
        1992,
        91.2
      ],
      [
        1993,
        90.6
      ],
      [
        1994,
        89.9
      ],
      [
        1995,
        89.3
      ],
      [
        1996,
        88.7
      ],
      [
        1997,
        88.0
      ],
      [
        1998,
        87.1
      ],
      [
        1999,
        86.0
      ],
      [
        2000,
        84.7
      ],
      [
        2001,
        83.1
      ],
      [
        2002,
        81.3
      ],
      [
        2003,
        79.4
      ],
      [
        2004,
        77.3
      ],
      [
        2005,
        75.0
      ],
      [
        2006,
        73.0
      ],
      [
        2007,
        70.5
      ],
      [
        2008,
        67.9
      ],
      [
        2009,
        65.4
      ],
      [
        2010,
        62.8
      ],
      [
        2011,
        60.4
      ],
      [
        2012,
        58.1
      ],
      [
        2013,
        55.7
      ],
      [
        2014,
        53.5
      ],
      [
        2015,
        51.0
      ],
      [
        2016,
        48.1
      ],
      [
        2017,
        46.0
      ],
      [
        2018,
        44.8
      ],
      [
        2019,
        "NA"
      ]
    ],
    "pib": [
      [
        1980,
        4.559
      ],
      [
        1981,
        4.111000000000001
      ],
      [
        1982,
        3.853
      ],
      [
        1983,
        3.6889999999999996
      ],
      [
        1984,
        3.5469999999999997
      ],
      [
        1985,
        3.736
      ],
      [
        1986,
        4.888999999999999
      ],
      [
        1987,
        3.699
      ],
      [
        1988,
        4.079
      ],
      [
        1989,
        4.458
      ],
      [
        1990,
        6.3389999999999995
      ],
      [
        1991,
        5.754
      ],
      [
        1992,
        5.955
      ],
      [
        1993,
        5.757000000000001
      ],
      [
        1994,
        4.463
      ],
      [
        1995,
        5.281000000000001
      ],
      [
        1996,
        6.064
      ],
      [
        1997,
        5.672999999999999
      ],
      [
        1998,
        4.774
      ],
      [
        1999,
        4.966
      ],
      [
        2000,
        5.397
      ],
      [
        2001,
        5.023
      ],
      [
        2002,
        5.332000000000001
      ],
      [
        2003,
        6.51
      ],
      [
        2004,
        7.767
      ],
      [
        2005,
        9.468
      ],
      [
        2006,
        10.164
      ],
      [
        2007,
        12.457
      ],
      [
        2008,
        15.57
      ],
      [
        2009,
        12.187999999999999
      ],
      [
        2010,
        14.384
      ],
      [
        2011,
        18.207
      ],
      [
        2012,
        17.180999999999997
      ],
      [
        2013,
        17.596
      ],
      [
        2014,
        18.209
      ],
      [
        2015,
        14.385
      ],
      [
        2016,
        14.02
      ],
      [
        2017,
        14.924000000000001
      ],
      [
        2018,
        16.875
      ],
      [
        2019,
        16.877
      ],
      [
        2020,
        17.623
      ],
      [
        2021,
        18.563
      ],
      [
        2022,
        19.66
      ],
      [
        2023,
        20.893
      ],
      [
        2024,
        22.438000000000002
      ]
    ],
    "pib_hab": [
      [
        1980,
        6093.615
      ],
      [
        1981,
        5376.616
      ],
      [
        1982,
        4930.527
      ],
      [
        1983,
        4619.015
      ],
      [
        1984,
        4346.388
      ],
      [
        1985,
        4478.468
      ],
      [
        1986,
        5735.355
      ],
      [
        1987,
        4245.955
      ],
      [
        1988,
        4581.144
      ],
      [
        1989,
        4899.234
      ],
      [
        1990,
        6815.634
      ],
      [
        1991,
        5993.32
      ],
      [
        1992,
        6015.5109999999995
      ],
      [
        1993,
        5677.618
      ],
      [
        1994,
        4293.942
      ],
      [
        1995,
        4956.842000000001
      ],
      [
        1996,
        5552.9169999999995
      ],
      [
        1997,
        5068.093
      ],
      [
        1998,
        4161.617
      ],
      [
        1999,
        4222.734
      ],
      [
        2000,
        4477.321
      ],
      [
        2001,
        4065.933
      ],
      [
        2002,
        4210.284000000001
      ],
      [
        2003,
        5015.596
      ],
      [
        2004,
        5837.616999999999
      ],
      [
        2005,
        6942.698
      ],
      [
        2006,
        7271.093000000001
      ],
      [
        2007,
        8652.145
      ],
      [
        2008,
        10418.276
      ],
      [
        2009,
        7856.853
      ],
      [
        2010,
        8933.306
      ],
      [
        2011,
        10893.464
      ],
      [
        2012,
        9903.41
      ],
      [
        2013,
        9760.747
      ],
      [
        2014,
        9746.786
      ],
      [
        2015,
        7453.1140000000005
      ],
      [
        2016,
        7082.218000000001
      ],
      [
        2017,
        7370.1990000000005
      ],
      [
        2018,
        8220.396999999999
      ],
      [
        2019,
        8112.32
      ],
      [
        2020,
        8361.041
      ],
      [
        2021,
        8695.659
      ],
      [
        2022,
        9096.933
      ],
      [
        2023,
        9551.608
      ],
      [
        2024,
        10138.146999999999
      ]
    ],
    "pib_ppa": [
      [
        1980,
        6.796
      ],
      [
        1981,
        7.141
      ],
      [
        1982,
        7.893
      ],
      [
        1983,
        8.366
      ],
      [
        1984,
        9.093
      ],
      [
        1985,
        9.925
      ],
      [
        1986,
        9.912
      ],
      [
        1987,
        8.593
      ],
      [
        1988,
        9.207
      ],
      [
        1989,
        11.045
      ],
      [
        1990,
        12.048
      ],
      [
        1991,
        13.218
      ],
      [
        1992,
        13.102
      ],
      [
        1993,
        13.942
      ],
      [
        1994,
        14.767999999999999
      ],
      [
        1995,
        15.828
      ],
      [
        1996,
        16.702
      ],
      [
        1997,
        17.965
      ],
      [
        1998,
        18.799
      ],
      [
        1999,
        17.365
      ],
      [
        2000,
        17.418
      ],
      [
        2001,
        18.183
      ],
      [
        2002,
        18.505
      ],
      [
        2003,
        19.17
      ],
      [
        2004,
        19.906
      ],
      [
        2005,
        20.365
      ],
      [
        2006,
        20.581
      ],
      [
        2007,
        22.471999999999998
      ],
      [
        2008,
        23.305999999999997
      ],
      [
        2009,
        22.948
      ],
      [
        2010,
        24.671
      ],
      [
        2011,
        26.973000000000003
      ],
      [
        2012,
        28.934
      ],
      [
        2013,
        31.066
      ],
      [
        2014,
        33.044000000000004
      ],
      [
        2015,
        34.683
      ],
      [
        2016,
        35.775
      ],
      [
        2017,
        36.631
      ],
      [
        2018,
        37.84
      ],
      [
        2019,
        39.81
      ],
      [
        2020,
        39.584
      ],
      [
        2021,
        41.795
      ]
    ],
    "pop_pauvrete": [
      [
        1960,
        "NA"
      ],
      [
        1961,
        "NA"
      ],
      [
        1962,
        "NA"
      ],
      [
        1963,
        "NA"
      ],
      [
        1964,
        "NA"
      ],
      [
        1965,
        "NA"
      ],
      [
        1966,
        "NA"
      ],
      [
        1967,
        "NA"
      ],
      [
        1968,
        "NA"
      ],
      [
        1969,
        "NA"
      ],
      [
        1970,
        "NA"
      ],
      [
        1971,
        "NA"
      ],
      [
        1972,
        "NA"
      ],
      [
        1973,
        "NA"
      ],
      [
        1974,
        "NA"
      ],
      [
        1975,
        "NA"
      ],
      [
        1976,
        "NA"
      ],
      [
        1977,
        "NA"
      ],
      [
        1978,
        "NA"
      ],
      [
        1979,
        "NA"
      ],
      [
        1980,
        "NA"
      ],
      [
        1981,
        "NA"
      ],
      [
        1982,
        "NA"
      ],
      [
        1983,
        "NA"
      ],
      [
        1984,
        "NA"
      ],
      [
        1985,
        "NA"
      ],
      [
        1986,
        "NA"
      ],
      [
        1987,
        "NA"
      ],
      [
        1988,
        "NA"
      ],
      [
        1989,
        "NA"
      ],
      [
        1990,
        "NA"
      ],
      [
        1991,
        "NA"
      ],
      [
        1992,
        "NA"
      ],
      [
        1993,
        "NA"
      ],
      [
        1994,
        "NA"
      ],
      [
        1995,
        "NA"
      ],
      [
        1996,
        "NA"
      ],
      [
        1997,
        "NA"
      ],
      [
        1998,
        "NA"
      ],
      [
        1999,
        "NA"
      ],
      [
        2000,
        "NA"
      ],
      [
        2001,
        "NA"
      ],
      [
        2002,
        "NA"
      ],
      [
        2003,
        "NA"
      ],
      [
        2004,
        "NA"
      ],
      [
        2005,
        8.0
      ],
      [
        2006,
        "NA"
      ],
      [
        2007,
        "NA"
      ],
      [
        2008,
        "NA"
      ],
      [
        2009,
        "NA"
      ],
      [
        2010,
        "NA"
      ],
      [
        2011,
        "NA"
      ],
      [
        2012,
        "NA"
      ],
      [
        2013,
        "NA"
      ],
      [
        2014,
        "NA"
      ],
      [
        2015,
        "NA"
      ],
      [
        2016,
        "NA"
      ],
      [
        2017,
        3.4
      ],
      [
        2018,
        "NA"
      ],
      [
        2019,
        "NA"
      ]
    ],
    "pop_rurale": [
      [
        1960,
        82.602
      ],
      [
        1961,
        81.67
      ],
      [
        1962,
        80.406
      ],
      [
        1963,
        79.077
      ],
      [
        1964,
        77.682
      ],
      [
        1965,
        76.225
      ],
      [
        1966,
        74.703
      ],
      [
        1967,
        73.117
      ],
      [
        1968,
        71.467
      ],
      [
        1969,
        69.763
      ],
      [
        1970,
        68.0
      ],
      [
        1971,
        65.918
      ],
      [
        1972,
        63.769
      ],
      [
        1973,
        61.57
      ],
      [
        1974,
        59.318999999999996
      ],
      [
        1975,
        57.028999999999996
      ],
      [
        1976,
        54.705
      ],
      [
        1977,
        52.367
      ],
      [
        1978,
        50.015
      ],
      [
        1979,
        47.663000000000004
      ],
      [
        1980,
        45.318000000000005
      ],
      [
        1981,
        43.0
      ],
      [
        1982,
        41.628
      ],
      [
        1983,
        40.27
      ],
      [
        1984,
        38.924
      ],
      [
        1985,
        37.598
      ],
      [
        1986,
        36.289
      ],
      [
        1987,
        35.0
      ],
      [
        1988,
        33.588
      ],
      [
        1989,
        32.208
      ],
      [
        1990,
        30.857
      ],
      [
        1991,
        29.538
      ],
      [
        1992,
        28.250999999999998
      ],
      [
        1993,
        27.000999999999998
      ],
      [
        1994,
        26.079
      ],
      [
        1995,
        25.203000000000003
      ],
      [
        1996,
        24.346
      ],
      [
        1997,
        23.51
      ],
      [
        1998,
        22.694000000000003
      ],
      [
        1999,
        21.898000000000003
      ],
      [
        2000,
        21.121
      ],
      [
        2001,
        20.367
      ],
      [
        2002,
        19.632
      ],
      [
        2003,
        18.917
      ],
      [
        2004,
        18.222
      ],
      [
        2005,
        17.548
      ],
      [
        2006,
        16.893
      ],
      [
        2007,
        16.258
      ],
      [
        2008,
        15.640999999999998
      ],
      [
        2009,
        15.045
      ],
      [
        2010,
        14.467
      ],
      [
        2011,
        13.908
      ],
      [
        2012,
        13.366
      ],
      [
        2013,
        12.844000000000001
      ],
      [
        2014,
        12.349
      ],
      [
        2015,
        11.882
      ],
      [
        2016,
        11.440999999999999
      ],
      [
        2017,
        11.024000000000001
      ],
      [
        2018,
        10.63
      ],
      [
        2019,
        "NA"
      ]
    ],
    "pop_tot": [
      [
        1950,
        0.47329799999999994
      ],
      [
        1951,
        0.476372
      ],
      [
        1952,
        0.478652
      ],
      [
        1953,
        0.48053
      ],
      [
        1954,
        0.482332
      ],
      [
        1955,
        0.484313
      ],
      [
        1956,
        0.48663900000000004
      ],
      [
        1957,
        0.489443
      ],
      [
        1958,
        0.49275699999999995
      ],
      [
        1959,
        0.49658599999999997
      ],
      [
        1960,
        0.5009279999999999
      ],
      [
        1961,
        0.505799
      ],
      [
        1962,
        0.5112869999999999
      ],
      [
        1963,
        0.51758
      ],
      [
        1964,
        0.524895
      ],
      [
        1965,
        0.533361
      ],
      [
        1966,
        0.5431119999999999
      ],
      [
        1967,
        0.554059
      ],
      [
        1968,
        0.565766
      ],
      [
        1969,
        0.577646
      ],
      [
        1970,
        0.589314
      ],
      [
        1971,
        0.6006130000000001
      ],
      [
        1972,
        0.6117039999999999
      ],
      [
        1973,
        0.6229199999999999
      ],
      [
        1974,
        0.6347419999999999
      ],
      [
        1975,
        0.6475359999999999
      ],
      [
        1976,
        0.661402
      ],
      [
        1977,
        0.676255
      ],
      [
        1978,
        0.692077
      ],
      [
        1979,
        0.708788
      ],
      [
        1980,
        0.726328
      ],
      [
        1981,
        0.744696
      ],
      [
        1982,
        0.76393
      ],
      [
        1983,
        0.784061
      ],
      [
        1984,
        0.8051149999999999
      ],
      [
        1985,
        0.827108
      ],
      [
        1986,
        0.8500479999999999
      ],
      [
        1987,
        0.8738670000000001
      ],
      [
        1988,
        0.8984690000000001
      ],
      [
        1989,
        0.923711
      ],
      [
        1990,
        0.949488
      ],
      [
        1991,
        0.975783
      ],
      [
        1992,
        1.002579
      ],
      [
        1993,
        1.029778
      ],
      [
        1994,
        1.0572549999999998
      ],
      [
        1995,
        1.084946
      ],
      [
        1996,
        1.112955
      ],
      [
        1997,
        1.141338
      ],
      [
        1998,
        1.170061
      ],
      [
        1999,
        1.199052
      ],
      [
        2000,
        1.2283600000000001
      ],
      [
        2001,
        1.258003
      ],
      [
        2002,
        1.2883149999999999
      ],
      [
        2003,
        1.3199530000000002
      ],
      [
        2004,
        1.353795
      ],
      [
        2005,
        1.390549
      ],
      [
        2006,
        1.430152
      ],
      [
        2007,
        1.472575
      ],
      [
        2008,
        1.51854
      ],
      [
        2009,
        1.568928
      ],
      [
        2010,
        1.62414
      ],
      [
        2011,
        1.684635
      ],
      [
        2012,
        1.749682
      ],
      [
        2013,
        1.817071
      ],
      [
        2014,
        1.8838
      ],
      [
        2015,
        1.947686
      ],
      [
        2016,
        2.007873
      ],
      [
        2017,
        2.064823
      ],
      [
        2018,
        2.119275
      ],
      [
        2019,
        2.1725790000000003
      ],
      [
        2020,
        2.225734
      ],
      [
        2021,
        2.278825
      ],
      [
        2022,
        2.3315330000000003
      ],
      [
        2023,
        2.383902
      ],
      [
        2024,
        2.4359439999999997
      ],
      [
        2025,
        2.487682
      ],
      [
        2026,
        2.539206
      ],
      [
        2027,
        2.590621
      ],
      [
        2028,
        2.641957
      ],
      [
        2029,
        2.693222
      ],
      [
        2030,
        2.7444509999999998
      ],
      [
        2031,
        2.795685
      ],
      [
        2032,
        2.846956
      ],
      [
        2033,
        2.898358
      ],
      [
        2034,
        2.949954
      ],
      [
        2035,
        3.001789
      ],
      [
        2036,
        3.0539050000000003
      ],
      [
        2037,
        3.106292
      ],
      [
        2038,
        3.158993
      ],
      [
        2039,
        3.2120300000000004
      ],
      [
        2040,
        3.265411
      ],
      [
        2041,
        3.319148
      ],
      [
        2042,
        3.3731839999999997
      ],
      [
        2043,
        3.4274809999999998
      ],
      [
        2044,
        3.481955
      ],
      [
        2045,
        3.536547
      ],
      [
        2046,
        3.591207
      ],
      [
        2047,
        3.645883
      ],
      [
        2048,
        3.700482
      ],
      [
        2049,
        3.7549
      ],
      [
        2050,
        3.80905
      ],
      [
        2051,
        3.862874
      ],
      [
        2052,
        3.916325
      ],
      [
        2053,
        3.969325
      ],
      [
        2054,
        4.021801
      ],
      [
        2055,
        4.07368
      ],
      [
        2056,
        4.1249340000000005
      ],
      [
        2057,
        4.175552
      ],
      [
        2058,
        4.225509
      ],
      [
        2059,
        4.274808999999999
      ],
      [
        2060,
        4.3234530000000015
      ],
      [
        2061,
        4.371437
      ],
      [
        2062,
        4.418776
      ],
      [
        2063,
        4.465521
      ],
      [
        2064,
        4.5117569999999985
      ],
      [
        2065,
        4.557526999999999
      ],
      [
        2066,
        4.602863
      ],
      [
        2067,
        4.647779000000001
      ],
      [
        2068,
        4.692312
      ],
      [
        2069,
        4.736528
      ],
      [
        2070,
        4.780465
      ],
      [
        2071,
        4.824127000000002
      ],
      [
        2072,
        4.867528
      ],
      [
        2073,
        4.91066
      ],
      [
        2074,
        4.9535230000000015
      ],
      [
        2075,
        4.996107
      ],
      [
        2076,
        5.038401
      ],
      [
        2077,
        5.08039
      ],
      [
        2078,
        5.122023
      ],
      [
        2079,
        5.16323
      ],
      [
        2080,
        5.203969
      ],
      [
        2081,
        5.244195
      ],
      [
        2082,
        5.2838769999999995
      ],
      [
        2083,
        5.322984
      ],
      [
        2084,
        5.361483
      ],
      [
        2085,
        5.399344
      ],
      [
        2086,
        5.436539
      ],
      [
        2087,
        5.4730159999999985
      ],
      [
        2088,
        5.508691000000001
      ],
      [
        2089,
        5.5434269999999986
      ],
      [
        2090,
        5.5771549999999985
      ],
      [
        2091,
        5.609814
      ],
      [
        2092,
        5.641418
      ],
      [
        2093,
        5.6719849999999985
      ],
      [
        2094,
        5.7015590000000005
      ],
      [
        2095,
        5.730174
      ],
      [
        2096,
        5.757852
      ],
      [
        2097,
        5.7846
      ],
      [
        2098,
        5.8104260000000005
      ],
      [
        2099,
        5.835301
      ],
      [
        2100,
        5.859221
      ]
    ],
    "pop_urbaine": [
      [
        1960,
        17.398
      ],
      [
        1961,
        18.33
      ],
      [
        1962,
        19.594
      ],
      [
        1963,
        20.923000000000002
      ],
      [
        1964,
        22.318
      ],
      [
        1965,
        23.775
      ],
      [
        1966,
        25.296999999999997
      ],
      [
        1967,
        26.883000000000003
      ],
      [
        1968,
        28.533
      ],
      [
        1969,
        30.237
      ],
      [
        1970,
        32.0
      ],
      [
        1971,
        34.082
      ],
      [
        1972,
        36.231
      ],
      [
        1973,
        38.43
      ],
      [
        1974,
        40.681
      ],
      [
        1975,
        42.971000000000004
      ],
      [
        1976,
        45.295
      ],
      [
        1977,
        47.633
      ],
      [
        1978,
        49.985
      ],
      [
        1979,
        52.336999999999996
      ],
      [
        1980,
        54.681999999999995
      ],
      [
        1981,
        57.0
      ],
      [
        1982,
        58.372
      ],
      [
        1983,
        59.73
      ],
      [
        1984,
        61.076
      ],
      [
        1985,
        62.402
      ],
      [
        1986,
        63.711000000000006
      ],
      [
        1987,
        65.0
      ],
      [
        1988,
        66.41199999999999
      ],
      [
        1989,
        67.792
      ],
      [
        1990,
        69.143
      ],
      [
        1991,
        70.462
      ],
      [
        1992,
        71.749
      ],
      [
        1993,
        72.999
      ],
      [
        1994,
        73.921
      ],
      [
        1995,
        74.797
      ],
      [
        1996,
        75.654
      ],
      [
        1997,
        76.49
      ],
      [
        1998,
        77.306
      ],
      [
        1999,
        78.102
      ],
      [
        2000,
        78.87899999999999
      ],
      [
        2001,
        79.633
      ],
      [
        2002,
        80.368
      ],
      [
        2003,
        81.083
      ],
      [
        2004,
        81.778
      ],
      [
        2005,
        82.45200000000001
      ],
      [
        2006,
        83.10700000000001
      ],
      [
        2007,
        83.742
      ],
      [
        2008,
        84.359
      ],
      [
        2009,
        84.955
      ],
      [
        2010,
        85.53299999999999
      ],
      [
        2011,
        86.09200000000001
      ],
      [
        2012,
        86.634
      ],
      [
        2013,
        87.156
      ],
      [
        2014,
        87.65100000000001
      ],
      [
        2015,
        88.118
      ],
      [
        2016,
        88.559
      ],
      [
        2017,
        88.976
      ],
      [
        2018,
        89.37
      ],
      [
        2019,
        "NA"
      ]
    ],
    "prod_elec_renouv": [
      [
        1960,
        "NA"
      ],
      [
        1961,
        "NA"
      ],
      [
        1962,
        "NA"
      ],
      [
        1963,
        "NA"
      ],
      [
        1964,
        "NA"
      ],
      [
        1965,
        "NA"
      ],
      [
        1966,
        "NA"
      ],
      [
        1967,
        "NA"
      ],
      [
        1968,
        "NA"
      ],
      [
        1969,
        "NA"
      ],
      [
        1970,
        "NA"
      ],
      [
        1971,
        0.0
      ],
      [
        1972,
        0.0
      ],
      [
        1973,
        0.0
      ],
      [
        1974,
        0.0
      ],
      [
        1975,
        0.0
      ],
      [
        1976,
        0.0
      ],
      [
        1977,
        0.0
      ],
      [
        1978,
        0.0
      ],
      [
        1979,
        0.0
      ],
      [
        1980,
        0.0
      ],
      [
        1981,
        0.0
      ],
      [
        1982,
        0.0
      ],
      [
        1983,
        0.0
      ],
      [
        1984,
        0.0
      ],
      [
        1985,
        0.0
      ],
      [
        1986,
        0.0
      ],
      [
        1987,
        0.0
      ],
      [
        1988,
        0.0
      ],
      [
        1989,
        0.0
      ],
      [
        1990,
        0.30674846629999997
      ],
      [
        1991,
        0.8121827411
      ],
      [
        1992,
        0.8056394763
      ],
      [
        1993,
        0.8008008007999999
      ],
      [
        1994,
        0.8442776734999999
      ],
      [
        1995,
        0.790166813
      ],
      [
        1996,
        0.5766062603000001
      ],
      [
        1997,
        0.5573248408
      ],
      [
        1998,
        0.5212211467
      ],
      [
        1999,
        0.5271084336999999
      ],
      [
        2000,
        0.5323193916
      ],
      [
        2001,
        0.4975124378
      ],
      [
        2002,
        0.47233468289999997
      ],
      [
        2003,
        0.45632333770000005
      ],
      [
        2004,
        0.5194805195000001
      ],
      [
        2005,
        0.5082592122
      ],
      [
        2006,
        0.4804804805
      ],
      [
        2007,
        0.461361015
      ],
      [
        2008,
        0.4390779363
      ],
      [
        2009,
        0.49126637549999996
      ],
      [
        2010,
        0.4651162791
      ],
      [
        2011,
        0.4409603136
      ],
      [
        2012,
        0.5545286506
      ],
      [
        2013,
        0.5248091603
      ],
      [
        2014,
        0.6006006006
      ],
      [
        2015,
        0.5644402634000001
      ],
      [
        2016,
        "NA"
      ],
      [
        2017,
        "NA"
      ],
      [
        2018,
        "NA"
      ],
      [
        2019,
        "NA"
      ]
    ],
    "rdt_cerealier": [
      [
        1960,
        "NA"
      ],
      [
        1961,
        1587.2
      ],
      [
        1962,
        1513.9
      ],
      [
        1963,
        1598.1
      ],
      [
        1964,
        1594.3
      ],
      [
        1965,
        1602.6
      ],
      [
        1966,
        1512.8
      ],
      [
        1967,
        1514.9
      ],
      [
        1968,
        1503.6
      ],
      [
        1969,
        1502.3
      ],
      [
        1970,
        1465.5
      ],
      [
        1971,
        1463.6
      ],
      [
        1972,
        1511.1
      ],
      [
        1973,
        1534.0
      ],
      [
        1974,
        1494.3
      ],
      [
        1975,
        1396.4
      ],
      [
        1976,
        1486.7
      ],
      [
        1977,
        1511.7
      ],
      [
        1978,
        1503.0
      ],
      [
        1979,
        1554.4
      ],
      [
        1980,
        1525.4
      ],
      [
        1981,
        1456.5
      ],
      [
        1982,
        1500.0
      ],
      [
        1983,
        1523.8
      ],
      [
        1984,
        1545.6
      ],
      [
        1985,
        1453.2
      ],
      [
        1986,
        1473.8
      ],
      [
        1987,
        1580.0
      ],
      [
        1988,
        1615.1
      ],
      [
        1989,
        1459.4
      ],
      [
        1990,
        1588.2
      ],
      [
        1991,
        1701.5
      ],
      [
        1992,
        1550.0
      ],
      [
        1993,
        1588.5
      ],
      [
        1994,
        1658.4
      ],
      [
        1995,
        1557.7
      ],
      [
        1996,
        1591.0
      ],
      [
        1997,
        1562.4
      ],
      [
        1998,
        1583.7
      ],
      [
        1999,
        1599.1
      ],
      [
        2000,
        1630.3
      ],
      [
        2001,
        1541.5
      ],
      [
        2002,
        1449.4
      ],
      [
        2003,
        1538.1
      ],
      [
        2004,
        1559.8
      ],
      [
        2005,
        1569.9
      ],
      [
        2006,
        1580.0
      ],
      [
        2007,
        1667.1
      ],
      [
        2008,
        1611.4
      ],
      [
        2009,
        1589.1
      ],
      [
        2010,
        1595.0
      ],
      [
        2011,
        1596.1
      ],
      [
        2012,
        1600.6
      ],
      [
        2013,
        1600.4
      ],
      [
        2014,
        1599.9
      ],
      [
        2015,
        1600.1
      ],
      [
        2016,
        1600.2
      ],
      [
        2017,
        1601.1
      ],
      [
        2018,
        "NA"
      ],
      [
        2019,
        "NA"
      ]
    ],
    "recette_budg": [
      [
        1980,
        "NA"
      ],
      [
        1981,
        "NA"
      ],
      [
        1982,
        "NA"
      ],
      [
        1983,
        "NA"
      ],
      [
        1984,
        "NA"
      ],
      [
        1985,
        "NA"
      ],
      [
        1986,
        "NA"
      ],
      [
        1987,
        "NA"
      ],
      [
        1988,
        "NA"
      ],
      [
        1989,
        "NA"
      ],
      [
        1990,
        18.758
      ],
      [
        1991,
        23.053
      ],
      [
        1992,
        21.641
      ],
      [
        1993,
        21.526
      ],
      [
        1994,
        22.38
      ],
      [
        1995,
        27.717
      ],
      [
        1996,
        24.343000000000004
      ],
      [
        1997,
        31.104
      ],
      [
        1998,
        32.384
      ],
      [
        1999,
        26.611
      ],
      [
        2000,
        31.429000000000002
      ],
      [
        2001,
        31.901
      ],
      [
        2002,
        29.447
      ],
      [
        2003,
        29.002
      ],
      [
        2004,
        27.866999999999997
      ],
      [
        2005,
        28.745
      ],
      [
        2006,
        29.807
      ],
      [
        2007,
        27.451
      ],
      [
        2008,
        29.923000000000002
      ],
      [
        2009,
        29.368000000000002
      ],
      [
        2010,
        25.789
      ],
      [
        2011,
        23.483
      ],
      [
        2012,
        30.154
      ],
      [
        2013,
        31.605
      ],
      [
        2014,
        29.735
      ],
      [
        2015,
        21.136
      ],
      [
        2016,
        17.137999999999998
      ],
      [
        2017,
        16.415
      ],
      [
        2018,
        16.873
      ],
      [
        2019,
        18.308
      ],
      [
        2020,
        19.22
      ],
      [
        2021,
        19.736
      ],
      [
        2022,
        19.764
      ],
      [
        2023,
        20.015
      ],
      [
        2024,
        19.9
      ]
    ],
    "regime_pol": [
      [
        1816,
        -20.0
      ],
      [
        1817,
        -20.0
      ],
      [
        1818,
        -20.0
      ],
      [
        1819,
        -20.0
      ],
      [
        1820,
        -20.0
      ],
      [
        1821,
        -20.0
      ],
      [
        1822,
        -20.0
      ],
      [
        1823,
        -20.0
      ],
      [
        1824,
        -20.0
      ],
      [
        1825,
        -20.0
      ],
      [
        1826,
        -20.0
      ],
      [
        1827,
        -20.0
      ],
      [
        1828,
        -20.0
      ],
      [
        1829,
        -20.0
      ],
      [
        1830,
        -20.0
      ],
      [
        1831,
        -20.0
      ],
      [
        1832,
        -20.0
      ],
      [
        1833,
        -20.0
      ],
      [
        1834,
        -20.0
      ],
      [
        1835,
        -20.0
      ],
      [
        1836,
        -20.0
      ],
      [
        1837,
        -20.0
      ],
      [
        1838,
        -20.0
      ],
      [
        1839,
        -20.0
      ],
      [
        1840,
        -20.0
      ],
      [
        1841,
        -20.0
      ],
      [
        1842,
        -20.0
      ],
      [
        1843,
        -20.0
      ],
      [
        1844,
        -20.0
      ],
      [
        1845,
        -20.0
      ],
      [
        1846,
        -20.0
      ],
      [
        1847,
        -20.0
      ],
      [
        1848,
        -20.0
      ],
      [
        1849,
        -20.0
      ],
      [
        1850,
        -20.0
      ],
      [
        1851,
        -20.0
      ],
      [
        1852,
        -20.0
      ],
      [
        1853,
        -20.0
      ],
      [
        1854,
        -20.0
      ],
      [
        1855,
        -20.0
      ],
      [
        1856,
        -20.0
      ],
      [
        1857,
        -20.0
      ],
      [
        1858,
        -20.0
      ],
      [
        1859,
        -20.0
      ],
      [
        1860,
        -20.0
      ],
      [
        1861,
        -20.0
      ],
      [
        1862,
        -20.0
      ],
      [
        1863,
        -20.0
      ],
      [
        1864,
        -20.0
      ],
      [
        1865,
        -20.0
      ],
      [
        1866,
        -20.0
      ],
      [
        1867,
        -20.0
      ],
      [
        1868,
        -20.0
      ],
      [
        1869,
        -20.0
      ],
      [
        1870,
        -20.0
      ],
      [
        1871,
        -20.0
      ],
      [
        1872,
        -20.0
      ],
      [
        1873,
        -20.0
      ],
      [
        1874,
        -20.0
      ],
      [
        1875,
        -20.0
      ],
      [
        1876,
        -20.0
      ],
      [
        1877,
        -20.0
      ],
      [
        1878,
        -20.0
      ],
      [
        1879,
        -20.0
      ],
      [
        1880,
        -20.0
      ],
      [
        1881,
        -20.0
      ],
      [
        1882,
        -20.0
      ],
      [
        1883,
        -20.0
      ],
      [
        1884,
        -20.0
      ],
      [
        1885,
        -20.0
      ],
      [
        1886,
        -20.0
      ],
      [
        1887,
        -20.0
      ],
      [
        1888,
        -20.0
      ],
      [
        1889,
        -20.0
      ],
      [
        1890,
        -20.0
      ],
      [
        1891,
        -20.0
      ],
      [
        1892,
        -20.0
      ],
      [
        1893,
        -20.0
      ],
      [
        1894,
        -20.0
      ],
      [
        1895,
        -20.0
      ],
      [
        1896,
        -20.0
      ],
      [
        1897,
        -20.0
      ],
      [
        1898,
        -20.0
      ],
      [
        1899,
        -20.0
      ],
      [
        1900,
        -20.0
      ],
      [
        1901,
        -20.0
      ],
      [
        1902,
        -20.0
      ],
      [
        1903,
        -20.0
      ],
      [
        1904,
        -20.0
      ],
      [
        1905,
        -20.0
      ],
      [
        1906,
        -20.0
      ],
      [
        1907,
        -20.0
      ],
      [
        1908,
        -20.0
      ],
      [
        1909,
        -20.0
      ],
      [
        1910,
        -20.0
      ],
      [
        1911,
        -20.0
      ],
      [
        1912,
        -20.0
      ],
      [
        1913,
        -20.0
      ],
      [
        1914,
        -20.0
      ],
      [
        1915,
        -20.0
      ],
      [
        1916,
        -20.0
      ],
      [
        1917,
        -20.0
      ],
      [
        1918,
        -20.0
      ],
      [
        1919,
        -20.0
      ],
      [
        1920,
        -20.0
      ],
      [
        1921,
        -20.0
      ],
      [
        1922,
        -20.0
      ],
      [
        1923,
        -20.0
      ],
      [
        1924,
        -20.0
      ],
      [
        1925,
        -20.0
      ],
      [
        1926,
        -20.0
      ],
      [
        1927,
        -20.0
      ],
      [
        1928,
        -20.0
      ],
      [
        1929,
        -20.0
      ],
      [
        1930,
        -20.0
      ],
      [
        1931,
        -20.0
      ],
      [
        1932,
        -20.0
      ],
      [
        1933,
        -20.0
      ],
      [
        1934,
        -20.0
      ],
      [
        1935,
        -20.0
      ],
      [
        1936,
        -20.0
      ],
      [
        1937,
        -20.0
      ],
      [
        1938,
        -20.0
      ],
      [
        1939,
        -20.0
      ],
      [
        1940,
        -20.0
      ],
      [
        1941,
        -20.0
      ],
      [
        1942,
        -20.0
      ],
      [
        1943,
        -20.0
      ],
      [
        1944,
        -20.0
      ],
      [
        1945,
        -20.0
      ],
      [
        1946,
        -20.0
      ],
      [
        1947,
        -20.0
      ],
      [
        1948,
        -20.0
      ],
      [
        1949,
        -20.0
      ],
      [
        1950,
        -20.0
      ],
      [
        1951,
        -20.0
      ],
      [
        1952,
        -20.0
      ],
      [
        1953,
        -20.0
      ],
      [
        1954,
        -20.0
      ],
      [
        1955,
        -20.0
      ],
      [
        1956,
        -20.0
      ],
      [
        1957,
        -20.0
      ],
      [
        1958,
        -20.0
      ],
      [
        1959,
        -20.0
      ],
      [
        1960,
        -7.0
      ],
      [
        1961,
        -7.0
      ],
      [
        1962,
        -7.0
      ],
      [
        1963,
        -7.0
      ],
      [
        1964,
        -7.0
      ],
      [
        1965,
        -7.0
      ],
      [
        1966,
        -7.0
      ],
      [
        1967,
        -7.0
      ],
      [
        1968,
        -9.0
      ],
      [
        1969,
        -9.0
      ],
      [
        1970,
        -9.0
      ],
      [
        1971,
        -9.0
      ],
      [
        1972,
        -9.0
      ],
      [
        1973,
        -9.0
      ],
      [
        1974,
        -9.0
      ],
      [
        1975,
        -9.0
      ],
      [
        1976,
        -9.0
      ],
      [
        1977,
        -9.0
      ],
      [
        1978,
        -9.0
      ],
      [
        1979,
        -9.0
      ],
      [
        1980,
        -9.0
      ],
      [
        1981,
        -9.0
      ],
      [
        1982,
        -9.0
      ],
      [
        1983,
        -9.0
      ],
      [
        1984,
        -9.0
      ],
      [
        1985,
        -9.0
      ],
      [
        1986,
        -9.0
      ],
      [
        1987,
        -9.0
      ],
      [
        1988,
        -9.0
      ],
      [
        1989,
        -9.0
      ],
      [
        1990,
        -6.0
      ],
      [
        1991,
        -4.0
      ],
      [
        1992,
        -4.0
      ],
      [
        1993,
        -4.0
      ],
      [
        1994,
        -4.0
      ],
      [
        1995,
        -4.0
      ],
      [
        1996,
        -4.0
      ],
      [
        1997,
        -4.0
      ],
      [
        1998,
        -4.0
      ],
      [
        1999,
        -4.0
      ],
      [
        2000,
        -4.0
      ],
      [
        2001,
        -4.0
      ],
      [
        2002,
        -4.0
      ],
      [
        2003,
        -4.0
      ],
      [
        2004,
        -4.0
      ],
      [
        2005,
        -4.0
      ],
      [
        2006,
        -4.0
      ],
      [
        2007,
        -4.0
      ],
      [
        2008,
        -4.0
      ],
      [
        2009,
        3.0
      ],
      [
        2010,
        3.0
      ],
      [
        2011,
        3.0
      ],
      [
        2012,
        3.0
      ],
      [
        2013,
        3.0
      ],
      [
        2014,
        3.0
      ],
      [
        2015,
        3.0
      ]
    ],
    "sous_nutri": [
      [
        1960,
        "NA"
      ],
      [
        1961,
        "NA"
      ],
      [
        1962,
        "NA"
      ],
      [
        1963,
        "NA"
      ],
      [
        1964,
        "NA"
      ],
      [
        1965,
        "NA"
      ],
      [
        1966,
        "NA"
      ],
      [
        1967,
        "NA"
      ],
      [
        1968,
        "NA"
      ],
      [
        1969,
        "NA"
      ],
      [
        1970,
        "NA"
      ],
      [
        1971,
        "NA"
      ],
      [
        1972,
        "NA"
      ],
      [
        1973,
        "NA"
      ],
      [
        1974,
        "NA"
      ],
      [
        1975,
        "NA"
      ],
      [
        1976,
        "NA"
      ],
      [
        1977,
        "NA"
      ],
      [
        1978,
        125.8
      ],
      [
        1979,
        121.6
      ],
      [
        1980,
        117.3
      ],
      [
        1981,
        113.1
      ],
      [
        1982,
        109.4
      ],
      [
        1983,
        105.8
      ],
      [
        1984,
        102.8
      ],
      [
        1985,
        100.3
      ],
      [
        1986,
        98.1
      ],
      [
        1987,
        96.2
      ],
      [
        1988,
        94.8
      ],
      [
        1989,
        93.6
      ],
      [
        1990,
        92.6
      ],
      [
        1991,
        91.9
      ],
      [
        1992,
        91.2
      ],
      [
        1993,
        90.6
      ],
      [
        1994,
        89.9
      ],
      [
        1995,
        89.3
      ],
      [
        1996,
        88.7
      ],
      [
        1997,
        88.0
      ],
      [
        1998,
        87.1
      ],
      [
        1999,
        86.0
      ],
      [
        2000,
        84.7
      ],
      [
        2001,
        83.1
      ],
      [
        2002,
        81.3
      ],
      [
        2003,
        79.4
      ],
      [
        2004,
        77.3
      ],
      [
        2005,
        75.0
      ],
      [
        2006,
        73.0
      ],
      [
        2007,
        70.5
      ],
      [
        2008,
        67.9
      ],
      [
        2009,
        65.4
      ],
      [
        2010,
        62.8
      ],
      [
        2011,
        60.4
      ],
      [
        2012,
        58.1
      ],
      [
        2013,
        55.7
      ],
      [
        2014,
        53.5
      ],
      [
        2015,
        51.0
      ],
      [
        2016,
        48.1
      ],
      [
        2017,
        46.0
      ],
      [
        2018,
        44.8
      ],
      [
        2019,
        "NA"
      ]
    ],
    "volume_exp_biens": [
      [
        1980,
        -24.638
      ],
      [
        1981,
        -15.819
      ],
      [
        1982,
        1.714
      ],
      [
        1983,
        -0.899
      ],
      [
        1984,
        7.224
      ],
      [
        1985,
        2.471
      ],
      [
        1986,
        -5.904
      ],
      [
        1987,
        -5.975
      ],
      [
        1988,
        5.162000000000001
      ],
      [
        1989,
        25.186999999999998
      ],
      [
        1990,
        19.512
      ],
      [
        1991,
        -1.114
      ],
      [
        1992,
        2.553
      ],
      [
        1993,
        12.540999999999999
      ],
      [
        1994,
        4.489
      ],
      [
        1995,
        6.231
      ],
      [
        1996,
        2.43
      ],
      [
        1997,
        3.378
      ],
      [
        1998,
        -6.227
      ],
      [
        1999,
        -5.3
      ],
      [
        2000,
        -10.458
      ],
      [
        2001,
        -5.042
      ],
      [
        2002,
        -8.456
      ],
      [
        2003,
        5.997999999999999
      ],
      [
        2004,
        5.468999999999999
      ],
      [
        2005,
        -4.169
      ],
      [
        2006,
        -10.022
      ],
      [
        2007,
        5.244
      ],
      [
        2008,
        2.78
      ],
      [
        2009,
        -3.307
      ],
      [
        2010,
        8.167
      ],
      [
        2011,
        -2.148
      ],
      [
        2012,
        -2.927
      ],
      [
        2013,
        -1.263
      ],
      [
        2014,
        2.209
      ],
      [
        2015,
        20.172
      ],
      [
        2016,
        -4.022
      ],
      [
        2017,
        -3.4160000000000004
      ],
      [
        2018,
        -9.827
      ],
      [
        2019,
        14.690999999999999
      ],
      [
        2020,
        8.978
      ],
      [
        2021,
        5.647
      ],
      [
        2022,
        5.138
      ],
      [
        2023,
        4.144
      ],
      [
        2024,
        3.359
      ]
    ],
    "volume_exp_bs": [
      [
        1980,
        -24.638
      ],
      [
        1981,
        -15.819
      ],
      [
        1982,
        1.714
      ],
      [
        1983,
        -0.899
      ],
      [
        1984,
        7.224
      ],
      [
        1985,
        2.471
      ],
      [
        1986,
        -5.904
      ],
      [
        1987,
        -5.975
      ],
      [
        1988,
        5.162000000000001
      ],
      [
        1989,
        25.186999999999998
      ],
      [
        1990,
        19.512
      ],
      [
        1991,
        -1.114
      ],
      [
        1992,
        2.553
      ],
      [
        1993,
        12.540999999999999
      ],
      [
        1994,
        4.489
      ],
      [
        1995,
        6.231
      ],
      [
        1996,
        2.43
      ],
      [
        1997,
        3.378
      ],
      [
        1998,
        -6.227
      ],
      [
        1999,
        -5.3
      ],
      [
        2000,
        -10.458
      ],
      [
        2001,
        -5.042
      ],
      [
        2002,
        -8.456
      ],
      [
        2003,
        5.997999999999999
      ],
      [
        2004,
        5.468999999999999
      ],
      [
        2005,
        -4.169
      ],
      [
        2006,
        -10.022
      ],
      [
        2007,
        5.244
      ],
      [
        2008,
        2.78
      ],
      [
        2009,
        -3.307
      ],
      [
        2010,
        8.167
      ],
      [
        2011,
        -2.148
      ],
      [
        2012,
        -2.927
      ],
      [
        2013,
        -1.263
      ],
      [
        2014,
        2.209
      ],
      [
        2015,
        20.172
      ],
      [
        2016,
        -4.022
      ],
      [
        2017,
        -3.4160000000000004
      ],
      [
        2018,
        -9.827
      ],
      [
        2019,
        14.690999999999999
      ],
      [
        2020,
        8.978
      ],
      [
        2021,
        5.647
      ],
      [
        2022,
        5.138
      ],
      [
        2023,
        4.144
      ],
      [
        2024,
        3.359
      ]
    ],
    "volume_import_biens": [
      [
        1980,
        12.302999999999999
      ],
      [
        1981,
        5.6979999999999995
      ],
      [
        1982,
        -6.617000000000001
      ],
      [
        1983,
        11.052999999999999
      ],
      [
        1984,
        1.494
      ],
      [
        1985,
        22.051
      ],
      [
        1986,
        123.564
      ],
      [
        1987,
        -41.893
      ],
      [
        1988,
        36.058
      ],
      [
        1989,
        4.848
      ],
      [
        1990,
        -10.515
      ],
      [
        1991,
        3.304
      ],
      [
        1992,
        1.87
      ],
      [
        1993,
        4.48
      ],
      [
        1994,
        -14.827
      ],
      [
        1995,
        2.316
      ],
      [
        1996,
        2.995
      ],
      [
        1997,
        12.084000000000001
      ],
      [
        1998,
        22.45
      ],
      [
        1999,
        -24.535
      ],
      [
        2000,
        -17.424
      ],
      [
        2001,
        -2.371
      ],
      [
        2002,
        11.309000000000001
      ],
      [
        2003,
        -2.342
      ],
      [
        2004,
        5.048
      ],
      [
        2005,
        0.9
      ],
      [
        2006,
        26.752
      ],
      [
        2007,
        11.321
      ],
      [
        2008,
        -0.789
      ],
      [
        2009,
        8.77
      ],
      [
        2010,
        12.412
      ],
      [
        2011,
        -17.433
      ],
      [
        2012,
        32.691
      ],
      [
        2013,
        36.431
      ],
      [
        2014,
        -5.439
      ],
      [
        2015,
        -10.2
      ],
      [
        2016,
        -16.101
      ],
      [
        2017,
        6.257000000000001
      ],
      [
        2018,
        3.9819999999999998
      ],
      [
        2019,
        2.675
      ],
      [
        2020,
        -0.49
      ],
      [
        2021,
        1.776
      ],
      [
        2022,
        0.138
      ],
      [
        2023,
        3.113
      ],
      [
        2024,
        3.8569999999999998
      ]
    ],
    "volume_import_bs": [
      [
        1980,
        12.302999999999999
      ],
      [
        1981,
        5.6979999999999995
      ],
      [
        1982,
        -6.617000000000001
      ],
      [
        1983,
        11.052999999999999
      ],
      [
        1984,
        1.494
      ],
      [
        1985,
        22.051
      ],
      [
        1986,
        123.564
      ],
      [
        1987,
        -41.893
      ],
      [
        1988,
        36.058
      ],
      [
        1989,
        4.848
      ],
      [
        1990,
        -10.515
      ],
      [
        1991,
        3.304
      ],
      [
        1992,
        1.87
      ],
      [
        1993,
        4.48
      ],
      [
        1994,
        -14.827
      ],
      [
        1995,
        2.316
      ],
      [
        1996,
        2.995
      ],
      [
        1997,
        12.084000000000001
      ],
      [
        1998,
        22.45
      ],
      [
        1999,
        -24.535
      ],
      [
        2000,
        -17.424
      ],
      [
        2001,
        -2.371
      ],
      [
        2002,
        11.309000000000001
      ],
      [
        2003,
        -2.342
      ],
      [
        2004,
        5.048
      ],
      [
        2005,
        0.9
      ],
      [
        2006,
        26.752
      ],
      [
        2007,
        11.342
      ],
      [
        2008,
        -0.789
      ],
      [
        2009,
        8.77
      ],
      [
        2010,
        12.412
      ],
      [
        2011,
        -17.433
      ],
      [
        2012,
        32.691
      ],
      [
        2013,
        36.431
      ],
      [
        2014,
        -5.439
      ],
      [
        2015,
        -10.2
      ],
      [
        2016,
        -16.101
      ],
      [
        2017,
        6.257000000000001
      ],
      [
        2018,
        3.9819999999999998
      ],
      [
        2019,
        2.675
      ],
      [
        2020,
        -0.49
      ],
      [
        2021,
        1.776
      ],
      [
        2022,
        0.138
      ],
      [
        2023,
        3.113
      ],
      [
        2024,
        3.8569999999999998
      ]
    ],
    "vuln_clim_ferdi": [
      [
        2018,
        47.5632146603992
      ]
    ],
    "vuln_clim_ndgain": [
      [
        1995,
        0.4690939329148339
      ],
      [
        1996,
        0.463520539985693
      ],
      [
        1997,
        0.4614328969156671
      ],
      [
        1998,
        0.4597425263920429
      ],
      [
        1999,
        0.45918155647387
      ],
      [
        2000,
        0.458555919089928
      ],
      [
        2001,
        0.456508108287509
      ],
      [
        2002,
        0.453662473971216
      ],
      [
        2003,
        0.452591496715694
      ],
      [
        2004,
        0.4496928989371421
      ],
      [
        2005,
        0.45093154687765
      ],
      [
        2006,
        0.448458165793218
      ],
      [
        2007,
        0.4481932713038789
      ],
      [
        2008,
        0.447383207679805
      ],
      [
        2009,
        0.446018186214489
      ],
      [
        2010,
        0.44411419481596703
      ],
      [
        2011,
        0.443579069408879
      ],
      [
        2012,
        0.44186210994647496
      ],
      [
        2013,
        0.4428251807455979
      ],
      [
        2014,
        0.440093031886588
      ],
      [
        2015,
        0.440168848413269
      ],
      [
        2016,
        0.440361197548058
      ]
    ]
  }
}