Year,ABW,AFG,AGO,AIA,ALB,AND,ARE,ARG,ARM,ASM,ATG,AUS,AUT,AZE,BDI,BEL,BEN,BES,BFA,BGD,BGR,BHR,BHS,BIH,BLR,BLZ,BMU,BOL,BRA,BRB,BRN,BTN,BWA,CAF,CAN,CHE,CHL,CHN,CIV,CMR,COD,COG,COK,COL,COM,CPV,CRI,CUB,CUW,CYM,CYP,CZE,DEU,DJI,DMA,DNK,DOM,DZA,ECU,EGY,ERI,ESH,ESP,EST,ETH,FIN,FJI,FLK,FRA,FRO,FSM,GAB,GBR,GEO,GHA,GIB,GIN,GLP,GMB,GNB,GNQ,GRC,GRD,GRL,GTM,GUF,GUM,GUY,HKG,HND,HRV,HTI,HUN,IDN,IMN,IND,IRL,IRN,IRQ,ISL,ISR,ITA,JAM,JOR,JPN,KAZ,KEN,KGZ,KHM,KIR,KNA,KOR,KWT,LAO,LBN,LBR,LBY,LCA,LIE,LKA,LSO,LTU,LUX,LVA,MAC,MAR,MCO,MDA,MDG,MDV,MEX,MHL,MKD,MLI,MLT,MMR,MNE,MNG,MNP,MOZ,MRT,MSR,MTQ,MUS,MWI,MYS,MYT,NAM,NCL,NER,NGA,NIC,NIU,NLD,NOR,NPL,NRU,NZL,OMN,PAK,PAN,PER,PHL,PLW,PNG,POL,PRI,PRK,PRT,PRY,PSE,PYF,QAT,REU,ROU,RUS,RWA,SAU,SDN,SEN,SGP,SHN,SLB,SLE,SLV,SMR,SOM,SPM,SRB,SSD,STP,SUR,SVK,SVN,SWE,SWZ,SXM,SYC,SYR,TCA,TCD,TGO,THA,TJK,TKL,TKM,TLS,TON,TTO,TUN,TUR,TUV,TWN,TZA,UGA,UKR,URY,USA,UZB,VAT,VCT,VEN,VGB,VIR,VNM,VUT,WLF,WSM,YEM,ZAF,ZMB,ZWE
1955,-7.727,-0.499,0.0,,-0.015,,-0.37,3.127,6.838,,-4.09,9.134,-2.246,0.0,-5.773,1.226,-2.018,,-4.643,-0.276,-2.725,4.944,-2.197,-3.573,-10.023,-7.947,,-1.488,1.024,-5.441,24.063,5.344,-3.496,0.0,7.56,4.947,-3.562,-0.088,4.925,0.0,0.0,0.0,,-3.237,0.0,-6.317,0.956,-0.963,4.825,,-5.391,1.314,-0.119,3.037,,-0.84,-1.474,-7.721,-0.108,-0.459,0.232,64.156,-3.537,6.548,-0.21,-1.578,-4.631,,1.006,,2.61,1.253,-1.633,2.48,2.229,,0.0,-2.515,0.0,-3.599,0.0,-1.786,-15.465,,-0.17,1.712,-12.566,0.754,13.425,-0.241,-0.001,-1.782,0.517,1.032,,-0.054,-11.777,-0.012,-0.018,-0.55,32.12,-0.995,-5.291,42.29,0.0,13.971,0.0,1.924,0.0,-3.712,,4.252,4.597,-0.001,0.225,-0.003,0.0,-20.629,,-0.394,-5.437,-5.646,3.829,2.924,-33.556,0.0,,7.254,0.0,-0.057,-1.538,,0.0,-1.447,-18.682,0.0,4.77,0.0,,-0.754,-0.374,,-6.846,1.001,0.0,-0.523,30.699,0.0,-10.445,0.363,0.017,-1.543,,-1.637,-0.237,-0.911,,6.173,-4.201,-0.042,-3.057,-0.373,-0.482,,-1.206,0.0,-30.446,-11.018,-7.214,-10.089,-14.339,-3.984,37.368,1.886,-0.024,0.061,0.0,1.574,0.0,2.495,11.268,,5.894,0.0,-5.366,,0.0,,1.008,0.0,-30.769,-2.951,3.78,-2.666,1.459,-3.941,,-12.608,-3.823,,0.0,-6.541,0.0,7.019,,1.355,0.0,-5.239,-1.103,-0.989,-0.166,,2.263,0.245,0.0,0.227,0.867,1.05,5.087,,-14.878,7.2,,-2.139,0.0,-3.489,,-11.302,-2.078,0.103,0.0,-0.302
1960,11.371,-0.463,-6.587,,-0.013,,-0.407,1.434,6.973,,-5.774,8.235,-1.483,0.0,-5.252,1.033,-1.943,,-4.372,0.007,-1.126,10.622,15.908,-3.246,-4.147,-6.384,,-0.673,0.0,-16.266,19.324,4.753,-12.679,0.0,6.74,5.078,-3.341,-0.019,6.178,0.0,1.043,0.0,,-3.121,-6.666,-22.833,1.17,-1.608,-9.819,,-2.411,-0.768,0.11,13.052,,-1.447,-2.088,-3.684,-0.376,-0.402,0.629,61.588,-3.062,4.528,-0.19,-1.28,-5.861,,3.729,,2.17,1.218,0.271,3.533,1.941,,0.0,4.306,2.903,-3.349,0.0,-4.95,-13.401,,-0.217,4.665,-14.073,-0.495,11.884,-1.26,-0.001,-1.897,-3.516,0.976,,-0.072,-14.634,-0.019,-0.032,0.388,17.969,-2.263,-18.911,29.691,-0.219,22.069,0.0,2.769,0.0,-3.94,,2.65,46.794,0.005,4.795,1.499,6.834,-28.45,,-1.608,-6.483,-1.815,2.705,6.484,-49.019,-0.228,,10.056,0.0,-0.274,-1.64,,-6.239,-1.917,-17.701,0.0,-0.86,0.0,,-0.686,-0.403,,0.027,-2.632,0.0,-1.654,22.873,0.0,6.732,-1.584,0.013,-1.343,,-0.401,-0.538,-1.652,,3.449,-3.818,-0.078,-2.319,-0.41,-1.271,,0.291,-1.885,-18.5,0.0,-7.477,-8.388,-13.214,-6.607,21.876,-2.514,-0.022,-2.081,0.0,1.359,0.0,2.929,9.261,,5.735,0.0,-3.376,,-0.101,,-1.354,0.0,-11.301,-4.035,0.904,-1.242,1.282,-5.033,,-12.715,-0.707,,-0.174,-7.509,0.0,0.862,,4.046,0.0,-16.034,-0.929,-9.394,-0.464,,0.1,0.213,0.0,-1.559,1.629,2.371,2.506,,-16.23,2.145,,-3.419,0.0,-2.964,,-8.822,-2.918,0.185,0.0,-0.429
1965,-15.499,-0.422,-10.573,,-0.011,,62.543,1.144,6.886,,-6.665,7.132,0.445,0.0,-5.769,0.823,-1.919,,-5.787,-0.551,-0.036,-4.796,22.233,-2.958,-3.016,-4.88,,-1.079,0.0,-15.403,13.954,4.19,-8.445,1.519,1.907,9.993,-3.432,-0.325,10.385,0.0,1.504,0.0,,-3.525,-8.522,-1.08,1.082,-5.405,-11.889,,-14.915,0.515,1.789,36.254,,0.097,-2.426,-4.794,-0.368,-0.351,1.298,59.717,-1.239,6.897,-0.17,-2.887,-1.612,,6.007,,1.877,3.639,0.537,4.596,0.835,,0.0,-7.636,2.743,-6.32,2.256,-6.138,-20.48,,-0.454,19.591,-8.208,-4.795,-1.682,-2.646,0.087,-2.56,0.431,0.957,,-0.036,-7.54,-0.067,-0.048,-0.796,18.414,-0.91,-17.009,6.781,-0.315,12.75,-0.453,8.702,0.0,-3.588,,-0.51,73.948,0.007,2.053,1.353,5.769,-19.775,,-0.905,-5.683,1.723,5.29,7.247,20.551,-3.612,,6.364,0.0,-1.207,-1.998,,-5.315,-2.594,-7.374,0.0,-0.784,0.0,,-0.617,-0.396,,-5.531,-8.737,0.0,-1.326,16.97,0.0,7.91,-0.632,0.004,-1.46,,0.196,-0.124,-1.328,,4.352,-3.399,-0.389,-1.949,-0.536,-1.525,,0.494,-0.41,-7.628,0.0,-12.319,-6.96,-13.738,7.439,54.187,-1.341,-0.021,-2.253,-9.075,5.643,0.0,2.903,0.049,,3.705,0.0,-1.611,,-0.091,,-2.291,0.0,-28.337,-7.166,-1.24,-2.744,2.111,-6.762,,-4.453,-0.643,,-0.317,-9.472,0.0,4.663,,3.065,0.0,1.248,-12.91,-6.532,-1.027,,4.22,0.462,3.389,2.073,-0.459,1.9,3.468,,-22.411,0.423,,49.275,0.0,-1.89,,-5.774,-3.622,1.168,-2.128,-0.728
1970,-14.687,-0.379,-20.146,,-0.01,,56.011,1.129,8.732,,-3.913,13.377,1.36,-1.637,-3.523,0.992,-1.713,,-5.36,-0.541,-0.154,-8.032,18.005,-5.316,1.506,-5.181,,-1.086,0.0,-11.534,18.702,7.255,-8.149,1.524,5.962,3.109,-4.187,-0.041,8.606,-0.033,2.6,0.0,,-3.369,-5.029,3.42,0.91,-5.961,-6.524,,-2.626,-2.631,2.251,36.413,,0.902,-2.682,-1.796,-0.194,-1.476,0.813,53.658,-0.884,6.218,-0.316,-4.267,-5.801,,1.976,,1.51,5.768,-0.309,3.751,-6.316,,0.0,-10.229,6.165,-2.135,3.447,-4.373,-20.583,,-1.573,18.589,-3.634,-12.547,3.914,-3.239,-0.056,-2.597,0.306,1.034,,-0.13,-3.997,0.387,-0.15,-2.78,5.463,-0.881,-16.491,35.294,1.618,2.787,-0.375,7.523,-7.38,-3.759,,-0.536,48.204,0.002,-6.379,1.209,4.966,-15.578,,-0.653,-4.592,1.725,3.534,6.095,29.907,-6.281,,4.296,-0.259,-5.318,-2.577,,-3.499,-3.412,-7.841,0.0,-20.417,0.0,,-0.551,-0.518,,-14.513,-7.383,0.0,-2.74,2.691,-0.281,2.862,-0.548,-0.163,-1.699,,0.866,0.22,-0.366,,-0.193,-1.483,-0.77,-1.791,-0.777,-2.821,,0.719,-0.894,-10.449,0.0,-15.923,-5.696,-48.635,6.559,45.998,5.772,-0.02,-0.857,1.144,7.004,0.0,4.359,-0.037,,1.967,0.0,-2.578,,0.117,,-2.25,0.0,-2.134,-7.957,-2.593,-1.813,3.316,-1.97,,-4.478,-0.546,,-2.356,14.531,0.0,4.856,,2.754,0.0,-7.262,-13.205,-4.017,-1.093,,5.053,0.573,1.15,1.164,-2.471,1.521,8.04,,-21.995,0.06,,11.291,0.0,-3.039,,-10.071,-8.243,1.924,-1.138,-1.721
1975,-11.817,-0.335,6.189,,-0.009,,133.103,1.142,6.451,,-22.13,3.908,2.164,-1.86,-14.847,1.463,-1.609,,-5.782,-9.07,-1.007,15.964,1.06,-4.247,0.818,-16.701,,-1.123,0.0,-5.718,14.956,6.195,1.166,-5.306,6.825,0.807,-3.166,-0.252,13.654,-0.072,0.256,0.0,,-3.341,-4.514,-25.911,1.283,-4.185,-6.805,,0.967,0.201,1.783,36.47,,0.931,-2.937,-3.262,-0.168,-3.061,1.42,-29.453,0.556,4.397,-0.391,1.238,-5.521,,2.1,,-24.198,0.97,0.381,-3.064,-3.055,,-4.051,-16.411,5.736,-4.079,-50.018,0.47,-25.157,,-4.563,9.717,-4.81,-14.988,3.672,-3.135,-0.825,-3.603,-0.468,0.828,,0.715,2.933,0.507,-0.159,-1.005,10.858,0.071,-9.328,-3.137,1.316,-1.892,-0.288,-0.771,-3.443,-4.216,,-1.243,21.705,0.003,-0.821,1.466,4.911,-18.167,,-2.21,-4.393,2.348,8.814,4.511,-8.997,-6.023,,3.003,-0.538,3.832,-3.314,,-6.925,-3.076,-6.024,0.0,-0.745,0.0,,-0.49,-0.961,,-16.591,-4.763,-0.595,-2.357,2.406,-0.611,13.906,-0.568,-0.129,-2.914,,2.799,0.805,-0.091,,5.198,6.344,-0.442,-1.506,-1.144,-1.946,,-0.433,-1.026,-2.997,0.0,2.428,-4.49,-5.265,8.275,50.202,-10.026,-0.019,-0.45,-0.985,14.584,0.357,2.855,0.543,,0.487,0.0,-4.649,,0.0,,-0.497,1.345,-6.364,-31.256,-0.657,2.103,0.463,-4.909,,0.6,-2.348,,-2.537,-4.419,1.998,1.774,,2.148,0.0,-17.34,-5.908,-3.622,-1.295,,-0.319,1.634,-5.483,0.861,-9.645,2.697,1.09,,-18.151,0.015,,24.887,0.0,1.676,,-20.256,-11.126,1.884,-0.877,-1.573
1980,-18.12,-17.722,5.201,,-0.008,,95.019,-1.711,1.161,,-14.222,3.325,0.144,-1.707,-7.65,1.497,-1.111,,-6.701,-3.039,-2.154,31.264,2.985,-3.632,0.814,-19.526,,-1.517,0.0,-4.451,9.331,5.305,4.33,-0.096,3.544,-4.29,-2.695,-0.01,11.168,0.0,0.818,-0.894,,-3.291,7.078,-20.2,1.554,-3.317,-17.771,,-0.364,0.196,0.583,62.553,,0.586,-3.182,-2.51,-0.192,-2.909,1.235,107.693,0.418,4.213,-12.479,-1.236,-7.337,,0.97,,0.353,1.455,0.139,-3.86,-8.741,,-6.694,-11.168,4.954,-20.513,-23.726,6.381,-29.1,,-7.539,16.546,-3.061,-13.72,17.206,-2.986,0.821,-3.651,0.245,0.545,,0.336,3.175,2.26,-0.754,-3.521,3.575,0.591,-9.4,-7.269,0.356,-6.036,-0.039,-2.657,-2.391,-8.188,,-0.9,23.611,-12.6,-22.089,1.384,3.924,-15.776,,-3.3,-1.046,2.307,6.599,2.911,-8.367,-3.28,,-1.346,-0.737,0.0,-3.938,,-1.583,-5.157,-2.963,0.0,-2.608,0.0,,1.604,-1.351,,-12.663,-4.438,0.481,-0.084,-3.924,-8.835,0.044,-0.649,2.4,-3.823,,2.096,1.024,-0.577,,-4.803,15.009,1.856,-1.512,-1.142,-2.15,,-0.515,-0.613,-1.319,0.0,4.199,-3.118,-11.811,6.571,29.269,-7.253,-0.903,0.904,-0.841,18.438,2.702,-5.128,1.222,,-2.279,0.0,-7.511,,70.703,,0.176,2.842,-2.729,-22.457,-0.398,3.877,2.145,-3.715,,-0.951,-3.927,,-8.16,-7.795,1.281,1.25,,-0.375,-16.727,-17.243,-5.714,-2.396,-1.249,,-2.444,-0.291,-3.106,0.423,-4.177,3.363,0.969,,-14.77,0.016,,4.227,-3.336,-0.808,,-24.738,-2.037,0.546,-0.926,-4.445
1985,-6.241,-52.898,5.117,,-0.007,,30.877,0.964,-3.184,,-12.173,5.997,0.473,-3.17,-6.248,0.374,-0.543,,-5.976,-1.863,-0.501,1.66,0.58,-1.4,0.968,-6.901,,-2.506,0.0,-6.178,3.463,0.366,1.058,3.374,2.982,2.549,-2.611,-0.039,9.525,-0.353,-3.204,0.219,,-2.61,-2.714,-13.644,1.473,-5.414,-11.347,,-7.957,-1.024,0.0,5.098,,0.364,-3.851,-0.778,-0.328,-1.698,1.07,12.242,-0.227,3.457,1.312,1.08,-3.764,,1.069,,1.123,1.287,-0.346,-1.87,-0.207,,-3.223,-8.746,4.274,-7.256,43.185,2.046,-1.24,,-7.294,28.089,0.198,-25.11,6.326,-3.116,2.335,-4.173,-2.173,0.608,,0.156,-3.534,9.338,-2.738,0.221,0.135,0.935,-6.321,6.188,0.083,-5.689,0.042,-2.849,-2.467,-9.769,,0.471,14.864,-2.022,-16.362,0.0,6.394,-13.126,,-5.109,-3.595,2.506,1.397,2.412,19.285,-3.019,,-0.447,-0.213,0.0,-3.543,,-7.451,-5.845,1.507,-0.303,-0.67,0.0,,-6.172,-1.939,,-0.985,-4.366,0.0,-1.052,11.927,-5.154,-4.373,-2.881,-1.725,-6.287,,0.998,1.204,-1.269,,-0.181,12.289,3.259,-1.211,-1.881,-1.151,,0.56,-0.656,-3.048,0.0,-1.36,-1.243,-7.517,4.42,68.692,1.157,-1.751,1.567,-1.77,24.261,2.774,-2.824,10.772,,-2.729,0.0,-9.729,,-14.062,,-0.228,6.171,-11.955,-17.453,-1.369,7.232,0.715,-2.894,,-9.369,-1.777,,-5.463,3.348,1.368,0.588,,-2.339,0.0,-26.489,-5.972,2.498,-0.301,,-0.656,0.349,-1.778,0.75,-2.025,2.879,-2.181,,-14.336,0.017,,-6.835,-1.138,-6.52,,-23.701,-1.142,1.182,0.313,2.433
1990,-16.597,-25.057,3.457,,-0.006,,32.134,1.019,-3.929,,-9.299,8.021,2.895,-4.646,-7.066,0.854,-0.377,,-4.443,-0.452,-4.134,5.637,-0.661,-6.079,-0.459,-6.133,,-1.971,0.0,-4.881,3.05,0.641,7.948,-5.983,6.45,3.999,-1.076,-0.077,5.844,-0.357,0.462,0.181,,-2.055,-2.347,-17.091,1.19,-1.353,-19.589,,4.67,0.11,4.297,35.432,,1.281,-3.956,-0.774,-0.352,-0.805,-3.754,10.709,-0.347,2.008,3.461,0.738,-18.606,,0.988,,-4.182,1.126,0.348,-1.644,-0.581,,0.0,11.532,14.163,-6.063,10.372,3.543,-30.955,,-6.854,33.13,0.16,-27.124,8.035,-3.205,1.102,-4.037,-1.749,0.302,,0.011,-7.175,5.774,-7.856,0.52,3.085,-0.035,-12.359,10.554,-0.484,-8.416,0.046,-6.067,-1.87,-1.947,,0.815,12.506,0.007,-9.389,-34.082,0.264,-6.486,,-1.641,-4.978,2.031,6.855,3.196,21.339,-3.637,,-3.94,-0.185,-2.525,-4.591,,-9.937,-12.136,0.655,-1.009,-9.753,0.0,,-20.753,-4.194,,-0.134,-6.947,21.042,5.061,14.513,5.793,-0.598,-2.086,-0.205,-7.589,,1.896,1.843,-2.42,,-0.565,1.349,0.28,-0.801,-2.682,-1.083,,0.217,-1.624,-3.312,0.0,-2.984,-0.878,-4.076,-0.381,27.157,-0.683,-1.718,1.226,0.893,9.768,1.606,-1.723,8.38,,-5.838,3.089,-10.059,,-11.844,,-0.586,-15.541,-3.908,-2.504,-1.351,3.301,3.18,-0.583,,-14.81,-2.537,,0.051,-1.138,1.858,-1.283,,-2.292,0.0,-22.831,-7.592,1.259,-0.388,,0.804,0.582,2.507,0.0,-1.96,2.734,-3.703,,-13.553,0.01,,-21.348,-1.031,-5.23,,-24.197,-0.94,-0.679,-2.005,1.747
1995,39.917,40.316,2.215,,-27.705,,34.7,-0.623,-29.386,,6.802,4.018,5.8,-3.066,-11.203,2.119,2.509,,-3.174,-1.491,-8.28,2.069,-0.24,-35.73,-1.247,-9.136,,-1.427,0.0,-4.094,3.433,-21.987,3.526,3.317,4.871,7.251,0.052,-0.129,5.742,-0.756,6.758,1.78,,-1.657,-1.353,-3.521,4.153,-2.234,-15.855,,10.652,0.58,6.563,-14.745,,2.524,-3.856,-0.944,-0.35,-1.555,-28.212,10.15,1.617,-14.925,5.557,1.867,-8.99,,0.427,,-3.261,0.983,0.714,-22.793,-0.201,,-3.963,-4.133,0.503,-5.813,8.735,8.758,-8.565,,-7.472,7.031,2.52,-15.384,5.299,-2.926,-6.114,-3.788,1.93,-0.037,,-0.12,-0.866,-3.05,-1.64,-0.807,18.583,0.535,-8.888,20.232,0.074,-17.868,1.721,-12.362,8.342,-11.817,,0.324,-70.787,-2.661,24.639,-28.151,0.169,-7.064,,-2.876,-0.87,-5.479,10.148,-9.006,11.981,-3.603,,-6.063,-0.152,-2.575,-4.598,,-10.062,-3.848,0.882,-3.349,-6.556,-7.892,,9.025,-4.105,,-3.712,-1.027,-17.91,3.036,19.699,-2.258,6.961,-0.061,-0.189,-5.441,,2.45,2.178,0.752,,6.674,10.427,-1.769,0.15,-3.059,-2.123,,-0.862,-0.837,-0.017,0.0,2.984,-1.386,2.966,-3.277,-4.095,2.987,-4.478,3.368,-41.881,-1.262,5.839,-1.899,18.22,,-3.982,-20.873,-9.732,,-22.342,,3.677,-41.357,-8.927,-2.453,-0.567,-1.747,3.596,-5.317,,1.367,-1.045,,-0.32,-5.825,-2.094,-8.41,,2.212,0.0,-22.989,-5.302,3.232,-0.427,,-1.434,4.259,1.165,0.291,-1.263,3.452,-2.989,,-16.186,-0.022,,-8.748,-1.104,-1.205,,-16.822,9.132,4.36,-3.502,-5.461
2000,16.183,-8.923,2.634,,-11.509,,35.926,-0.714,-14.244,,6.826,4.201,1.621,-2.814,-14.728,0.994,-0.089,,-2.535,-1.186,-3.269,12.759,-2.076,-8.405,1.126,10.486,,-1.604,0.0,-2.711,2.658,0.051,4.683,1.748,5.245,1.845,0.26,-0.061,2.349,-0.659,-4.322,3.38,,-1.362,-2.358,-2.671,4.77,-2.414,-24.747,,11.844,0.891,1.762,2.964,,2.821,-3.687,-1.1,-1.16,-0.643,-11.564,21.448,4.62,-0.169,-0.505,0.86,-9.756,,0.663,,-23.799,1.654,1.757,-27.996,-1.4,,-4.67,-1.442,-0.747,-7.19,12.694,5.451,-7.806,,-7.295,8.784,-5.472,-22.983,11.841,-2.117,-8.32,-3.578,1.528,-0.066,,-0.135,4.603,-0.687,-0.164,0.744,8.748,-1.048,-7.191,-6.184,-0.158,-16.403,-0.143,-1.15,6.111,-6.911,,0.688,26.513,-5.3,-1.597,37.845,-2.226,-2.03,,-4.988,-3.786,-5.27,9.447,-3.81,13.704,-3.819,,-7.74,-0.116,-0.825,-4.82,,-0.498,-2.765,3.311,-2.375,-6.998,-4.469,,-0.602,-3.56,,1.344,-1.531,-1.127,4.731,6.821,-2.475,6.893,-0.191,-0.165,-5.967,,2.275,2.652,-4.084,,2.261,-17.295,0.708,0.679,-2.016,-2.57,,-0.945,-0.443,-1.683,-0.124,3.406,-1.746,4.792,3.037,10.672,2.764,-5.151,3.224,36.164,-3.562,-4.693,-4.923,17.026,,-2.739,-6.75,-11.352,,0.0,,-10.24,10.603,-13.946,-4.465,-0.11,0.149,1.32,-5.351,,-0.647,-1.691,,1.808,3.497,2.339,-7.921,,-2.965,-18.875,-17.397,-5.435,-0.845,-0.329,,-2.308,-2.538,-1.634,-1.854,-1.589,6.48,-2.041,,-14.774,-0.039,,-7.285,-0.558,-8.365,,-19.902,-1.238,2.962,0.41,-9.01
2005,13.124,6.411,2.915,,-11.375,,61.62,-0.66,-10.611,,0.64,6.018,4.365,0.877,-0.719,4.216,0.674,,-1.998,-2.239,-2.18,40.032,7.627,-0.319,-0.131,4.366,,-1.761,0.0,-2.328,0.242,1.991,3.129,-1.271,6.706,5.124,0.537,-0.3,-3.447,-0.65,-0.948,3.051,,-1.123,-3.466,-4.425,2.027,-2.602,-9.257,,11.676,0.923,2.023,-2.398,,1.721,-3.473,-1.279,-1.811,-0.206,17.76,48.215,13.711,-2.673,-0.421,1.223,-14.357,,3.085,,-23.01,3.791,3.329,-6.922,0.243,,-8.069,-18.484,0.212,-4.388,14.753,2.037,-6.768,,-4.543,18.899,-12.184,-16.947,1.938,-1.197,-0.117,-3.171,1.213,-1.05,,-0.343,10.17,-0.143,-2.113,2.044,3.3,5.79,-6.825,-3.45,0.257,0.587,0.147,-6.919,-0.553,-4.386,,0.338,2.456,-5.349,25.762,-3.297,-0.737,-1.005,,-4.692,-16.006,-5.79,6.476,-6.254,20.33,-4.421,,-0.578,-0.088,11.614,-4.307,,-1.423,-1.132,2.811,-5.051,-2.601,-1.219,,0.314,-0.708,,-2.044,-3.219,-0.995,5.494,0.244,-0.101,3.526,-0.152,-0.26,-6.624,,1.809,2.952,-6.219,,6.736,1.255,-0.859,1.014,-6.699,-3.029,,-2.736,-0.954,-7.983,-0.147,3.429,-1.692,-11.173,0.062,58.692,-0.233,-4.3,2.452,-1.731,6.727,-3.751,-3.878,4.474,,-3.827,19.55,-10.479,,0.0,,-5.917,12.581,-11.21,-3.761,0.044,1.506,3.163,-9.394,,6.211,-4.37,,4.747,-1.253,1.165,-4.458,,-5.431,-5.931,-15.758,-2.729,-2.888,-0.122,,1.836,-1.671,-1.948,-0.691,-6.264,3.7,-1.893,,-9.793,-0.18,,-9.74,-1.59,-2.612,,-17.665,-1.196,3.399,-2.694,-11.651
2010,-0.875,-7.632,3.34,,-14.407,,109.374,-0.602,-12.519,,4.453,11.441,3.691,1.22,0.748,5.478,-1.136,,-1.723,-4.542,-2.217,51.079,8.553,-3.172,1.347,5.755,,-1.404,0.0,-0.178,-1.198,-3.289,2.845,-5.964,8.001,9.078,1.289,-0.323,-2.057,-0.567,-0.146,4.649,,-0.888,-3.074,-4.747,1.369,-4.269,22.0,,10.963,4.826,0.106,-3.011,,3.206,-3.273,-2.068,-0.624,-0.717,-5.337,2.306,10.0,-2.255,-0.122,2.167,-5.636,,1.439,,-23.493,8.452,7.077,-5.768,1.288,,-6.454,-6.066,-1.85,-2.441,18.9,-6.707,-6.688,,-1.648,2.756,-12.303,-13.394,2.614,-0.634,-0.482,-2.883,0.503,-1.14,,-0.446,9.075,-1.608,-7.78,7.805,7.888,3.574,-6.293,19.958,0.432,-0.445,-0.963,-2.919,-4.292,-0.604,,-0.637,36.449,-3.675,-1.114,9.879,-3.953,5.167,,-5.226,-9.267,-9.334,17.512,-7.925,16.602,-3.6,,-2.324,-0.076,10.502,-1.022,,-0.716,-1.449,2.802,-5.372,-0.22,-0.839,,-0.363,0.614,,-7.129,-1.956,-0.871,5.654,-2.068,0.859,1.392,-0.266,-0.404,-5.505,,0.795,6.868,-7.366,,2.935,19.234,-0.4,1.276,-8.456,-3.435,,1.118,-0.931,-7.657,-0.204,1.746,-3.907,-5.432,-6.869,134.414,-3.063,-7.397,3.241,-1.69,8.377,-6.002,-3.669,30.706,,-5.715,1.99,-9.339,,-3.557,,-2.63,19.868,-4.015,-2.522,-0.328,3.897,5.697,-7.296,,-6.058,3.726,,1.361,-0.352,0.178,-4.073,,-2.549,-7.292,-15.152,-2.835,-0.784,-0.143,,2.179,-2.42,-3.327,1.163,-2.994,3.595,-1.02,,-10.505,-1.46,,-11.721,-1.863,-2.941,,-16.501,-0.608,3.48,-2.749,-8.278
2015,2.433,3.282,1.298,,-9.358,,6.063,0.143,-2.105,,2.077,8.587,6.254,0.182,-1.487,4.655,-0.855,,-1.483,-3.037,-0.669,6.43,2.742,-14.494,1.53,4.445,,-1.102,0.016,-0.28,-0.449,0.085,-7.122,-17.844,7.076,9.867,1.869,-0.224,-0.731,-0.33,0.043,-2.629,,-0.834,-2.726,-3.157,0.834,-1.419,8.824,,3.96,1.135,4.769,1.369,,3.801,-3.064,-0.757,-0.487,-0.641,-15.108,1.137,-2.224,-1.589,0.849,3.002,-12.022,,1.331,,-5.664,11.234,4.022,-4.695,-0.38,,-5.434,-7.857,-1.592,-0.86,17.044,-3.004,-1.853,,-0.649,-0.856,-9.454,-9.229,2.117,-0.688,-1.799,-2.906,0.609,-0.363,,-0.369,-4.858,-1.32,7.984,-1.33,0.509,5.462,-3.975,25.575,0.558,1.89,-0.222,-3.281,-2.011,-7.712,,1.599,33.98,-3.458,41.525,1.196,-9.512,0.0,,-4.71,-4.706,-9.658,18.129,-8.097,14.856,-2.191,,-0.344,-0.066,28.445,-0.716,,-0.853,-3.724,7.315,-2.046,-0.995,-0.298,,-0.198,1.326,,-11.711,-1.927,-1.026,1.71,-1.337,-3.341,2.29,0.207,-0.353,-4.483,,0.746,8.797,-15.105,,4.047,48.478,-1.139,1.477,-4.201,-1.703,,-0.104,-1.68,-13.946,-0.217,-2.671,-2.694,-7.318,-5.943,54.713,-3.339,-2.971,2.497,-2.02,11.653,-2.931,-3.141,11.826,,-2.829,-0.618,-7.688,,-3.613,,0.662,-1.978,-8.847,-1.838,0.419,1.611,5.303,-7.702,,-2.148,-54.746,,1.535,-0.291,0.492,-3.428,,-1.878,-4.896,-25.379,-0.593,-2.75,4.675,,1.455,-1.045,-1.698,0.583,-1.772,3.151,-0.447,,-5.398,-2.946,,-8.531,-0.886,1.407,,-12.849,-0.604,3.451,-0.678,-9.399
2020,1.902,-1.716,0.211,,-4.854,,4.177,0.109,-1.697,,0.0,6.403,7.351,0.121,0.181,4.196,-0.176,,-1.282,-2.303,-0.679,31.105,2.606,-6.434,0.924,3.164,,-0.843,0.102,-0.277,0.0,0.427,1.341,-8.581,6.562,6.135,6.024,-0.245,-0.323,-0.193,0.288,-0.771,,4.162,-2.429,-2.483,0.845,-1.271,3.177,,4.222,2.066,6.569,0.947,,2.648,-2.84,-0.239,2.15,-0.391,-11.571,9.936,0.856,2.961,0.278,2.54,-7.027,,0.563,,-5.357,1.562,3.898,-2.496,-0.339,,-0.326,-3.598,-1.371,-0.755,12.443,-1.518,-1.801,,-0.539,4.288,-3.063,-7.722,3.992,-0.715,-1.919,-3.168,0.617,-0.372,,-0.396,4.923,-0.677,0.207,1.132,1.202,2.461,-3.873,1.05,0.562,-0.99,-0.197,-0.641,-1.861,-6.943,,0.23,9.751,-2.098,-4.493,-1.049,-0.301,0.0,,-4.631,-4.783,-11.595,16.334,-7.64,7.991,-1.437,,-0.342,-0.058,22.844,-0.478,,-0.48,-2.123,2.057,-3.05,-0.765,-0.272,,-0.172,1.15,,-2.547,0.0,-0.895,1.596,0.0,-1.979,1.804,0.181,-0.31,-3.311,,0.939,5.273,1.486,,3.154,18.647,-1.11,2.704,3.123,-0.634,,-0.094,-0.775,-31.394,-0.212,-0.584,-2.396,-2.194,-3.61,14.688,-1.428,-3.779,1.254,-0.74,4.058,-1.208,-1.277,4.724,,-2.48,-0.554,-6.329,,-2.694,,0.454,-15.902,-8.028,-1.745,0.273,0.964,4.027,-7.378,,-2.069,-24.08,,0.131,-0.256,0.281,-2.223,,-0.862,-4.283,-7.747,-0.578,-0.348,3.487,,1.267,-0.721,4.018,0.226,-0.871,2.929,-0.275,,-1.817,-22.327,,-4.306,-0.842,0.415,,-14.302,-1.065,2.536,-0.467,-8.15
2025,1.49,-1.455,0.0,,-4.896,,0.433,0.082,-1.683,,0.0,5.173,2.209,0.0,0.156,2.056,-0.154,,-1.114,-2.065,-0.704,8.411,2.487,-0.154,0.319,2.65,,-0.63,0.028,-0.276,0.0,0.379,1.22,-3.147,6.094,4.548,-3.754,-0.256,0.0,-0.17,0.0,-0.34,,-3.473,-2.18,-2.182,0.731,-0.974,3.102,,4.078,2.051,1.727,0.881,,2.6,-2.631,-0.219,-1.201,-0.374,-4.317,8.821,0.857,-0.759,-0.098,2.52,-3.738,,0.963,,-5.08,0.424,2.24,-2.526,-0.305,,-0.284,-3.002,-1.188,-0.67,7.894,-0.778,-1.761,,-0.486,3.773,-2.943,-6.283,3.147,-0.505,-0.494,-2.724,0.626,-0.376,,-0.329,1.991,-0.463,0.46,1.098,1.113,1.951,-3.792,-14.015,0.516,0.0,-0.176,-1.478,-1.738,-3.214,,0.39,3.186,-1.954,-24.568,-0.93,-0.283,0.0,,-4.029,-3.662,-5.269,7.77,-4.342,7.445,-1.054,,-0.346,-0.051,-16.273,-0.416,,-0.481,-1.832,1.8,-0.721,-0.765,-0.251,,-0.149,0.805,,-1.715,0.0,-0.301,1.499,0.0,-1.501,1.718,0.038,-0.273,-2.352,,1.161,5.058,5.07,,2.523,4.12,-0.874,1.698,-1.891,-0.593,,-0.085,-0.265,6.938,-0.143,0.79,-2.098,-0.924,-1.755,8.663,-0.69,-0.789,0.621,-0.654,1.504,-0.215,-1.117,4.532,,-2.191,-0.477,-5.189,,-1.751,,-1.16,-2.114,-6.077,-1.669,0.183,0.963,2.929,-4.596,,-2.009,37.627,,0.0,-0.227,0.275,-1.99,,-0.642,-3.617,-7.397,-0.569,-0.331,-3.731,,1.005,-0.623,-2.367,0.093,-0.794,2.748,-0.257,,-1.792,10.853,,-4.347,-0.935,0.0,,-7.455,-0.953,1.84,-0.404,-3.959
2030,1.18,-1.441,-0.024,,-3.909,,-0.578,0.064,-1.682,,0.0,5.081,2.188,0.0,0.135,2.029,-0.136,,-0.973,-1.879,-0.733,6.704,2.387,-0.158,0.322,2.219,,-0.478,0.027,-0.275,0.0,0.363,1.123,-1.241,6.049,4.415,-1.488,-0.241,0.189,-0.15,-0.134,-0.151,,-0.751,-1.972,-1.562,0.594,-0.536,3.041,,3.969,2.047,1.791,0.829,,2.554,-2.423,-0.205,-0.453,-0.344,-2.467,7.942,0.862,-0.773,-0.087,2.511,-1.801,,0.983,,-4.841,0.382,2.269,-2.57,-0.277,,-0.25,-2.001,-1.038,-0.599,5.127,0.399,-1.736,,-0.443,3.356,-2.841,-4.918,4.62,-0.325,-0.508,-2.417,0.636,-0.341,,-0.299,1.931,-0.441,-0.262,1.069,1.036,1.568,-3.738,-9.125,0.381,0.0,-0.158,-1.384,-1.64,-2.978,,0.585,3.022,-1.838,-15.729,-0.829,-0.269,0.0,,-3.768,-1.757,-2.364,5.919,-2.274,7.014,-1.001,,-0.353,-0.045,-8.708,-0.362,,-0.485,-1.588,1.339,-0.348,-0.767,-0.236,,-0.13,0.533,,-1.733,0.0,-0.257,1.324,0.0,-1.145,1.646,0.031,-0.242,-1.111,,1.15,4.858,0.442,,2.436,2.085,-0.697,0.947,-0.72,-0.614,,-0.078,-0.269,3.441,-0.077,1.001,-1.814,-0.829,-0.683,6.513,-0.668,-0.432,0.646,-0.584,1.461,-0.191,-0.985,4.38,,-1.953,-0.433,-4.219,,-1.516,,-1.194,-1.141,-3.923,-1.608,0.184,0.969,2.855,-2.537,,-1.967,14.556,,-0.098,-0.203,0.266,-1.808,,-0.605,-3.311,-7.072,-0.566,-0.319,-2.378,,1.0,-0.542,-1.074,0.096,-0.696,2.847,-0.243,,-1.775,4.125,,-4.427,-0.858,0.0,,-7.074,-0.776,1.425,-0.22,-1.187
2035,0.938,-1.239,-0.021,,-2.905,,-5.267,0.048,-1.692,,0.0,5.063,2.175,0.0,0.119,2.006,-0.12,,-0.855,-1.716,-0.764,2.904,2.307,-0.163,0.327,1.866,,-0.37,0.009,-0.275,0.0,0.351,1.044,-0.799,6.084,4.187,1.627,-0.213,0.168,-0.134,-0.117,-0.134,,-0.402,-1.796,-1.126,0.47,-0.542,2.994,,3.882,2.054,1.876,0.787,,2.515,-2.21,-0.193,-0.216,-0.239,-1.572,7.245,0.869,-0.791,-0.079,2.51,-1.738,,1.016,,-4.651,0.348,2.327,-2.623,-0.253,,-0.221,-1.998,-0.914,-0.54,3.015,1.019,-1.723,,-0.407,3.013,-2.759,-4.73,2.479,-0.254,-0.524,-1.994,0.65,-0.31,,-0.272,1.883,-0.424,-0.19,1.046,0.97,1.659,-3.712,-3.201,0.409,0.0,-0.143,-1.306,-1.56,-2.784,,0.589,2.473,-1.745,-5.468,-0.743,-0.258,0.0,,-3.528,-1.686,-1.233,5.679,-1.189,6.688,-0.959,,-0.362,-0.04,0.617,-0.349,,-0.492,-1.385,0.894,-0.337,-0.773,-0.224,,-0.114,0.474,,-1.754,0.0,-0.227,1.32,0.0,-0.878,1.586,0.026,-0.224,-1.057,,1.144,4.682,-1.843,,2.364,0.0,-0.609,0.677,-0.332,-0.55,,-0.072,-0.274,-3.506,-0.076,1.017,-1.547,-0.751,-0.333,4.982,-0.65,-0.443,0.683,-0.527,1.451,-0.171,-0.874,4.274,,-1.751,-0.397,-3.972,,-1.32,,-1.233,-0.343,-3.182,-1.559,0.186,0.978,2.796,1.482,,-1.938,1.618,,-0.086,-0.182,0.266,-1.653,,-0.576,-3.058,-6.766,-0.567,-0.31,-0.746,,1.002,-0.473,-0.633,0.0,-0.602,2.956,-0.232,,-1.769,-0.292,,-4.542,-0.79,0.0,,-6.721,-0.71,1.128,-0.192,-0.543
2040,0.751,-1.139,-0.018,,-2.988,,-6.046,0.031,-1.71,,0.0,4.86,2.171,0.0,0.105,1.988,-0.107,,-0.756,-1.673,-0.799,1.852,2.245,-0.168,0.332,1.561,,-0.282,0.009,-0.276,0.0,0.342,0.977,-0.726,5.894,4.105,1.199,-0.214,0.15,-0.121,-0.102,-0.12,,-0.356,-1.646,-0.817,0.354,-0.552,2.96,,3.81,2.065,1.888,0.754,,2.486,-2.021,-0.184,-0.126,-0.222,-1.432,6.684,0.854,-0.81,-0.071,2.517,-1.686,,1.009,,-4.513,0.319,2.294,-2.681,-0.232,,-0.197,-2.002,-0.814,-0.489,2.695,1.04,-1.718,,-0.377,2.728,-2.699,-4.691,2.46,-0.193,-0.542,-1.468,0.665,-0.301,,-0.264,1.841,-0.411,-0.104,1.029,0.91,1.686,-3.713,-0.346,0.422,0.0,-0.131,-1.236,-1.492,-2.618,,0.597,2.374,-1.671,-0.634,-0.671,-0.249,0.0,,-3.515,-1.624,-0.857,5.47,-0.619,6.435,-0.925,,-0.374,-0.036,0.596,-0.338,,-0.502,-1.217,0.903,-0.33,-0.781,-0.213,,-0.1,0.425,,-1.783,0.0,-0.202,1.273,0.0,-0.676,1.535,0.022,-0.2,-1.013,,1.144,4.532,-1.803,,2.307,0.0,-0.569,0.489,-0.26,-0.525,,-0.066,-0.28,-2.733,-0.076,1.036,-1.486,-0.686,-0.328,3.368,-0.636,-0.456,0.694,-0.479,0.93,-0.155,-0.779,4.213,,-1.576,-0.366,-3.37,,-1.157,,-1.278,-0.311,-2.557,-1.522,0.19,0.99,2.748,1.375,,-1.918,-0.341,,-0.077,-0.164,0.269,-1.51,,-0.551,-2.853,-6.487,-0.572,-0.303,-0.645,,1.01,-0.416,-0.424,0.0,-0.537,2.93,-0.222,,-1.773,-0.639,,-4.69,-0.777,0.0,,-6.389,-0.486,0.851,-0.169,-0.499
2045,0.605,-1.056,-0.016,,-3.096,,-6.28,0.023,-1.732,,0.0,4.689,2.174,0.0,0.093,1.975,-0.096,,-0.674,-1.639,-0.835,1.792,2.201,-0.175,0.339,1.303,,-0.219,0.009,-0.279,0.0,0.337,0.921,-0.666,5.745,4.046,0.791,-0.216,0.135,-0.109,-0.091,-0.108,,-0.317,-1.517,-0.596,0.245,-0.565,2.94,,3.751,2.076,1.909,0.727,,2.463,-1.852,-0.175,-0.121,-0.206,-1.311,6.224,0.867,-0.831,-0.066,2.529,-1.643,,1.007,,-4.417,0.294,2.269,-2.742,-0.214,,-0.178,-1.516,-0.731,-0.446,2.028,1.064,-1.719,,-0.352,2.491,-2.659,-4.688,2.462,-0.123,-0.561,-1.27,0.682,-0.293,,-0.258,1.804,-0.401,-0.095,1.018,0.856,1.377,-3.742,-0.329,0.437,0.0,-0.121,-1.174,-1.436,-2.466,,0.611,2.104,-1.613,-0.623,-0.61,-0.242,0.0,,-3.515,-1.569,-0.892,5.29,-0.643,6.225,-0.897,,-0.388,-0.032,0.577,-0.33,,-0.515,-1.079,0.916,-0.325,-0.793,-0.204,,-0.09,0.383,,-1.829,0.0,-0.182,1.24,0.0,-0.523,1.494,0.019,-0.179,-0.978,,1.149,4.405,-1.775,,2.262,0.0,-0.533,0.36,-0.152,-0.504,,-0.062,-0.287,-1.901,-0.076,1.058,-1.437,-0.632,-0.324,3.254,-0.628,-0.469,0.704,-0.439,0.904,-0.14,-0.7,4.193,,-1.425,-0.34,-3.349,,-1.022,,-1.328,-0.284,-2.032,-1.495,0.194,1.005,2.702,1.283,,-1.907,-0.323,,-0.068,-0.148,0.273,-1.384,,-0.529,-2.684,-6.246,-0.579,-0.297,-0.631,,1.029,-0.368,-0.383,0.0,-0.474,2.903,-0.215,,-1.789,-0.559,,-4.878,-0.766,0.0,,-6.079,-0.454,0.806,-0.15,-0.462
2050,0.492,-0.987,-0.014,,-3.227,,-6.536,0.022,-1.76,,0.0,4.536,2.184,0.0,0.083,1.967,-0.086,,-0.605,-1.616,-0.872,1.746,2.17,-0.182,0.344,1.07,,-0.174,0.009,-0.284,0.0,0.333,0.875,-0.617,5.619,4.0,0.591,-0.219,0.123,-0.099,-0.081,-0.098,,-0.283,-1.408,-0.438,0.208,-0.581,2.93,,3.708,2.084,1.936,0.705,,2.443,-1.73,-0.168,-0.117,-0.193,-1.21,5.842,0.885,-0.852,-0.061,2.544,-1.609,,1.01,,-4.347,0.272,2.25,-2.808,-0.199,,-0.161,-1.025,-0.662,-0.41,1.48,1.092,-1.725,,-0.332,2.291,-2.635,-4.717,2.477,-0.074,-0.583,-1.092,0.7,-0.286,,-0.254,1.774,-0.392,-0.088,1.011,0.808,1.061,-3.795,-0.315,0.453,0.0,-0.113,-1.12,-1.391,-2.328,,0.63,1.683,-1.569,-0.616,-0.558,-0.237,0.0,,-3.533,-1.522,-0.926,5.134,-0.665,6.046,-0.876,,-0.404,-0.029,0.562,-0.325,,-0.53,-0.966,0.93,-0.322,-0.807,-0.195,,-0.08,0.348,,-1.893,0.0,-0.165,1.215,0.0,-0.407,1.462,0.016,-0.162,-0.95,,1.159,4.294,-1.758,,2.227,0.589,-0.502,0.299,-0.148,-0.487,,-0.058,-0.296,-1.993,-0.076,1.086,-1.398,-0.587,-0.322,3.159,-0.623,-0.484,0.714,-0.405,0.885,-0.128,-0.632,4.205,,-1.297,-0.319,-3.348,,-0.908,,-1.383,-0.261,-1.59,-1.477,0.198,1.022,2.657,1.207,,-1.909,-0.309,,-0.062,-0.135,0.28,-1.279,,-0.511,-2.541,-6.048,-0.589,-0.292,-0.622,,1.055,-0.328,-0.35,0.0,-0.412,2.873,-0.209,,-1.816,-0.49,,-5.103,-0.757,0.0,,-5.806,-0.427,0.785,-0.135,-0.431
2055,0.497,-0.935,-0.012,,-3.38,,-6.634,0.022,-1.793,,0.0,4.387,2.199,0.0,0.075,1.963,-0.079,,-0.548,-1.61,-0.911,1.712,2.151,-0.191,0.35,1.035,,-0.168,0.009,-0.29,0.0,0.331,0.838,-0.576,5.491,3.953,0.592,-0.224,0.112,-0.091,-0.073,-0.089,,-0.283,-1.315,-0.432,0.208,-0.602,2.929,,3.682,2.092,1.962,0.687,,2.424,-1.714,-0.161,-0.114,-0.182,-1.126,5.523,0.906,-0.875,-0.056,2.56,-1.582,,1.012,,-4.296,0.254,2.23,-2.882,-0.186,,-0.147,-1.043,-0.606,-0.379,1.362,1.126,-1.741,,-0.317,2.12,-2.624,-4.776,2.498,-0.071,-0.606,-1.063,0.717,-0.282,,-0.251,1.754,-0.385,-0.082,1.008,0.766,1.095,-3.872,-0.305,0.469,0.0,-0.106,-1.075,-1.358,-2.208,,0.654,1.662,-1.539,-0.611,-0.514,-0.233,0.0,,-3.585,-1.483,-0.96,5.0,-0.687,5.894,-0.859,,-0.422,-0.027,0.553,-0.321,,-0.547,-0.873,0.944,-0.321,-0.822,-0.188,,-0.073,0.318,,-1.97,0.0,-0.15,1.193,0.0,-0.384,1.439,0.014,-0.148,-0.929,,1.172,4.195,-1.759,,2.199,0.57,-0.478,0.29,-0.146,-0.475,,-0.055,-0.305,-2.103,-0.077,1.118,-1.368,-0.55,-0.322,3.081,-0.623,-0.5,0.722,-0.377,0.87,-0.118,-0.575,4.24,,-1.187,-0.301,-3.365,,-0.812,,-1.442,-0.241,-1.459,-1.466,0.203,1.041,2.613,1.145,,-1.922,-0.296,,-0.056,-0.124,0.288,-1.193,,-0.497,-2.418,-5.889,-0.603,-0.289,-0.615,,1.088,-0.294,-0.322,0.0,-0.413,2.828,-0.205,,-1.854,-0.484,,-5.366,-0.754,0.0,,-5.582,-0.407,0.767,-0.121,-0.406
2060,0.501,-0.893,-0.011,,-3.556,,-6.762,0.021,-1.835,,0.0,4.251,2.218,0.0,0.068,1.962,-0.072,,-0.5,-1.615,-0.953,1.687,2.139,-0.201,0.357,1.007,,-0.163,0.009,-0.297,0.0,0.332,0.808,-0.542,5.369,3.915,0.595,-0.229,0.103,-0.084,-0.067,-0.082,,-0.285,-1.236,-0.43,0.209,-0.626,2.928,,3.672,2.103,1.989,0.674,,2.403,-1.708,-0.156,-0.111,-0.173,-1.056,5.257,0.935,-0.902,-0.053,2.575,-1.561,,1.016,,-4.265,0.238,2.216,-2.966,-0.175,,-0.136,-1.062,-0.559,-0.352,1.264,1.168,-1.766,,-0.305,1.973,-2.622,-4.865,2.518,-0.069,-0.632,-1.042,0.734,-0.28,,-0.25,1.745,-0.381,-0.077,1.009,0.729,1.135,-3.976,-0.297,0.487,0.0,-0.1,-1.039,-1.335,-2.106,,0.685,1.65,-1.521,-0.61,-0.477,-0.232,0.0,,-3.656,-1.454,-0.996,4.883,-0.71,5.77,-0.848,,-0.442,-0.024,0.55,-0.319,,-0.566,-0.796,0.958,-0.321,-0.839,-0.182,,-0.067,0.292,,-2.053,0.0,-0.138,1.176,0.0,-0.365,1.423,0.013,-0.136,-0.914,,1.185,4.105,-1.774,,2.176,0.554,-0.459,0.283,-0.144,-0.466,,-0.052,-0.315,-2.229,-0.078,1.155,-1.346,-0.518,-0.324,3.02,-0.625,-0.518,0.731,-0.354,0.862,-0.109,-0.527,4.288,,-1.092,-0.285,-3.402,,-0.731,,-1.507,-0.225,-1.347,-1.462,0.208,1.064,2.574,1.095,,-1.945,-0.287,,-0.051,-0.115,0.297,-1.119,,-0.487,-2.315,-5.759,-0.619,-0.287,-0.613,,1.125,-0.265,-0.3,0.0,-0.414,2.784,-0.202,,-1.9,-0.481,,-5.664,-0.755,0.0,,-5.403,-0.391,0.754,-0.11,-0.386
2065,0.503,-0.861,-0.01,,-3.756,,-6.914,0.021,-1.886,,0.0,4.127,2.237,0.0,0.062,1.962,-0.066,,-0.46,-1.63,-0.998,1.67,2.132,-0.211,0.364,0.985,,-0.159,0.009,-0.304,0.0,0.335,0.785,-0.513,5.246,3.88,0.601,-0.236,0.095,-0.078,-0.061,-0.075,,-0.288,-1.169,-0.43,0.211,-0.653,2.925,,3.674,2.121,2.013,0.666,,2.38,-1.711,-0.152,-0.109,-0.165,-0.995,5.034,0.969,-0.932,-0.05,2.587,-1.548,,1.02,,-4.263,0.225,2.204,-3.059,-0.165,,-0.126,-1.078,-0.52,-0.33,1.183,1.215,-1.801,,-0.295,1.846,-2.628,-4.984,2.537,-0.068,-0.66,-1.028,0.753,-0.279,,-0.251,1.744,-0.381,-0.072,1.011,0.697,1.181,-4.108,-0.291,0.506,0.0,-0.095,-1.009,-1.319,-2.021,,0.721,1.638,-1.514,-0.611,-0.446,-0.232,0.0,,-3.744,-1.432,-1.036,4.778,-0.735,5.666,-0.841,,-0.466,-0.023,0.552,-0.318,,-0.588,-0.732,0.973,-0.323,-0.857,-0.178,,-0.061,0.27,,-2.134,0.0,-0.128,1.165,0.0,-0.349,1.411,0.011,-0.125,-0.905,,1.197,4.021,-1.804,,2.155,0.544,-0.444,0.277,-0.143,-0.459,,-0.05,-0.327,-2.369,-0.079,1.195,-1.332,-0.492,-0.328,2.976,-0.628,-0.537,0.74,-0.335,0.861,-0.102,-0.486,4.344,,-1.011,-0.273,-3.461,,-0.663,,-1.58,-0.211,-1.251,-1.462,0.214,1.088,2.539,1.054,,-1.973,-0.281,,-0.047,-0.107,0.308,-1.052,,-0.48,-2.233,-5.651,-0.638,-0.287,-0.614,,1.165,-0.241,-0.281,0.0,-0.417,2.74,-0.2,,-1.954,-0.479,,-5.993,-0.759,0.0,,-5.254,-0.379,0.745,-0.101,-0.37
2070,0.504,-0.837,-0.009,,-3.988,,-7.075,0.021,-1.946,,0.0,4.013,2.253,0.0,0.058,1.96,-0.061,,-0.426,-1.655,-1.046,1.66,2.128,-0.221,0.371,0.969,,-0.157,0.009,-0.311,0.0,0.341,0.766,-0.49,5.123,3.843,0.609,-0.243,0.088,-0.073,-0.057,-0.07,,-0.292,-1.112,-0.433,0.214,-0.682,2.918,,3.686,2.143,2.033,0.661,,2.355,-1.722,-0.15,-0.108,-0.158,-0.944,4.844,1.006,-0.965,-0.048,2.596,-1.539,,1.024,,-4.296,0.214,2.193,-3.158,-0.157,,-0.118,-1.091,-0.487,-0.312,1.116,1.265,-1.846,,-0.288,1.736,-2.642,-5.136,2.558,-0.067,-0.691,-1.02,0.773,-0.279,,-0.252,1.749,-0.383,-0.069,1.014,0.67,1.227,-4.271,-0.287,0.528,0.0,-0.091,-0.985,-1.312,-1.948,,0.758,1.618,-1.518,-0.616,-0.419,-0.233,0.0,,-3.849,-1.419,-1.077,4.677,-0.762,5.574,-0.838,,-0.493,-0.021,0.559,-0.319,,-0.613,-0.679,0.99,-0.325,-0.878,-0.174,,-0.057,0.251,,-2.208,0.0,-0.12,1.16,0.0,-0.336,1.403,0.01,-0.117,-0.902,,1.207,3.942,-1.849,,2.134,0.538,-0.432,0.273,-0.142,-0.455,,-0.047,-0.34,-2.521,-0.08,1.235,-1.327,-0.471,-0.332,2.945,-0.633,-0.556,0.75,-0.319,0.865,-0.095,-0.451,4.406,,-0.94,-0.263,-3.543,,-0.606,,-1.661,-0.199,-1.168,-1.469,0.221,1.112,2.505,1.021,,-2.003,-0.278,,-0.044,-0.1,0.32,-0.995,,-0.475,-2.172,-5.564,-0.66,-0.288,-0.618,,1.207,-0.22,-0.266,0.0,-0.421,2.696,-0.2,,-2.017,-0.48,,-6.351,-0.768,0.0,,-5.122,-0.371,0.739,-0.093,-0.357
2075,0.506,-0.82,-0.008,,-4.269,,-7.224,0.021,-2.014,,0.0,3.907,2.269,0.0,0.053,1.957,-0.057,,-0.396,-1.69,-1.094,1.658,2.127,-0.232,0.378,0.958,,-0.155,0.009,-0.319,0.0,0.35,0.751,-0.471,5.006,3.803,0.619,-0.25,0.082,-0.068,-0.053,-0.065,,-0.297,-1.064,-0.438,0.217,-0.711,2.91,,3.703,2.163,2.049,0.66,,2.329,-1.742,-0.148,-0.107,-0.152,-0.9,4.68,1.044,-1.001,-0.046,2.604,-1.536,,1.027,,-4.367,0.205,2.182,-3.263,-0.15,,-0.111,-1.102,-0.461,-0.296,1.061,1.313,-1.9,,-0.282,1.641,-2.666,-5.324,2.582,-0.067,-0.723,-1.018,0.793,-0.279,,-0.255,1.753,-0.386,-0.066,1.019,0.645,1.27,-4.469,-0.284,0.55,0.0,-0.088,-0.964,-1.313,-1.884,,0.798,1.588,-1.531,-0.624,-0.396,-0.234,0.0,,-3.972,-1.412,-1.118,4.579,-0.787,5.488,-0.839,,-0.523,-0.02,0.571,-0.321,,-0.64,-0.634,1.012,-0.329,-0.902,-0.171,,-0.053,0.235,,-2.276,0.0,-0.113,1.162,0.0,-0.325,1.397,0.009,-0.109,-0.904,,1.215,3.864,-1.912,,2.115,0.535,-0.423,0.27,-0.143,-0.453,,-0.046,-0.355,-2.688,-0.081,1.274,-1.329,-0.454,-0.337,2.925,-0.638,-0.576,0.759,-0.306,0.871,-0.09,-0.42,4.472,,-0.879,-0.255,-3.652,,-0.557,,-1.751,-0.189,-1.096,-1.48,0.229,1.135,2.471,0.994,,-2.034,-0.276,,-0.041,-0.094,0.332,-0.947,,-0.471,-2.128,-5.506,-0.684,-0.29,-0.625,,1.253,-0.202,-0.253,0.0,-0.426,2.656,-0.2,,-2.089,-0.483,,-6.745,-0.778,0.0,,-5.006,-0.366,0.735,-0.086,-0.345
2080,0.508,-0.81,-0.007,,-4.617,,-7.347,0.021,-2.088,,0.0,3.809,2.283,0.0,0.05,1.952,-0.053,,-0.372,-1.735,-1.141,1.664,2.13,-0.244,0.385,0.952,,-0.153,0.01,-0.327,0.0,0.361,0.74,-0.457,4.897,3.762,0.63,-0.258,0.077,-0.065,-0.05,-0.061,,-0.305,-1.023,-0.445,0.222,-0.741,2.905,,3.726,2.174,2.063,0.66,,2.304,-1.77,-0.146,-0.107,-0.147,-0.864,4.534,1.077,-1.038,-0.044,2.614,-1.537,,1.029,,-4.469,0.196,2.172,-3.373,-0.144,,-0.105,-1.111,-0.438,-0.282,1.015,1.358,-1.962,,-0.278,1.557,-2.702,-5.554,2.61,-0.067,-0.756,-1.022,0.812,-0.28,,-0.259,1.755,-0.39,-0.063,1.027,0.622,1.309,-4.707,-0.283,0.571,0.0,-0.086,-0.946,-1.32,-1.827,,0.838,1.554,-1.553,-0.635,-0.377,-0.236,0.0,,-4.113,-1.412,-1.156,4.484,-0.811,5.406,-0.844,,-0.555,-0.018,0.586,-0.325,,-0.669,-0.597,1.036,-0.333,-0.927,-0.168,,-0.05,0.22,,-2.344,0.0,-0.107,1.168,0.0,-0.316,1.394,0.008,-0.103,-0.91,,1.224,3.792,-1.994,,2.099,0.535,-0.417,0.268,-0.144,-0.453,,-0.044,-0.37,-2.873,-0.082,1.308,-1.338,-0.44,-0.343,2.911,-0.644,-0.594,0.765,-0.295,0.879,-0.085,-0.394,4.538,,-0.825,-0.249,-3.792,,-0.516,,-1.848,-0.18,-1.033,-1.496,0.236,1.154,2.439,0.974,,-2.066,-0.275,,-0.039,-0.089,0.345,-0.907,,-0.469,-2.098,-5.482,-0.708,-0.292,-0.634,,1.302,-0.187,-0.243,0.0,-0.432,2.621,-0.201,,-2.172,-0.487,,-7.199,-0.79,0.0,,-4.914,-0.364,0.733,-0.08,-0.337
2085,0.511,-0.806,-0.007,,-5.051,,-7.438,0.021,-2.164,,0.0,3.716,2.298,0.0,0.047,1.947,-0.05,,-0.351,-1.789,-1.185,1.677,2.137,-0.257,0.39,0.95,,-0.153,0.01,-0.336,0.0,0.375,0.731,-0.446,4.795,3.72,0.643,-0.265,0.073,-0.061,-0.047,-0.057,,-0.313,-0.99,-0.453,0.228,-0.773,2.905,,3.752,2.176,2.076,0.661,,2.282,-1.806,-0.144,-0.107,-0.143,-0.835,4.402,1.104,-1.075,-0.043,2.626,-1.542,,1.031,,-4.595,0.189,2.162,-3.489,-0.139,,-0.1,-1.121,-0.419,-0.271,0.977,1.398,-2.03,,-0.276,1.484,-2.75,-5.837,2.634,-0.067,-0.791,-1.029,0.829,-0.282,,-0.264,1.753,-0.394,-0.061,1.036,0.602,1.344,-4.986,-0.283,0.59,0.0,-0.084,-0.932,-1.332,-1.777,,0.879,1.522,-1.583,-0.648,-0.36,-0.238,0.0,,-4.275,-1.417,-1.191,4.392,-0.831,5.324,-0.851,,-0.587,-0.017,0.604,-0.329,,-0.699,-0.567,1.06,-0.339,-0.954,-0.165,,-0.047,0.208,,-2.415,0.0,-0.102,1.177,0.0,-0.308,1.393,0.008,-0.097,-0.921,,1.234,3.726,-2.097,,2.087,0.537,-0.412,0.266,-0.145,-0.455,,-0.043,-0.386,-3.08,-0.084,1.338,-1.353,-0.429,-0.351,2.903,-0.652,-0.612,0.768,-0.287,0.887,-0.081,-0.372,4.597,,-0.779,-0.245,-3.966,,-0.482,,-1.953,-0.173,-0.98,-1.518,0.243,1.168,2.409,0.958,,-2.1,-0.274,,-0.037,-0.085,0.357,-0.873,,-0.467,-2.082,-5.494,-0.733,-0.295,-0.645,,1.35,-0.174,-0.235,0.0,-0.44,2.589,-0.202,,-2.266,-0.494,,-7.75,-0.802,0.0,,-4.855,-0.363,0.732,-0.074,-0.331
2090,0.515,-0.807,-0.006,,-5.581,,-7.501,0.021,-2.241,,0.0,3.626,2.308,0.0,0.044,1.94,-0.048,,-0.333,-1.852,-1.227,1.699,2.148,-0.27,0.395,0.952,,-0.153,0.01,-0.345,0.0,0.39,0.726,-0.439,4.698,3.672,0.657,-0.273,0.069,-0.059,-0.045,-0.054,,-0.323,-0.962,-0.462,0.234,-0.808,2.912,,3.777,2.169,2.084,0.664,,2.262,-1.85,-0.143,-0.107,-0.14,-0.812,4.283,1.125,-1.11,-0.042,2.64,-1.552,,1.034,,-4.74,0.182,2.153,-3.611,-0.134,,-0.096,-1.134,-0.404,-0.262,0.945,1.433,-2.105,,-0.276,1.42,-2.812,-6.18,2.646,-0.067,-0.825,-1.04,0.844,-0.284,,-0.269,1.75,-0.397,-0.059,1.047,0.585,1.378,-5.307,-0.285,0.608,0.0,-0.082,-0.921,-1.348,-1.736,,0.919,1.497,-1.621,-0.661,-0.347,-0.241,0.0,,-4.461,-1.429,-1.224,4.3,-0.85,5.237,-0.86,,-0.617,-0.017,0.624,-0.335,,-0.728,-0.542,1.081,-0.345,-0.982,-0.162,,-0.045,0.197,,-2.494,0.0,-0.098,1.187,0.0,-0.302,1.396,0.007,-0.093,-0.935,,1.244,3.665,-2.221,,2.08,0.54,-0.41,0.266,-0.146,-0.459,,-0.042,-0.401,-3.318,-0.085,1.366,-1.373,-0.42,-0.359,2.899,-0.661,-0.63,0.77,-0.28,0.895,-0.077,-0.352,4.647,,-0.739,-0.242,-4.179,,-0.452,,-2.064,-0.168,-0.934,-1.544,0.249,1.178,2.38,0.946,,-2.138,-0.274,,-0.035,-0.081,0.371,-0.843,,-0.468,-2.076,-5.541,-0.759,-0.298,-0.657,,1.394,-0.163,-0.229,0.0,-0.448,2.561,-0.204,,-2.371,-0.501,,-8.441,-0.815,0.0,,-4.83,-0.365,0.732,-0.07,-0.326
2095,0.52,-0.812,-0.006,,-6.209,,-7.549,0.021,-2.321,,0.0,3.538,2.311,0.0,0.042,1.933,-0.045,,-0.319,-1.924,-1.269,1.727,2.159,-0.284,0.398,0.957,,-0.154,0.011,-0.355,0.0,0.408,0.722,-0.434,4.601,3.619,0.671,-0.28,0.066,-0.056,-0.043,-0.051,,-0.333,-0.94,-0.472,0.24,-0.844,2.922,,3.799,2.159,2.088,0.668,,2.243,-1.903,-0.142,-0.108,-0.137,-0.793,4.176,1.144,-1.143,-0.041,2.652,-1.568,,1.037,,-4.91,0.177,2.142,-3.744,-0.131,,-0.093,-1.149,-0.392,-0.254,0.919,1.467,-2.185,,-0.276,1.364,-2.886,-6.595,2.643,-0.068,-0.861,-1.055,0.857,-0.287,,-0.275,1.75,-0.4,-0.057,1.058,0.57,1.412,-5.673,-0.287,0.625,0.0,-0.081,-0.915,-1.367,-1.705,,0.959,1.478,-1.665,-0.676,-0.335,-0.244,0.0,,-4.677,-1.446,-1.258,4.205,-0.868,5.131,-0.872,,-0.646,-0.016,0.642,-0.342,,-0.756,-0.521,1.099,-0.351,-1.012,-0.16,,-0.043,0.188,,-2.583,0.0,-0.094,1.199,0.0,-0.297,1.401,0.007,-0.089,-0.952,,1.255,3.607,-2.365,,2.073,0.543,-0.409,0.266,-0.148,-0.464,,-0.041,-0.415,-3.595,-0.087,1.393,-1.397,-0.414,-0.368,2.895,-0.674,-0.647,0.771,-0.275,0.905,-0.074,-0.336,4.685,,-0.706,-0.24,-4.429,,-0.427,,-2.182,-0.163,-0.895,-1.576,0.254,1.184,2.35,0.939,,-2.182,-0.274,,-0.034,-0.078,0.385,-0.818,,-0.47,-2.082,-5.619,-0.784,-0.302,-0.672,,1.432,-0.153,-0.224,0.0,-0.457,2.534,-0.206,,-2.487,-0.51,,-9.324,-0.828,0.0,,-4.838,-0.368,0.734,-0.066,-0.324
2100,0.524,-0.822,-0.005,,-6.936,,-7.585,0.021,-2.406,,0.0,3.453,2.308,0.0,0.04,1.925,-0.043,,-0.306,-2.005,-1.314,1.759,2.169,-0.298,0.402,0.963,,-0.155,0.011,-0.365,0.0,0.427,0.72,-0.431,4.503,3.563,0.685,-0.287,0.063,-0.054,-0.042,-0.049,,-0.344,-0.922,-0.483,0.247,-0.88,2.934,,3.814,2.148,2.089,0.673,,2.222,-1.964,-0.141,-0.109,-0.134,-0.779,4.079,1.164,-1.176,-0.041,2.661,-1.589,,1.041,,-5.113,0.173,2.13,-3.895,-0.128,,-0.09,-1.17,-0.382,-0.248,0.897,1.501,-2.273,,-0.278,1.316,-2.97,-7.089,2.627,-0.069,-0.897,-1.074,0.869,-0.291,,-0.282,1.755,-0.404,-0.056,1.07,0.557,1.446,-6.089,-0.291,0.642,0.0,-0.08,-0.911,-1.391,-1.681,,0.997,1.462,-1.717,-0.693,-0.326,-0.247,0.0,,-4.932,-1.47,-1.293,4.108,-0.887,5.007,-0.887,,-0.675,-0.015,0.658,-0.349,,-0.785,-0.505,1.113,-0.358,-1.042,-0.159,,-0.041,0.18,,-2.683,0.0,-0.091,1.211,0.0,-0.294,1.407,0.006,-0.086,-0.973,,1.264,3.549,-2.527,,2.067,0.548,-0.41,0.267,-0.15,-0.471,,-0.041,-0.428,-3.923,-0.088,1.419,-1.424,-0.409,-0.377,2.888,-0.689,-0.664,0.772,-0.271,0.917,-0.071,-0.321,4.707,,-0.677,-0.24,-4.718,,-0.406,,-2.306,-0.159,-0.862,-1.611,0.259,1.19,2.319,0.934,,-2.235,-0.276,,-0.033,-0.075,0.399,-0.798,,-0.473,-2.097,-5.725,-0.811,-0.306,-0.688,,1.463,-0.144,-0.221,0.0,-0.466,2.506,-0.208,,-2.613,-0.52,,-10.458,-0.841,0.0,,-4.875,-0.373,0.737,-0.063,-0.323
