Year,AGO,BDI,BEN,BFA,BWA,CAF,CIV,CMR,COD,COG,COM,CPV,DJI,DZA,EGY,ERI,ETH,GAB,GHA,GIN,GMB,GNB,GNQ,KEN,LBR,LBY,LSO,MAR,MDG,MLI,MOZ,MRT,MUS,MWI,NAM,NER,NGA,RWA,SDN,SEN,SLE,SOM,SSD,STP,SWZ,SYC,TCD,TGO,TUN,TZA,UGA,ZAF,ZMB,ZWE
1960,,,,,,,,,,,,,,,,,,,,,,,,,,,,,,,,,,,,,,,,,,,,,,,,,,,,,,
1961,,,,,,,,,,,,,,,,,,,,,,,,,,,,,,,,,,,,,,,,,,,,,,,,,,,,,,
1962,,,,,,,,,,,,,,,,,,,,,,,,,,,,,,,,,,,,,,,,,,,,,,,,,,,,,,
1963,,,,,,,,,,,,,,,,,,,,,,,,,,,,,,,,,,,,,,,,,,,,,,,,,,,,,,
1964,,,,,,,,,,,,,,,,,,,,,,,,,,,,,,,,,,,,,,,,,,,,,,,,,,,,,,
1965,,,,,,,,,,,,,,,,,,,,,,,,,,,,,,,,,,,,,,,,,,,,,,,,,,,,,,
1966,,,,,,,,,,,,,,,,,,,,,,,,,,,,,,,,,,,,,,,,,,,,,,,,,,,,,,
1967,,,,,,,,,,,,,,,,,,,,,,,,,,,,,,,,,,,,,,,,,,,,,,,,,,,,,,
1968,,,,,,,,,,,,,,,,,,,,,,,,,,,,,,,,,,,,,,,,,,,,,,,,,,,,,,
1969,,,,,,,,,,,,,,,,,,,,,,,,,,,,,,,,,,,,,,,,,,,,,,,,,,,,,,
1970,,,,,,,,,,,,,,,,,,,,,,,,,,,,,,,,,,,,,,,,,,,,,,,,,,,,,,
1971,,,,,,,,,,,,,,,,,,,,,,,,,,,,,,,,,,,,,,,,,,,,,,,,,,,,,,
1972,,,,,,,,,,,,,,,,,,,,,,,,,,,,,,,,,,,,,,,,,,,,,,,,,,,,,,
1973,,,,,,,,,,,,,,,,,,,,,,,,,,,,,,,,,,,,,,,,,,,,,,,,,,,,,,
1974,,,,,,,,,,,,,,,,,,,,,,,,,,,,,,,,,,,,,,,,,,,,,,,,,,,,,,
1975,,,,,,,,,,,,,,,,,,,,,,,,,,,,,,,,,,,,,,,,,,,,,,,,,,,,,,
1976,,,,,,,,,,,,,,,,,,,,,,,,,,,,,,,,,,,,,,,,,,,,,,,,,,,,,,
1977,,,,,,,,,,,,,,,,,,,,,,,,,,,,,,,,,,,,,,,,,,,,,,,,,,,,,,
1978,,,,,,,,,,,,,,,,,,,,,,,,,,,,,,,,,,,,,,,,,,,,,,,,,,,,,,
1979,,,,,,,,,,,,,,,,,,,,,,,,,,,,,,,,,,,,,,,,,,,,,,,,,,,,,,
1980,,,,,,,,,,,,,,,,,,,,,,,,,,,,,,,,,,,,,,,,,,,,,,,,,,,,,,
1981,,,,,,,,,,,,,,,,,,,,,,,,,,,,,,,,,,,,,,,,,,,,,,,,,,,,,,
1982,,,,,,,,,,,,,,,,,,,,,,,,,,,,,,,,,,,,,,,,,,,,,,,,,,,,,,
1983,,,,,,,,,,,,,,,,,,,,,,,,,,,,,,,,,,,,,,,,,,,,,,,,,,,,,,
1984,,,,,,,,,,,,,,,,,,,,,,,,,,,,,,,,,,,,,,,,,,,,,,,,,,,,,,
1985,,,,,,,,,,,,,,,,,,,,,,,,,,,,,,,,,,,,,,,,,,,,,,,,,,,,,,
1986,,,,,,,,,,,,,,,,,,,,,,,,,,,,,,,,,,,,,,,,,,,,,,,,,,,,,,
1987,,,,,,,,,,,,,,,,,,,,,,,,,,,,,,,,,,,,,,,,,,,,,,,,,,,,,,
1988,,,,,,,,,,,,,,,,,,,,,,,,,,,,,,,,,,,,,,,,,,,,,,,,,,,,,,
1989,,,,,,,,,,,,,,,,,,,,,,,,,,,,,,,,,,,,,,,,,,,,,,,,,,,,,,
1990,,,,,,,,,,,,,,,,,,,,,,,,,,,,,,,,,,,,,,,,,,,,,,,,,,,,,,
1991,39.6290016174,91.8949966431,50.0769996643,89.8099975586,16.2290000916,80.1699981689,51.0239982605,68.0260009766,71.3339996338,42.3950004578,57.8540000916,29.8150005341,43.9280014038,23.952999115,39.2900009155,68.7590026855,77.0820007324,43.9570007324,56.9679985046,73.0869979858,37.6230010986,73.1449966431,62.0279998779,44.0760002136,54.8230018616,24.4640007019,18.1329994202,47.4570007324,75.3349990845,74.0189971924,84.18800354,63.1349983215,14.6260004044,55.6030006409,48.28099823,77.3560028076,50.2459983826,89.4649963379,53.2910003662,48.7949981689,71.2289962769,84.0009994507,62.0499992371,32.0229988098,20.2719993591,,83.452003479,49.4480018616,23.357000351,84.7740020752,72.5660018921,11.2510004044,69.9749984741,60.763999939
1992,39.6599998474,91.9039993286,50.0019989014,89.6679992676,16.063999176,80.3399963379,51.0680007935,68.1019973755,71.641998291,42.3590011597,57.6040000916,29.3199996948,43.9640007019,23.8360004425,38.4589996338,68.3840026855,77.3180007935,43.7869987488,56.8129997253,72.9290008545,37.4780006409,73.1660003662,61.186000824,44.1920013428,55.46900177,24.517999649,17.8969993591,47.3800010681,75.3909988403,74.0500030518,84.18699646,63.1040000916,14.4110002518,55.813999176,46.638999939,77.5899963379,50.0929985046,89.31300354,53.3899993896,48.7159996033,71.4069976807,84.1529998779,61.6790008545,31.9960002899,20.1779994965,,83.1979980469,49.5660018921,23.0960006714,84.7440032959,72.4889984131,11.218000412,70.0210037231,60.9640007019
1993,39.9010009766,91.9759979248,49.8199996948,89.4280014038,15.9600000381,80.3860015869,51.1100006104,68.2959976196,71.9909973145,42.4199981689,57.5190010071,28.9029998779,44.2509994507,23.7910003662,35.2939987183,67.861000061,76.9919967651,43.5159988403,56.5839996338,72.7910003662,37.3260002136,73.1579971313,60.4700012207,44.2919998169,56.2260017395,24.6079998016,17.7560005188,47.21900177,75.43699646,73.9729995728,84.0260009766,62.9650001526,14.095000267,55.3409996033,45.0859985352,77.6439971924,50.1240005493,89.2559967041,53.186000824,48.6209983826,71.2289962769,84.1429977417,61.3670005798,31.9689998627,20.0709991455,,83.375,50.0730018616,22.8579998016,84.6979980469,72.233001709,11.140999794,69.8489990234,60.9809989929
1994,39.8009986877,92.0210037231,49.8050003052,89.1380004883,15.8789997101,80.3349990845,51.1049995422,68.2310028076,72.21900177,42.6500015259,57.7480010986,28.1289997101,44.3219985962,23.7210006714,35.1769981384,67.2929992676,76.8820037842,43.0149993896,56.4119987488,72.6460037231,37.3069992065,73.077003479,59.547000885,44.3009986877,56.9000015259,24.5100002289,17.4920005798,46.8670005798,75.5800018311,73.8280029297,83.8590011597,63.0810012817,13.7939996719,55.5130004883,43.4370002747,77.6409988403,50.1380004883,89.5289993286,52.6489982605,48.5699996948,71.1119995117,84.4250030518,61.0209999084,31.8470001221,19.986000061,,83.0680007935,49.3909988403,22.5489997864,84.6330032349,72.0569992065,11.0340003967,70.0899963379,60.6930007935
1995,39.2760009766,92.1409988403,49.5349998474,88.0439987183,15.6680002213,80.2170028687,50.8489990234,68.0820007324,72.2519989014,42.5229988098,57.6300010681,27.392999649,44.5060005188,23.5289993286,33.9930000305,66.9619979858,76.7139968872,42.6599998474,56.1769981384,72.5,37.2509994507,72.9649963379,58.5979995728,44.2659988403,57.4420013428,24.8360004425,17.3379993439,47.0929985046,75.6500015259,73.7689971924,83.7440032959,62.763999939,14.4899997711,54.7980003357,41.7949981689,77.6689987183,50.0769996643,89.2089996338,52.8510017395,48.2799987793,71.172996521,84.4300003052,60.5110015869,31.7460002899,19.797000885,,82.9459991455,49.0079994202,22.2999992371,84.5380020142,71.6449966431,10.9119997025,70.016998291,60.6230010986
1996,38.733001709,92.28099823,49.341999054,86.733001709,15.5920000076,80.4349975586,50.5260009766,67.8779983521,72.2600021362,42.361000061,57.7089996338,26.6630001068,44.7859992981,23.3199996948,32.6870002747,66.4029998779,76.3209991455,42.2729988098,55.9049987793,72.3030014038,36.9949989319,72.6210021973,57.1209983826,44.2989997864,57.0009994507,24.6620006561,17.013999939,46.561000824,75.7470016479,73.5250015259,83.341003418,62.547000885,13.0430002213,54.3769989014,40.1980018616,77.6849975586,49.8370018005,89.0360031128,53.077999115,48.0929985046,70.9319992065,84.3730010986,60.2089996338,31.6229991913,19.6259994507,,82.8239974976,48.563999176,22.091999054,84.3830032349,71.2590026855,10.7720003128,69.8539962769,60.2340011597
1997,38.2599983215,92.297996521,49.0130004883,85.3420028687,18.0559997559,80.3649978638,50.3320007324,67.6019973755,72.5640029907,42.4179992676,57.5120010376,25.8810005188,44.9440002441,23.1240005493,31.3770008087,65.8779983521,76.2710037231,41.8619995117,55.6040000916,72.0360031128,36.7210006714,72.2760009766,55.2719993591,44.6990013123,54.9780006409,24.6009998322,16.8090000153,46.2449989319,75.8430023193,73.3140029907,83.0019989014,62.7179985046,12.5349998474,54.0810012817,38.4920005798,77.7119979858,49.6230010986,88.8939971924,52.9510002136,47.8019981384,70.9609985352,84.4929962158,59.9679985046,31.5400009155,19.438999176,,82.6009979248,47.7840003967,21.7199993134,84.18699646,71.016998291,10.607000351,69.783996582,60.0880012512
1998,37.7999992371,92.2099990845,48.783000946,83.8089981079,20.7299995422,80.2610015869,50.0589981079,67.2850036621,72.641998291,42.2319984436,57.4430007935,24.9580001831,45.0239982605,22.6949996948,29.8029994965,65.7149963379,76.4850006104,41.5180015564,55.266998291,71.7770004272,36.3950004578,72.9769973755,54.1139984131,45.0009994507,53.8600006104,24.4430007935,16.6669998169,45.8989982605,75.9670028687,72.9779968262,82.5790023804,62.5690002441,11.9020004272,53.827999115,36.0670013428,77.4950027466,49.3880004883,88.8339996338,52.236000061,47.3040008545,70.6959991455,84.4919967651,59.4589996338,31.2700004578,19.2719993591,,82.3140029907,47.8790016174,21.2520008087,83.9130020142,70.7369995117,10.4390001297,69.9700012207,59.9150009155
1999,37.7719993591,92.2220001221,48.3860015869,82.0250015259,20.3059997559,80.1429977417,49.8950004578,66.9010009766,72.9209976196,42.3689994812,57.3149986267,24.0580005646,44.9029998779,22.4720001221,28.702999115,65.5449981689,76.3550033569,41.3050003052,54.9449996948,71.5250015259,35.9000015259,72.9550018311,52.8790016174,45.6549987793,52.7459983826,24.3229999542,16.5349998474,45.5719985962,76.0950012207,72.6859970093,82.2109985352,62.1360015869,11.1979999542,53.6150016785,33.7070007324,77.6760025024,49.2089996338,88.7710037231,52.2410011292,46.7099990845,70.6340026855,84.4739990234,59.361000061,30.9880008698,19.0650005341,,82.2480010986,47.7130012512,20.8829994202,83.5179977417,70.2829971313,10.2270002365,70.4580001831,60.0299987793
2000,37.5149993896,92.2389984131,47.908000946,80.3339996338,19.9549999237,80.3010025024,50.0009994507,66.466003418,73.1549987793,41.8250007629,56.6329994202,22.9260005951,44.9259986877,22.2059993744,29.6299991608,65.5319976807,76.68800354,40.9869995117,55.0550003052,71.2340011597,35.375,72.6940002441,51.5260009766,48.8040008545,51.3079986572,24.0,16.077999115,45.1059989929,76.3740005493,72.5780029297,81.9359970093,62.1489982605,11.4270000458,53.4910011292,31.2840003967,77.9100036621,48.7010002136,88.5640029907,52.0279998779,46.2579994202,70.1819992065,84.4560012817,58.9819984436,30.8449993134,18.8939990997,,82.2119979858,47.6879997253,20.5240001678,83.0289993286,70.0510025024,9.9259996414,70.9290008545,60.6139984131
2001,37.1259994507,92.236000061,47.4210014343,78.2880020142,20.4449996948,80.1610031128,49.9469985962,65.8860015869,73.2969970703,41.4819984436,56.40599823,22.4319992065,44.7630004883,21.7110004425,28.5429992676,65.0650024414,76.8519973755,40.5960006714,55.1409988403,70.8659973145,34.7680015564,72.5130004883,49.8839988708,51.5260009766,51.0559997559,23.8819999695,15.6359996796,44.6510009766,76.8570022583,71.7699966431,81.3209991455,61.9010009766,11.7399997711,53.9459991455,31.0750007629,77.7519989014,48.2019996643,88.2529983521,51.4210014343,45.6300010681,70.4570007324,84.4130020142,58.186000824,30.4120006561,18.6700000763,,81.8109970093,47.7579994202,19.9640007019,82.2900009155,69.6689987183,9.3109998703,71.2740020752,60.9490013123
2002,36.3160018921,92.2119979858,47.016998291,76.0690002441,20.795999527,80.0270004272,49.9710006714,65.0210037231,73.0589981079,41.0870018005,56.172000885,21.7099990845,44.4500007629,21.7329998016,27.5230007172,64.8600006104,77.34400177,40.2220001221,55.1739997864,70.4499969482,35.0060005188,72.6119995117,48.6599998474,54.341999054,50.5359992981,23.875,15.3509998322,44.3829994202,77.966003418,71.5429992676,80.8700027466,61.6980018616,10.7989997864,53.7109985352,30.7409992218,77.7799987793,47.1870002747,87.7089996338,51.1150016785,45.138999939,69.4039993286,84.3550033569,57.8079986572,30.0590000153,18.2770004272,,81.452003479,47.7820014954,19.5559997559,80.5999984741,69.0830001831,8.6840000153,71.6039962769,61.8989982605
2003,36.283000946,92.2620010376,46.6759986877,73.3659973145,21.2199993134,80.3290023804,49.9599990845,64.0780029297,72.6900024414,40.938999176,55.9430007935,21.1100006104,44.1160011292,21.716999054,29.8700008392,65.1900024414,78.0319976807,39.8219985962,55.1479988098,69.9700012207,34.3320007324,72.5510025024,47.4809989929,56.8079986572,52.0110015869,22.9500007629,14.7489995956,43.8950004578,77.9820022583,70.9430007935,80.4720001221,61.1529998779,12.7700004578,53.0559997559,30.3729991913,77.6630020142,46.4480018616,87.0449981689,50.5480003357,44.1959991455,68.8840026855,84.2829971313,57.4070014954,29.2129993439,17.8939990997,,81.0500030518,47.186000824,19.1919994354,78.7710037231,68.6999969482,8.1180000305,71.8020019531,63.0429992676
2004,36.1660003662,92.2860031128,46.2960014343,70.5970001221,21.9459991455,80.0830001831,49.6440010071,62.9309997559,72.2890014648,40.608001709,55.71900177,20.1380004883,43.78099823,20.0559997559,31.8330001831,65.1709976196,77.9150009155,39.452999115,55.0870018005,69.6470031738,33.6370010376,72.391998291,46.1899986267,58.9430007935,51.4570007324,22.5020008087,14.3780002594,45.8269996643,80.2689971924,70.8010025024,80.0130004883,60.5299987793,10.0649995804,52.4710006714,29.9729995728,77.7880020142,45.5550003052,86.1890029907,49.9099998474,43.2319984436,68.4599990845,84.2239990234,57.0800018311,29.3069992065,17.4890003204,,80.4570007324,46.8829994202,18.7670001984,76.7620010376,68.4980010986,7.5819997787,71.9850006104,63.7080001831
2005,38.1710014343,92.3030014038,46.0989990234,67.375,22.5979995728,80.0380020142,49.3009986877,62.0359992981,71.8730010986,39.96900177,55.4119987488,19.3530006409,43.3930015564,18.4340000153,30.9400005341,65.2060012817,78.1210021973,39.0320014954,54.9770011902,69.3190002441,33.6759986877,72.172996521,45.2099990845,61.063999176,50.7529983521,21.6180000305,13.8800001144,45.4770011902,81.9599990845,70.4110031128,79.4599990845,59.6969985962,10.0220003128,52.0569992065,29.6870002747,77.736000061,44.9560012817,85.2340011597,49.3569984436,42.3089981079,68.0640029907,84.1569976807,56.7840003967,27.9099998474,17.0289993286,,79.8939971924,46.7270011902,18.5249996185,74.5469970703,68.3529968262,7.0500001907,72.2630004883,64.5490036011
2006,40.233001709,92.2590026855,45.7000007629,63.9049987793,23.1529998779,79.8059997559,48.9790000916,60.9840011597,71.4929962158,39.4329986572,55.1240005493,18.5389995575,42.8759994507,17.0259990692,31.2290000916,65.2699966431,77.4039993286,38.7560005188,54.9290008545,69.0709991455,33.3819999695,71.9810028076,44.2220001221,61.1459999084,49.9379997253,21.033000946,13.3459997177,43.4020004272,80.4390029907,70.0299987793,78.8690032959,58.4239997864,9.7229995728,51.483001709,29.2619991302,77.5820007324,44.3489990234,84.2050018311,48.4780006409,41.5699996948,67.5370025635,84.091003418,56.452999115,26.9230003357,16.5699996948,,79.7929992676,46.2130012512,19.4379997253,72.1790008545,67.891998291,6.5720000267,72.0159988403,65.3109970093
2007,42.2449989319,92.2170028687,45.0979995728,60.1910018921,23.7129993439,79.5839996338,48.6129989624,59.8269996643,71.0569992065,39.4560012817,54.9300003052,17.4960002899,42.3079986572,15.5850000381,31.7579994202,65.0540008545,76.591003418,38.3199996948,53.9720001221,68.466003418,32.9210014343,71.7710037231,43.1549987793,60.9469985962,49.0760002136,20.3899993896,12.8039999008,42.4319992065,78.7229995728,69.7770004272,78.2959976196,58.0239982605,9.4320001602,50.4440002441,28.9890003204,77.5559997559,43.6949996948,83.1439971924,48.1279983521,40.6199989319,66.6640014648,84.1309967041,56.3089981079,26.4179992676,16.172000885,,79.5390014648,45.8569984436,18.7019996643,71.7369995117,67.5699996948,6.0920000076,71.7300033569,65.7679977417
2008,44.4199981689,92.1959991455,44.5849990845,56.28099823,24.3770008087,79.43800354,48.186000824,58.2589988708,70.6999969482,38.8909988403,54.5040016174,16.8050003052,41.625,14.3050003052,31.6919994354,65.3359985352,75.7990036011,38.0250015259,52.6489982605,68.0550003052,32.3489990234,71.5970001221,41.8969993591,61.1319999695,48.4399986267,20.0109996796,12.1800003052,42.2319984436,76.8170013428,69.4410018921,77.7009963989,57.7299995422,9.1440000534,49.6850013733,28.7439994812,77.2350006104,43.0019989014,81.8759994507,47.6829986572,39.7729988098,65.8000030518,84.016998291,56.2630004883,25.5489997864,15.906999588,,79.3290023804,45.4420013428,18.0219993591,71.3359985352,67.2529983521,5.6570000648,71.4329986572,66.6959991455
2009,46.5079994202,92.1600036621,44.2869987488,52.3730010986,25.0890007019,79.0230026245,47.6570014954,56.7270011902,70.4449996948,38.1769981384,54.1539993286,16.5830001831,41.2999992371,13.015999794,29.9580001831,64.9199981689,75.0199966431,37.6930007935,51.5870018005,67.9029998779,31.6650009155,71.3229980469,41.8409996033,60.9459991455,47.936000824,19.5970001221,11.8310003281,41.436000824,75.2610015869,69.0609970093,77.0960006714,57.5690002441,9.0389995575,48.8300018311,28.4780006409,77.3679962158,42.2309989929,80.7379989624,46.4090003967,39.0660018921,64.9800033569,83.9049987793,56.6020011902,25.0990009308,15.6099996567,,78.9720001221,44.7569999695,18.4710006714,70.9209976196,67.0599975586,5.0689997673,68.091003418,66.1360015869
2010,48.8989982605,92.1149978638,43.9889984131,48.1549987793,24.6439990997,78.7559967041,47.2610015869,55.063999176,70.0149993896,37.422000885,53.7490005493,16.2350006104,40.7299995422,11.857000351,28.2759990692,64.6630020142,73.9739990234,37.2210006714,50.233001709,67.4820022583,31.0,71.0319976807,41.6940002441,60.2999992371,47.3059997559,19.1399993896,11.2849998474,40.5250015259,73.3550033569,68.6259994507,76.4150009155,56.9399986267,8.6300001144,48.0730018616,28.1319999695,77.0869979858,41.3689994812,79.4639968872,45.5620002747,38.1910018921,63.9099998474,83.797996521,56.4099998474,24.3260002136,15.2440004349,,78.5100021362,44.0180015564,17.9459991455,70.4150009155,66.8160018921,4.8559999466,64.31199646,65.5289993286
2011,51.2179985046,92.0690002441,43.6129989624,43.6529998779,24.2089996338,78.4889984131,47.3590011597,53.2960014343,69.5289993286,36.9959983826,53.297000885,15.7670001984,39.8429985046,10.7700004578,29.2390003204,63.8330001831,72.9810028076,36.733001709,48.4109992981,66.9250030518,31.1770000458,70.5279998779,41.2719993591,59.7509994507,46.4469985962,21.1809997559,10.7510004044,39.7799987793,71.2379989624,68.1740036011,75.6640014648,56.3230018616,7.7259998322,47.5069999695,27.7159996033,77.0609970093,40.5820007324,78.0859985352,44.6020011902,37.4230003357,62.7229995728,83.6780014038,56.84400177,23.718000412,14.9239997864,,78.3499984741,43.2309989929,16.361000061,69.8050003052,66.43699646,4.5999999046,60.4309997559,65.8629989624
2012,51.1399993896,92.0120010376,43.0589981079,39.1370010376,23.7929992676,78.1360015869,46.1910018921,51.4500007629,68.9729995728,36.4900016785,52.8880004883,15.4829998016,39.1430015564,10.6929998398,27.0709991455,63.388999939,72.1019973755,36.3260002136,46.8510017395,66.358001709,30.5389995575,70.5719985962,41.5,59.25,45.5750007629,19.0009994507,10.2510004044,39.2200012207,68.8730010986,68.0609970093,74.8669967651,55.6259994507,7.6640000343,47.2260017395,27.3680000305,76.5699996948,39.4799995422,76.6090011597,43.4739990234,36.4020004272,61.033000946,83.6549987793,57.8860015869,23.1790008545,14.5270004272,,77.9509963989,42.4799995422,17.0739994049,69.3489990234,66.1360015869,4.8379998207,56.0289993286,66.0019989014
2013,50.9949989319,91.9670028687,42.2550010681,34.7010002136,23.1350002289,79.0110015869,45.1699981689,49.4980010986,68.3219985962,36.0050010681,52.3810005188,15.1750001907,38.3829994202,10.6149997711,27.9589996338,63.7879981995,71.033996582,35.8899993896,45.3790016174,65.858001709,29.968000412,70.2600021362,41.4620018005,58.6220016479,44.6189994812,19.3950004578,10.0059995651,38.5089988708,67.9140014648,67.7269973755,74.0230026245,54.8779983521,7.4050002098,46.625,31.3920001984,76.3649978638,38.2709999084,72.9199981689,42.638999939,35.5200004578,59.1570014954,83.611000061,56.6910018921,22.513999939,14.0760002136,,77.5670013428,41.7140007019,15.3649997711,68.68699646,71.9169998169,4.9819998741,54.2490005493,66.7750015259
2014,50.7680015564,91.9010009766,41.5299987793,30.3770008087,22.6259994507,78.8310012817,44.3709983826,47.6129989624,67.59400177,35.3880004883,52.0540008545,14.8660001755,37.4560012817,10.5010004044,27.5529994965,62.3269996643,70.0729980469,35.4420013428,40.4179992676,65.3899993896,29.875,70.0739974976,41.4249992371,57.9920005798,44.3699989319,20.0729999542,9.6960000992,37.7039985657,67.1019973755,66.7009963989,73.1070022583,54.1640014648,7.1319999695,45.9840011597,29.3209991455,76.0510025024,37.4790000916,68.4530029297,42.2220001221,34.3310012817,57.6489982605,83.547996521,56.2779998779,21.6809997559,13.7770004272,,77.1829986572,40.9729995728,14.8699998856,68.0500030518,72.5849990845,4.6500000954,52.8019981384,67.25
2015,50.6030006409,91.9840011597,41.1809997559,29.1319999695,22.2509994507,78.5070037842,43.5569992065,46.5359992981,66.9820022583,34.9620018005,51.7980003357,14.5760002136,36.4780006409,10.3470001221,25.8150005341,63.0550003052,69.1029968262,34.90599823,35.1780014038,64.8870010376,29.218000412,69.7350006104,41.9949989319,57.3260002136,44.1850013733,20.3040008545,9.3940000534,37.2039985657,66.4039993286,62.2659988403,72.1159973145,53.7989997864,6.9000000954,45.5620002747,24.5109996796,75.8980026245,36.9039993286,66.7229995728,41.4850006104,33.3330001831,57.9420013428,83.4400024414,56.7700004578,21.1459999084,13.5369997025,,76.9680023193,40.2430000305,14.5080003738,67.4909973145,72.6330032349,5.6129999161,51.6660003662,67.1689987183
2016,50.6220016479,92.0080032349,40.7550010681,27.9510002136,21.7910003662,78.172996521,42.7480010986,45.6300010681,66.6940002441,34.9819984436,51.4459991455,14.0830001831,35.5400009155,10.251999855,25.5739994049,62.3170013428,68.1910018921,34.3979988098,33.7369995117,64.0759963989,29.0620002747,69.263999939,42.3320007324,56.611000061,44.1660003662,20.1940002441,9.1009998322,36.6170005798,65.7600021362,64.9029998779,71.5530014038,53.3120002747,6.7109999657,45.1669998169,20.0709991455,75.7300033569,36.5670013428,65.591003418,40.858001709,32.4430007935,57.0439987183,83.3470001221,57.438999176,20.5410003662,13.204000473,,77.0360031128,39.5660018921,14.0629997253,66.9260025024,72.8389968872,5.5720000267,50.7319984436,67.0660018921
2017,50.5579986572,92.0189971924,40.0429992676,26.8689994812,21.3959999084,77.861000061,41.8909988403,44.8330001831,66.327003479,34.938999176,51.0390014648,13.6140003204,34.7430000305,10.1599998474,25.0450000763,62.7109985352,67.3460006714,33.8810005188,31.9899997711,63.0449981689,28.4799995422,68.8539962769,42.0810012817,55.908000946,43.7410011292,19.0750007629,9.0260000229,35.9020004272,65.2310028076,63.9819984436,71.0540008545,52.6990013123,6.4829998016,44.6319999695,21.3479995728,75.53099823,36.0960006714,64.4530029297,40.2879981995,31.5429992676,56.263999939,83.3040008545,57.8629989624,19.9759998322,12.9239997864,,76.9929962158,38.9570007324,13.7119998932,66.3499984741,73.0520019531,5.2849998474,49.9729995728,66.7649993896
2018,50.5180015564,92.0110015869,39.2470016479,25.9029998779,21.0270004272,77.5670013428,40.9189987183,44.0670013428,65.7959976196,34.6030006409,50.611000061,11.8380002975,33.9140014648,10.0229997635,24.3479995728,61.6180000305,66.7060012817,33.34400177,30.4330005646,62.2719993591,27.7530002594,68.4980010986,42.0859985352,55.0849990845,43.4300003052,18.4330005646,8.7810001373,35.2540016174,64.6740036011,63.0060005188,70.5869979858,52.0559997559,6.2600002289,44.1300010681,22.5909996033,75.31199646,35.5730018616,63.2459983826,40.1069984436,30.7049999237,55.563999176,83.2040023804,57.7120018005,19.4920005798,12.6809997559,,76.7440032959,38.2840003967,13.3350000381,65.7529983521,72.875,5.1669998169,49.2610015869,66.3069992065
2019,50.3800010681,92.0230026245,38.577999115,25.2250003815,20.6870002747,77.3229980469,40.0489997864,43.4370002747,65.4309997559,34.1300010681,50.375,11.4600000381,33.1220016479,9.8559999466,23.7919998169,61.2130012512,66.1289978027,32.8310012817,29.2649993896,61.7420005798,27.1210002899,68.1380004883,42.3569984436,54.4399986267,43.2729988098,18.9050006866,8.5360002518,34.6899986267,64.2220001221,62.5909996033,70.3349990845,51.2739982605,6.0720000267,43.6489982605,22.1329994202,75.06300354,35.0979995728,62.40599823,39.938999176,30.045999527,54.9309997559,83.1119995117,56.875,19.0949993134,12.4580001831,,76.5559997559,37.6990013123,13.0310001373,65.3059997559,72.6660003662,5.0879998207,48.8390007019,66.5439987183
