Year,DR_AFA,DR_AFC,DR_AFE,DR_AFN,DR_GOG,DR_GSA,DR_OCI
1960,177.86637545158962,260.8471718859738,212.9040099521731,279.5515703614223,281.34609010490635,319.23678301648994,102.26009683221547
1961,174.01328853262078,259.43837805739327,208.62778641023806,272.8898996504107,276.8712351588926,316.08693921222175,98.78837391737017
1962,170.20366736588764,254.62518250591623,204.71489482039016,266.68628600698537,272.4481285667641,313.3516526821033,93.79798384922347
1963,166.53004589893138,250.199291930596,201.2709241036975,259.6948313678733,280.53159139542436,349.11105431858584,87.85424349642896
1964,210.46964814762205,245.7569905422034,201.18650531593852,253.06263749949113,310.74812911972316,344.7568495022204,84.53578200932007
1965,209.3122100007944,239.3580640046201,198.52749331214034,246.8673889556296,304.8716788387659,340.45086953929655,86.92625342627557
1966,235.01021949125777,233.259209999605,213.60780936142413,241.36826733124417,299.1755379192049,336.237594732214,92.5941443667744
1967,229.36919661204035,225.98177377874987,211.93700869955433,236.33062477958472,293.45872379024627,328.6434640171568,95.49511275625196
1968,227.975349033498,218.03777702310254,210.3783186235121,231.7272015953779,287.66747126424013,326.3205763823094,140.96393593930765
1969,226.19742714807242,236.3904694376278,208.91205415899995,227.3197385142787,281.50187313563913,322.26059342496853,141.76717762652837
1970,223.92395043175057,231.4076072798828,207.62495694704643,223.06324561119018,275.07547872799165,319.6947357822077,145.3107990742688
1971,221.02345430095758,227.1886362654677,206.45110562557164,218.4426454745788,268.301620113317,316.860916120715,146.6058769672381
1972,217.60640532784686,223.30087941974898,205.40158380564748,213.28071122791758,261.14629249583203,304.47909282256506,148.23281224091485
1973,214.1362060018705,219.82259741158478,204.43626251850674,207.36926037223438,253.82953889345234,300.3731490635713,149.92604018000608
1974,172.65214889231132,216.51824924975057,203.57344116444662,200.29247021150402,246.39256391128856,295.2365299548056,151.6805741895628
1975,167.86272546868108,213.4691383297232,202.39281229757407,192.43717391356248,239.04565598809998,289.01902446561706,153.11956292172877
1976,163.48700551310247,210.49638316704315,200.994229673223,183.91743966132069,231.9648735160972,282.126130802922,154.33030559184064
1977,159.2834197841057,207.65095622579955,203.37227921879602,175.05295580703142,225.4060241046691,274.82429487858377,155.58926189733276
1978,155.31454243532238,203.0699491811167,201.1195132835156,165.9430275536605,219.56170668863552,267.8120927328609,156.7197108353283
1979,151.4182182225051,199.8323410747204,198.39093589300165,156.89173492344977,214.4722594198293,261.4270036936954,158.17233109496772
1980,158.12863417576796,196.3986902574442,195.50044577298647,147.67518044141818,210.25146840120985,255.78461455996487,159.98839258413608
1981,154.6212439414074,192.7764254945206,192.28862502398897,138.11715503716732,207.05806077451655,250.93224521699744,162.09968878295868
1982,151.26201612964508,189.2864652847221,189.36918139391406,128.25591702908284,204.70916189169063,246.8359061762495,164.1106226365215
1983,148.45844133846057,185.58400687767815,186.02969946134854,118.386314925898,203.11917138588836,243.05972613300762,165.42135751383498
1984,146.11787803066275,182.10137888110813,182.86326995645499,108.76807992196602,202.14156217143668,239.27471210770756,165.72274047629998
1985,144.00143186629728,178.82326361726373,179.91719436652608,99.93606505587924,201.48969656452195,235.5942750496469,165.16336709992524
1986,142.22367730793982,175.80912367061265,177.24673662125383,92.25401755786798,201.0371530131276,231.4204695374606,163.46907810772547
1987,140.6412150188603,173.3802743728021,174.8158948220239,85.92029660568768,200.65199840269733,227.069701729766,160.50106357919628
1988,139.0269885834316,171.24913920897154,172.64061480535347,80.73383247126911,199.93170669564134,222.85966675242724,156.18536785953864
1989,137.60355970608464,169.74417281952572,170.55073535219316,76.44849702257747,199.17548200243604,218.96735685011993,151.43870614224642
1990,136.3565053059929,168.5148607084827,168.5456213227543,72.8404970296397,198.05033080048207,215.46565442858304,146.69756018746006
1991,135.23734936234348,167.7099901613705,166.50788423872257,69.57113337152461,196.79427854112598,212.3038548397791,142.14780554139375
1992,134.35974104582354,167.1598342399994,164.31442996085937,66.44865166553339,195.3426672117884,209.3676057234537,138.05581340629848
1993,133.74464896063571,166.82808591494197,162.15093039349264,63.30827283057711,193.83695838760883,206.351066473442,134.18500362758493
1994,133.3758310928394,166.4240437615061,162.30368497029363,60.17084468527053,192.0775133303977,203.00247818077793,130.3591133192018
1995,133.22208286092285,165.80195007284883,157.4474440723091,56.96390135870264,189.80598802007802,199.31562894037663,126.39038080072757
1996,133.0167762085663,164.88819406226975,152.08442180613955,53.97353601186394,187.00079318668455,195.3302860789381,121.89231011468493
1997,132.6175894677076,163.46236252938434,148.95039084318555,51.103311197457764,183.35812404106687,191.2524448137464,116.91000911436684
1998,131.90858563950025,161.5526432555307,145.38452021130155,48.48384021883814,179.14188284044545,186.9275632123145,111.60004509756241
1999,130.44696083149822,158.75788234535287,139.55346498518688,46.09182263551744,174.36498779081558,182.3340403408699,106.08009235453078
2000,128.13009508583426,155.34935364842636,134.21108533030463,43.95564895852272,169.39811427376762,177.28359504979306,100.72075022429202
2001,124.95586356109888,151.45348414733408,128.28468737412734,41.9113506083841,164.1781553939756,171.7243404329012,95.54303933571329
2002,121.38538879418597,147.14775342396857,122.10127140817252,39.9774667790754,158.88216006888078,165.6497121812553,90.83502075805221
2003,117.70165672094436,142.75609586672505,115.82074181475778,38.17564646384624,153.56510410292,159.28202406885117,86.41080867118272
2004,113.58658614839605,138.16918253628648,109.66112754461999,36.4487198687573,148.38053929133224,152.5610536646937,82.51017355726542
2005,109.26039274568217,133.70315393460072,103.74328541420282,34.82329595786902,143.45401905575557,145.82355510703871,78.94880990682563
2006,104.67912552594991,129.11144564902324,98.22948971656676,33.29562777511512,138.8271839649176,139.20056922044077,75.73026942694713
2007,99.24423179372737,124.71705059525765,92.97261538833362,31.906593581958578,134.40509550134473,132.70017856268683,72.7637907004337
2008,93.34560677482614,120.31321854146954,87.94409956393335,30.529709375322305,130.2850402442274,126.42171461032044,69.9303959171399
2009,87.12601813445073,116.09575295204199,83.38614583581742,29.242776117386136,126.5674056528479,120.450534631471,67.35677889895993
2010,81.66028113705347,111.7773474614381,79.13279291644758,28.1252476434712,123.26444696826697,114.82208372633126,64.86940228901373
2011,76.05895315853464,107.814180335624,75.29575613831669,27.13169590231843,120.29870615920402,109.52460532573853,62.76047897368942
2012,71.18629249477964,103.9073540665676,71.77236223820488,26.038725485040292,117.79750550531419,104.7104580512351,60.907877773517015
2013,66.99413173393836,100.43238010038947,68.59439204231228,25.132575394251834,115.43955618996613,100.28767993730692,59.232219322297375
2014,63.61503184441698,96.88526925037307,65.62309728574343,24.324895036741808,113.26630925232567,96.26279990545022,57.740808583436625
2015,60.68810914789498,93.47203749259529,62.874886585780494,23.490729418266824,111.27574802570675,92.56938883368693,56.34677275755628
2016,58.08942844814168,90.064578327597,60.26905716874071,22.777572008705473,109.34438403572524,89.02972491900412,54.94511413737968
2017,55.970650755967185,87.10558995242073,57.944507266784775,22.01958475473094,107.24724658859355,85.75108173461125,53.64432984213806
2018,53.84025339578274,84.21840519334152,55.814879063763165,21.355668513270544,104.94387270782018,82.75088626417948,52.176652522534575
2019,,,,,,,
