{
  "country": "TUN",
  "country_name": "Tunisie",
  "indicators": {
    "abo_mobile": [
      [
        1960,
        0.0
      ],
      [
        1961,
        "NA"
      ],
      [
        1962,
        "NA"
      ],
      [
        1963,
        "NA"
      ],
      [
        1964,
        "NA"
      ],
      [
        1965,
        0.0
      ],
      [
        1966,
        "NA"
      ],
      [
        1967,
        "NA"
      ],
      [
        1968,
        "NA"
      ],
      [
        1969,
        "NA"
      ],
      [
        1970,
        0.0
      ],
      [
        1971,
        "NA"
      ],
      [
        1972,
        "NA"
      ],
      [
        1973,
        "NA"
      ],
      [
        1974,
        "NA"
      ],
      [
        1975,
        0.0
      ],
      [
        1976,
        0.0
      ],
      [
        1977,
        0.0
      ],
      [
        1978,
        0.0
      ],
      [
        1979,
        0.0
      ],
      [
        1980,
        0.0
      ],
      [
        1981,
        0.0
      ],
      [
        1982,
        0.0
      ],
      [
        1983,
        0.0
      ],
      [
        1984,
        0.0
      ],
      [
        1985,
        "NA"
      ],
      [
        1986,
        "NA"
      ],
      [
        1987,
        0.00022400000000000002
      ],
      [
        1988,
        0.000401
      ],
      [
        1989,
        0.0006360000000000001
      ],
      [
        1990,
        0.000953
      ],
      [
        1991,
        0.001239
      ],
      [
        1992,
        0.001974
      ],
      [
        1993,
        0.002269
      ],
      [
        1994,
        0.002709
      ],
      [
        1995,
        0.0031850000000000003
      ],
      [
        1996,
        0.0065
      ],
      [
        1997,
        0.0076560000000000005
      ],
      [
        1998,
        0.038998000000000005
      ],
      [
        1999,
        0.055258
      ],
      [
        2000,
        0.11916500000000001
      ],
      [
        2001,
        0.389208
      ],
      [
        2002,
        0.574334
      ],
      [
        2003,
        1.91753
      ],
      [
        2004,
        3.7356949999999998
      ],
      [
        2005,
        5.680726
      ],
      [
        2006,
        7.339047
      ],
      [
        2007,
        7.842619
      ],
      [
        2008,
        8.602164
      ],
      [
        2009,
        9.797025999999999
      ],
      [
        2010,
        11.114206
      ],
      [
        2011,
        12.387656
      ],
      [
        2012,
        12.843889
      ],
      [
        2013,
        12.712365
      ],
      [
        2014,
        14.283632999999998
      ],
      [
        2015,
        14.595875
      ],
      [
        2016,
        14.282078
      ],
      [
        2017,
        14.334079999999998
      ],
      [
        2018,
        14.769594
      ],
      [
        2019,
        "NA"
      ]
    ],
    "acces_elec": [
      [
        1960,
        "NA"
      ],
      [
        1961,
        "NA"
      ],
      [
        1962,
        "NA"
      ],
      [
        1963,
        "NA"
      ],
      [
        1964,
        "NA"
      ],
      [
        1965,
        "NA"
      ],
      [
        1966,
        "NA"
      ],
      [
        1967,
        "NA"
      ],
      [
        1968,
        "NA"
      ],
      [
        1969,
        "NA"
      ],
      [
        1970,
        "NA"
      ],
      [
        1971,
        "NA"
      ],
      [
        1972,
        "NA"
      ],
      [
        1973,
        "NA"
      ],
      [
        1974,
        "NA"
      ],
      [
        1975,
        "NA"
      ],
      [
        1976,
        "NA"
      ],
      [
        1977,
        "NA"
      ],
      [
        1978,
        "NA"
      ],
      [
        1979,
        "NA"
      ],
      [
        1980,
        "NA"
      ],
      [
        1981,
        "NA"
      ],
      [
        1982,
        "NA"
      ],
      [
        1983,
        "NA"
      ],
      [
        1984,
        "NA"
      ],
      [
        1985,
        "NA"
      ],
      [
        1986,
        "NA"
      ],
      [
        1987,
        "NA"
      ],
      [
        1988,
        "NA"
      ],
      [
        1989,
        "NA"
      ],
      [
        1990,
        "NA"
      ],
      [
        1991,
        "NA"
      ],
      [
        1992,
        "NA"
      ],
      [
        1993,
        "NA"
      ],
      [
        1994,
        86.8
      ],
      [
        1995,
        88.7
      ],
      [
        1996,
        90.4
      ],
      [
        1997,
        92.0
      ],
      [
        1998,
        93.2
      ],
      [
        1999,
        94.2
      ],
      [
        2000,
        94.8
      ],
      [
        2001,
        97.3
      ],
      [
        2002,
        97.8
      ],
      [
        2003,
        98.4
      ],
      [
        2004,
        99.0
      ],
      [
        2005,
        99.3
      ],
      [
        2006,
        99.4
      ],
      [
        2007,
        99.4
      ],
      [
        2008,
        99.4
      ],
      [
        2009,
        99.5
      ],
      [
        2010,
        99.5
      ],
      [
        2011,
        99.5
      ],
      [
        2012,
        99.5
      ],
      [
        2013,
        99.7
      ],
      [
        2014,
        99.8
      ],
      [
        2015,
        99.9
      ],
      [
        2016,
        100.0
      ],
      [
        2017,
        100.0
      ],
      [
        2018,
        99.8
      ],
      [
        2019,
        "NA"
      ]
    ],
    "acces_elec_primaire": [
      [
        2000,
        "NA"
      ],
      [
        2001,
        "NA"
      ],
      [
        2002,
        "NA"
      ],
      [
        2003,
        "NA"
      ],
      [
        2004,
        "NA"
      ],
      [
        2005,
        "NA"
      ],
      [
        2006,
        "NA"
      ],
      [
        2007,
        "NA"
      ],
      [
        2008,
        "NA"
      ],
      [
        2009,
        "NA"
      ],
      [
        2010,
        "NA"
      ],
      [
        2011,
        "NA"
      ],
      [
        2012,
        "NA"
      ],
      [
        2013,
        "NA"
      ],
      [
        2014,
        "NA"
      ],
      [
        2015,
        "NA"
      ],
      [
        2016,
        99.73464
      ],
      [
        2017,
        99.89938
      ],
      [
        2018,
        99.94066
      ],
      [
        2019,
        "NA"
      ]
    ],
    "alpha_adulte": [
      [
        1960,
        "NA"
      ],
      [
        1961,
        "NA"
      ],
      [
        1962,
        "NA"
      ],
      [
        1963,
        "NA"
      ],
      [
        1964,
        "NA"
      ],
      [
        1965,
        "NA"
      ],
      [
        1966,
        "NA"
      ],
      [
        1967,
        "NA"
      ],
      [
        1968,
        "NA"
      ],
      [
        1969,
        "NA"
      ],
      [
        1970,
        "NA"
      ],
      [
        1971,
        "NA"
      ],
      [
        1972,
        "NA"
      ],
      [
        1973,
        "NA"
      ],
      [
        1974,
        "NA"
      ],
      [
        1975,
        "NA"
      ],
      [
        1976,
        "NA"
      ],
      [
        1977,
        "NA"
      ],
      [
        1978,
        "NA"
      ],
      [
        1979,
        "NA"
      ],
      [
        1980,
        "NA"
      ],
      [
        1981,
        "NA"
      ],
      [
        1982,
        "NA"
      ],
      [
        1983,
        "NA"
      ],
      [
        1984,
        48.1907
      ],
      [
        1985,
        "NA"
      ],
      [
        1986,
        "NA"
      ],
      [
        1987,
        "NA"
      ],
      [
        1988,
        "NA"
      ],
      [
        1989,
        "NA"
      ],
      [
        1990,
        "NA"
      ],
      [
        1991,
        "NA"
      ],
      [
        1992,
        "NA"
      ],
      [
        1993,
        "NA"
      ],
      [
        1994,
        "NA"
      ],
      [
        1995,
        "NA"
      ],
      [
        1996,
        "NA"
      ],
      [
        1997,
        "NA"
      ],
      [
        1998,
        "NA"
      ],
      [
        1999,
        "NA"
      ],
      [
        2000,
        "NA"
      ],
      [
        2001,
        "NA"
      ],
      [
        2002,
        "NA"
      ],
      [
        2003,
        "NA"
      ],
      [
        2004,
        74.297
      ],
      [
        2005,
        "NA"
      ],
      [
        2006,
        "NA"
      ],
      [
        2007,
        77.1904
      ],
      [
        2008,
        77.56113
      ],
      [
        2009,
        "NA"
      ],
      [
        2010,
        79.13058000000001
      ],
      [
        2011,
        79.65391
      ],
      [
        2012,
        80.21875
      ],
      [
        2013,
        "NA"
      ],
      [
        2014,
        79.03643000000001
      ],
      [
        2015,
        "NA"
      ],
      [
        2016,
        "NA"
      ],
      [
        2017,
        "NA"
      ],
      [
        2018,
        "NA"
      ],
      [
        2019,
        "NA"
      ]
    ],
    "alpha_jeune": [
      [
        1960,
        "NA"
      ],
      [
        1961,
        "NA"
      ],
      [
        1962,
        "NA"
      ],
      [
        1963,
        "NA"
      ],
      [
        1964,
        "NA"
      ],
      [
        1965,
        "NA"
      ],
      [
        1966,
        "NA"
      ],
      [
        1967,
        "NA"
      ],
      [
        1968,
        "NA"
      ],
      [
        1969,
        "NA"
      ],
      [
        1970,
        "NA"
      ],
      [
        1971,
        "NA"
      ],
      [
        1972,
        "NA"
      ],
      [
        1973,
        "NA"
      ],
      [
        1974,
        "NA"
      ],
      [
        1975,
        "NA"
      ],
      [
        1976,
        "NA"
      ],
      [
        1977,
        "NA"
      ],
      [
        1978,
        "NA"
      ],
      [
        1979,
        "NA"
      ],
      [
        1980,
        "NA"
      ],
      [
        1981,
        "NA"
      ],
      [
        1982,
        "NA"
      ],
      [
        1983,
        "NA"
      ],
      [
        1984,
        74.28412
      ],
      [
        1985,
        "NA"
      ],
      [
        1986,
        "NA"
      ],
      [
        1987,
        "NA"
      ],
      [
        1988,
        "NA"
      ],
      [
        1989,
        "NA"
      ],
      [
        1990,
        "NA"
      ],
      [
        1991,
        "NA"
      ],
      [
        1992,
        "NA"
      ],
      [
        1993,
        "NA"
      ],
      [
        1994,
        "NA"
      ],
      [
        1995,
        "NA"
      ],
      [
        1996,
        "NA"
      ],
      [
        1997,
        "NA"
      ],
      [
        1998,
        "NA"
      ],
      [
        1999,
        "NA"
      ],
      [
        2000,
        "NA"
      ],
      [
        2001,
        "NA"
      ],
      [
        2002,
        "NA"
      ],
      [
        2003,
        "NA"
      ],
      [
        2004,
        94.33898
      ],
      [
        2005,
        "NA"
      ],
      [
        2006,
        "NA"
      ],
      [
        2007,
        96.29969
      ],
      [
        2008,
        96.79426
      ],
      [
        2009,
        "NA"
      ],
      [
        2010,
        97.17172
      ],
      [
        2011,
        97.30444
      ],
      [
        2012,
        96.865
      ],
      [
        2013,
        "NA"
      ],
      [
        2014,
        96.2091
      ],
      [
        2015,
        "NA"
      ],
      [
        2016,
        "NA"
      ],
      [
        2017,
        "NA"
      ],
      [
        2018,
        "NA"
      ],
      [
        2019,
        "NA"
      ]
    ],
    "bidonvilles": [
      [
        1960,
        "NA"
      ],
      [
        1961,
        "NA"
      ],
      [
        1962,
        "NA"
      ],
      [
        1963,
        "NA"
      ],
      [
        1964,
        "NA"
      ],
      [
        1965,
        "NA"
      ],
      [
        1966,
        "NA"
      ],
      [
        1967,
        "NA"
      ],
      [
        1968,
        "NA"
      ],
      [
        1969,
        "NA"
      ],
      [
        1970,
        "NA"
      ],
      [
        1971,
        "NA"
      ],
      [
        1972,
        "NA"
      ],
      [
        1973,
        "NA"
      ],
      [
        1974,
        "NA"
      ],
      [
        1975,
        "NA"
      ],
      [
        1976,
        "NA"
      ],
      [
        1977,
        "NA"
      ],
      [
        1978,
        "NA"
      ],
      [
        1979,
        "NA"
      ],
      [
        1980,
        "NA"
      ],
      [
        1981,
        "NA"
      ],
      [
        1982,
        "NA"
      ],
      [
        1983,
        "NA"
      ],
      [
        1984,
        "NA"
      ],
      [
        1985,
        "NA"
      ],
      [
        1986,
        "NA"
      ],
      [
        1987,
        "NA"
      ],
      [
        1988,
        "NA"
      ],
      [
        1989,
        "NA"
      ],
      [
        1990,
        "NA"
      ],
      [
        1991,
        "NA"
      ],
      [
        1992,
        "NA"
      ],
      [
        1993,
        "NA"
      ],
      [
        1994,
        "NA"
      ],
      [
        1995,
        "NA"
      ],
      [
        1996,
        "NA"
      ],
      [
        1997,
        "NA"
      ],
      [
        1998,
        "NA"
      ],
      [
        1999,
        "NA"
      ],
      [
        2000,
        "NA"
      ],
      [
        2001,
        "NA"
      ],
      [
        2002,
        "NA"
      ],
      [
        2003,
        "NA"
      ],
      [
        2004,
        "NA"
      ],
      [
        2005,
        "NA"
      ],
      [
        2006,
        "NA"
      ],
      [
        2007,
        "NA"
      ],
      [
        2008,
        "NA"
      ],
      [
        2009,
        "NA"
      ],
      [
        2010,
        "NA"
      ],
      [
        2011,
        "NA"
      ],
      [
        2012,
        "NA"
      ],
      [
        2013,
        "NA"
      ],
      [
        2014,
        8.0
      ],
      [
        2015,
        "NA"
      ],
      [
        2016,
        "NA"
      ],
      [
        2017,
        "NA"
      ],
      [
        2018,
        "NA"
      ],
      [
        2019,
        "NA"
      ]
    ],
    "compte_adulte": [
      [
        1960,
        "NA"
      ],
      [
        1961,
        "NA"
      ],
      [
        1962,
        "NA"
      ],
      [
        1963,
        "NA"
      ],
      [
        1964,
        "NA"
      ],
      [
        1965,
        "NA"
      ],
      [
        1966,
        "NA"
      ],
      [
        1967,
        "NA"
      ],
      [
        1968,
        "NA"
      ],
      [
        1969,
        "NA"
      ],
      [
        1970,
        "NA"
      ],
      [
        1971,
        "NA"
      ],
      [
        1972,
        "NA"
      ],
      [
        1973,
        "NA"
      ],
      [
        1974,
        "NA"
      ],
      [
        1975,
        "NA"
      ],
      [
        1976,
        "NA"
      ],
      [
        1977,
        "NA"
      ],
      [
        1978,
        "NA"
      ],
      [
        1979,
        "NA"
      ],
      [
        1980,
        "NA"
      ],
      [
        1981,
        "NA"
      ],
      [
        1982,
        "NA"
      ],
      [
        1983,
        "NA"
      ],
      [
        1984,
        "NA"
      ],
      [
        1985,
        "NA"
      ],
      [
        1986,
        "NA"
      ],
      [
        1987,
        "NA"
      ],
      [
        1988,
        "NA"
      ],
      [
        1989,
        "NA"
      ],
      [
        1990,
        "NA"
      ],
      [
        1991,
        "NA"
      ],
      [
        1992,
        "NA"
      ],
      [
        1993,
        "NA"
      ],
      [
        1994,
        "NA"
      ],
      [
        1995,
        "NA"
      ],
      [
        1996,
        "NA"
      ],
      [
        1997,
        "NA"
      ],
      [
        1998,
        "NA"
      ],
      [
        1999,
        "NA"
      ],
      [
        2000,
        "NA"
      ],
      [
        2001,
        "NA"
      ],
      [
        2002,
        "NA"
      ],
      [
        2003,
        "NA"
      ],
      [
        2004,
        "NA"
      ],
      [
        2005,
        "NA"
      ],
      [
        2006,
        "NA"
      ],
      [
        2007,
        "NA"
      ],
      [
        2008,
        "NA"
      ],
      [
        2009,
        "NA"
      ],
      [
        2010,
        "NA"
      ],
      [
        2011,
        "NA"
      ],
      [
        2012,
        "NA"
      ],
      [
        2013,
        "NA"
      ],
      [
        2014,
        30.4864501953
      ],
      [
        2015,
        "NA"
      ],
      [
        2016,
        "NA"
      ],
      [
        2017,
        39.9793128967
      ],
      [
        2018,
        "NA"
      ],
      [
        2019,
        "NA"
      ]
    ],
    "compte_jeune": [
      [
        1960,
        "NA"
      ],
      [
        1961,
        "NA"
      ],
      [
        1962,
        "NA"
      ],
      [
        1963,
        "NA"
      ],
      [
        1964,
        "NA"
      ],
      [
        1965,
        "NA"
      ],
      [
        1966,
        "NA"
      ],
      [
        1967,
        "NA"
      ],
      [
        1968,
        "NA"
      ],
      [
        1969,
        "NA"
      ],
      [
        1970,
        "NA"
      ],
      [
        1971,
        "NA"
      ],
      [
        1972,
        "NA"
      ],
      [
        1973,
        "NA"
      ],
      [
        1974,
        "NA"
      ],
      [
        1975,
        "NA"
      ],
      [
        1976,
        "NA"
      ],
      [
        1977,
        "NA"
      ],
      [
        1978,
        "NA"
      ],
      [
        1979,
        "NA"
      ],
      [
        1980,
        "NA"
      ],
      [
        1981,
        "NA"
      ],
      [
        1982,
        "NA"
      ],
      [
        1983,
        "NA"
      ],
      [
        1984,
        "NA"
      ],
      [
        1985,
        "NA"
      ],
      [
        1986,
        "NA"
      ],
      [
        1987,
        "NA"
      ],
      [
        1988,
        "NA"
      ],
      [
        1989,
        "NA"
      ],
      [
        1990,
        "NA"
      ],
      [
        1991,
        "NA"
      ],
      [
        1992,
        "NA"
      ],
      [
        1993,
        "NA"
      ],
      [
        1994,
        "NA"
      ],
      [
        1995,
        "NA"
      ],
      [
        1996,
        "NA"
      ],
      [
        1997,
        "NA"
      ],
      [
        1998,
        "NA"
      ],
      [
        1999,
        "NA"
      ],
      [
        2000,
        "NA"
      ],
      [
        2001,
        "NA"
      ],
      [
        2002,
        "NA"
      ],
      [
        2003,
        "NA"
      ],
      [
        2004,
        "NA"
      ],
      [
        2005,
        "NA"
      ],
      [
        2006,
        "NA"
      ],
      [
        2007,
        "NA"
      ],
      [
        2008,
        "NA"
      ],
      [
        2009,
        "NA"
      ],
      [
        2010,
        "NA"
      ],
      [
        2011,
        "NA"
      ],
      [
        2012,
        "NA"
      ],
      [
        2013,
        "NA"
      ],
      [
        2014,
        18.7671337128
      ],
      [
        2015,
        "NA"
      ],
      [
        2016,
        "NA"
      ],
      [
        2017,
        23.3242034912
      ],
      [
        2018,
        "NA"
      ],
      [
        2019,
        "NA"
      ]
    ],
    "croissance_pib": [
      [
        1960,
        "NA"
      ],
      [
        1961,
        "NA"
      ],
      [
        1962,
        "NA"
      ],
      [
        1963,
        "NA"
      ],
      [
        1964,
        "NA"
      ],
      [
        1965,
        "NA"
      ],
      [
        1966,
        3.4548678929000003
      ],
      [
        1967,
        0.1619524718
      ],
      [
        1968,
        10.4097285811
      ],
      [
        1969,
        4.7478154086
      ],
      [
        1970,
        4.6696317759
      ],
      [
        1971,
        10.5601974739
      ],
      [
        1972,
        17.7427182678
      ],
      [
        1973,
        -0.6546435047
      ],
      [
        1974,
        8.0747823315
      ],
      [
        1975,
        7.156099909299999
      ],
      [
        1976,
        7.8768526526
      ],
      [
        1977,
        3.4110958541
      ],
      [
        1978,
        6.4404735325999996
      ],
      [
        1979,
        6.5675211733
      ],
      [
        1980,
        7.4187395951
      ],
      [
        1981,
        5.5140728281
      ],
      [
        1982,
        -0.4937376025
      ],
      [
        1983,
        4.6819173838
      ],
      [
        1984,
        5.748843265
      ],
      [
        1985,
        5.6485732353
      ],
      [
        1986,
        -1.4469884138999998
      ],
      [
        1987,
        6.7013710953
      ],
      [
        1988,
        0.07215907790000001
      ],
      [
        1989,
        1.7466991291
      ],
      [
        1990,
        7.9498194359
      ],
      [
        1991,
        3.9045453012999998
      ],
      [
        1992,
        7.805728857
      ],
      [
        1993,
        2.1898288887
      ],
      [
        1994,
        3.1784113908
      ],
      [
        1995,
        2.3516698876
      ],
      [
        1996,
        7.1460808387
      ],
      [
        1997,
        5.4409434365
      ],
      [
        1998,
        4.7837625719
      ],
      [
        1999,
        6.054634515499999
      ],
      [
        2000,
        4.7098599454
      ],
      [
        2001,
        3.7961838270999997
      ],
      [
        2002,
        1.3225636178
      ],
      [
        2003,
        4.7024118149000005
      ],
      [
        2004,
        6.235793869299999
      ],
      [
        2005,
        3.4865358155
      ],
      [
        2006,
        5.244195184700001
      ],
      [
        2007,
        6.7096203918
      ],
      [
        2008,
        4.2377768357
      ],
      [
        2009,
        3.0434489548
      ],
      [
        2010,
        3.5106086386
      ],
      [
        2011,
        -1.9171776796000002
      ],
      [
        2012,
        3.9976740023
      ],
      [
        2013,
        2.8755238423000002
      ],
      [
        2014,
        2.9713983451
      ],
      [
        2015,
        1.1945417533
      ],
      [
        2016,
        1.262528588
      ],
      [
        2017,
        1.8246753278
      ],
      [
        2018,
        2.4828268382
      ],
      [
        2019,
        "NA"
      ]
    ],
    "eau_douce_agri": [
      [
        1960,
        "NA"
      ],
      [
        1961,
        "NA"
      ],
      [
        1962,
        "NA"
      ],
      [
        1963,
        "NA"
      ],
      [
        1964,
        "NA"
      ],
      [
        1965,
        "NA"
      ],
      [
        1966,
        "NA"
      ],
      [
        1967,
        "NA"
      ],
      [
        1968,
        "NA"
      ],
      [
        1969,
        "NA"
      ],
      [
        1970,
        "NA"
      ],
      [
        1971,
        "NA"
      ],
      [
        1972,
        "NA"
      ],
      [
        1973,
        "NA"
      ],
      [
        1974,
        "NA"
      ],
      [
        1975,
        "NA"
      ],
      [
        1976,
        "NA"
      ],
      [
        1977,
        "NA"
      ],
      [
        1978,
        "NA"
      ],
      [
        1979,
        "NA"
      ],
      [
        1980,
        "NA"
      ],
      [
        1981,
        "NA"
      ],
      [
        1982,
        "NA"
      ],
      [
        1983,
        "NA"
      ],
      [
        1984,
        "NA"
      ],
      [
        1985,
        "NA"
      ],
      [
        1986,
        "NA"
      ],
      [
        1987,
        "NA"
      ],
      [
        1988,
        "NA"
      ],
      [
        1989,
        "NA"
      ],
      [
        1990,
        88.72
      ],
      [
        1991,
        "NA"
      ],
      [
        1992,
        "NA"
      ],
      [
        1993,
        "NA"
      ],
      [
        1994,
        "NA"
      ],
      [
        1995,
        85.61
      ],
      [
        1996,
        "NA"
      ],
      [
        1997,
        "NA"
      ],
      [
        1998,
        "NA"
      ],
      [
        1999,
        "NA"
      ],
      [
        2000,
        "NA"
      ],
      [
        2001,
        75.96
      ],
      [
        2002,
        "NA"
      ],
      [
        2003,
        "NA"
      ],
      [
        2004,
        "NA"
      ],
      [
        2005,
        "NA"
      ],
      [
        2006,
        "NA"
      ],
      [
        2007,
        "NA"
      ],
      [
        2008,
        "NA"
      ],
      [
        2009,
        "NA"
      ],
      [
        2010,
        "NA"
      ],
      [
        2011,
        80.0
      ],
      [
        2012,
        "NA"
      ],
      [
        2013,
        "NA"
      ],
      [
        2014,
        "NA"
      ],
      [
        2015,
        "NA"
      ],
      [
        2016,
        "NA"
      ],
      [
        2017,
        "NA"
      ],
      [
        2018,
        "NA"
      ],
      [
        2019,
        "NA"
      ]
    ],
    "eau_potable_primaire": [
      [
        2000,
        "NA"
      ],
      [
        2001,
        "NA"
      ],
      [
        2002,
        "NA"
      ],
      [
        2003,
        "NA"
      ],
      [
        2004,
        "NA"
      ],
      [
        2005,
        "NA"
      ],
      [
        2006,
        "NA"
      ],
      [
        2007,
        "NA"
      ],
      [
        2008,
        "NA"
      ],
      [
        2009,
        "NA"
      ],
      [
        2010,
        "NA"
      ],
      [
        2011,
        "NA"
      ],
      [
        2012,
        "NA"
      ],
      [
        2013,
        "NA"
      ],
      [
        2014,
        "NA"
      ],
      [
        2015,
        "NA"
      ],
      [
        2016,
        "NA"
      ],
      [
        2017,
        88.54899999999998
      ],
      [
        2018,
        98.49684
      ],
      [
        2019,
        "NA"
      ]
    ],
    "emploi_agri": [
      [
        1960,
        "NA"
      ],
      [
        1961,
        "NA"
      ],
      [
        1962,
        "NA"
      ],
      [
        1963,
        "NA"
      ],
      [
        1964,
        "NA"
      ],
      [
        1965,
        "NA"
      ],
      [
        1966,
        "NA"
      ],
      [
        1967,
        "NA"
      ],
      [
        1968,
        "NA"
      ],
      [
        1969,
        "NA"
      ],
      [
        1970,
        "NA"
      ],
      [
        1971,
        "NA"
      ],
      [
        1972,
        "NA"
      ],
      [
        1973,
        "NA"
      ],
      [
        1974,
        "NA"
      ],
      [
        1975,
        "NA"
      ],
      [
        1976,
        "NA"
      ],
      [
        1977,
        "NA"
      ],
      [
        1978,
        "NA"
      ],
      [
        1979,
        "NA"
      ],
      [
        1980,
        "NA"
      ],
      [
        1981,
        "NA"
      ],
      [
        1982,
        "NA"
      ],
      [
        1983,
        "NA"
      ],
      [
        1984,
        "NA"
      ],
      [
        1985,
        "NA"
      ],
      [
        1986,
        "NA"
      ],
      [
        1987,
        "NA"
      ],
      [
        1988,
        "NA"
      ],
      [
        1989,
        "NA"
      ],
      [
        1990,
        "NA"
      ],
      [
        1991,
        23.357000351
      ],
      [
        1992,
        23.0960006714
      ],
      [
        1993,
        22.8579998016
      ],
      [
        1994,
        22.5489997864
      ],
      [
        1995,
        22.2999992371
      ],
      [
        1996,
        22.091999054000002
      ],
      [
        1997,
        21.719999313400002
      ],
      [
        1998,
        21.2520008087
      ],
      [
        1999,
        20.8829994202
      ],
      [
        2000,
        20.5240001678
      ],
      [
        2001,
        19.9640007019
      ],
      [
        2002,
        19.5559997559
      ],
      [
        2003,
        19.1919994354
      ],
      [
        2004,
        18.767000198399998
      ],
      [
        2005,
        18.5249996185
      ],
      [
        2006,
        19.4379997253
      ],
      [
        2007,
        18.7019996643
      ],
      [
        2008,
        18.0219993591
      ],
      [
        2009,
        18.471000671400002
      ],
      [
        2010,
        17.9459991455
      ],
      [
        2011,
        16.361000061
      ],
      [
        2012,
        17.0739994049
      ],
      [
        2013,
        15.364999771099999
      ],
      [
        2014,
        14.869999885599999
      ],
      [
        2015,
        14.508000373800002
      ],
      [
        2016,
        14.0629997253
      ],
      [
        2017,
        13.7119998932
      ],
      [
        2018,
        13.335000038099999
      ],
      [
        2019,
        13.0310001373
      ]
    ],
    "enseignant_primaire": [
      [
        1960,
        "NA"
      ],
      [
        1961,
        "NA"
      ],
      [
        1962,
        "NA"
      ],
      [
        1963,
        "NA"
      ],
      [
        1964,
        "NA"
      ],
      [
        1965,
        "NA"
      ],
      [
        1966,
        "NA"
      ],
      [
        1967,
        "NA"
      ],
      [
        1968,
        "NA"
      ],
      [
        1969,
        "NA"
      ],
      [
        1970,
        "NA"
      ],
      [
        1971,
        "NA"
      ],
      [
        1972,
        "NA"
      ],
      [
        1973,
        "NA"
      ],
      [
        1974,
        "NA"
      ],
      [
        1975,
        "NA"
      ],
      [
        1976,
        "NA"
      ],
      [
        1977,
        "NA"
      ],
      [
        1978,
        "NA"
      ],
      [
        1979,
        "NA"
      ],
      [
        1980,
        "NA"
      ],
      [
        1981,
        "NA"
      ],
      [
        1982,
        "NA"
      ],
      [
        1983,
        "NA"
      ],
      [
        1984,
        "NA"
      ],
      [
        1985,
        "NA"
      ],
      [
        1986,
        "NA"
      ],
      [
        1987,
        "NA"
      ],
      [
        1988,
        "NA"
      ],
      [
        1989,
        "NA"
      ],
      [
        1990,
        "NA"
      ],
      [
        1991,
        "NA"
      ],
      [
        1992,
        "NA"
      ],
      [
        1993,
        "NA"
      ],
      [
        1994,
        "NA"
      ],
      [
        1995,
        "NA"
      ],
      [
        1996,
        "NA"
      ],
      [
        1997,
        "NA"
      ],
      [
        1998,
        "NA"
      ],
      [
        1999,
        "NA"
      ],
      [
        2000,
        "NA"
      ],
      [
        2001,
        "NA"
      ],
      [
        2002,
        "NA"
      ],
      [
        2003,
        "NA"
      ],
      [
        2004,
        "NA"
      ],
      [
        2005,
        "NA"
      ],
      [
        2006,
        "NA"
      ],
      [
        2007,
        "NA"
      ],
      [
        2008,
        "NA"
      ],
      [
        2009,
        "NA"
      ],
      [
        2010,
        "NA"
      ],
      [
        2011,
        "NA"
      ],
      [
        2012,
        100.0
      ],
      [
        2013,
        100.0
      ],
      [
        2014,
        100.0
      ],
      [
        2015,
        100.0
      ],
      [
        2016,
        100.0
      ],
      [
        2017,
        100.0
      ],
      [
        2018,
        100.0
      ],
      [
        2019,
        "NA"
      ]
    ],
    "enseignant_secondaire": [
      [
        1960,
        "NA"
      ],
      [
        1961,
        "NA"
      ],
      [
        1962,
        "NA"
      ],
      [
        1963,
        "NA"
      ],
      [
        1964,
        "NA"
      ],
      [
        1965,
        "NA"
      ],
      [
        1966,
        "NA"
      ],
      [
        1967,
        "NA"
      ],
      [
        1968,
        "NA"
      ],
      [
        1969,
        "NA"
      ],
      [
        1970,
        "NA"
      ],
      [
        1971,
        "NA"
      ],
      [
        1972,
        "NA"
      ],
      [
        1973,
        "NA"
      ],
      [
        1974,
        "NA"
      ],
      [
        1975,
        "NA"
      ],
      [
        1976,
        "NA"
      ],
      [
        1977,
        "NA"
      ],
      [
        1978,
        "NA"
      ],
      [
        1979,
        "NA"
      ],
      [
        1980,
        "NA"
      ],
      [
        1981,
        "NA"
      ],
      [
        1982,
        "NA"
      ],
      [
        1983,
        "NA"
      ],
      [
        1984,
        "NA"
      ],
      [
        1985,
        "NA"
      ],
      [
        1986,
        "NA"
      ],
      [
        1987,
        "NA"
      ],
      [
        1988,
        "NA"
      ],
      [
        1989,
        "NA"
      ],
      [
        1990,
        "NA"
      ],
      [
        1991,
        "NA"
      ],
      [
        1992,
        "NA"
      ],
      [
        1993,
        "NA"
      ],
      [
        1994,
        "NA"
      ],
      [
        1995,
        "NA"
      ],
      [
        1996,
        "NA"
      ],
      [
        1997,
        "NA"
      ],
      [
        1998,
        "NA"
      ],
      [
        1999,
        "NA"
      ],
      [
        2000,
        "NA"
      ],
      [
        2001,
        "NA"
      ],
      [
        2002,
        "NA"
      ],
      [
        2003,
        "NA"
      ],
      [
        2004,
        "NA"
      ],
      [
        2005,
        "NA"
      ],
      [
        2006,
        "NA"
      ],
      [
        2007,
        "NA"
      ],
      [
        2008,
        "NA"
      ],
      [
        2009,
        "NA"
      ],
      [
        2010,
        "NA"
      ],
      [
        2011,
        "NA"
      ],
      [
        2012,
        "NA"
      ],
      [
        2013,
        "NA"
      ],
      [
        2014,
        "NA"
      ],
      [
        2015,
        "NA"
      ],
      [
        2016,
        "NA"
      ],
      [
        2017,
        100.0
      ],
      [
        2018,
        100.0
      ],
      [
        2019,
        "NA"
      ]
    ],
    "frag_pol": [
      [
        2006,
        0.0
      ],
      [
        2007,
        0.0
      ],
      [
        2008,
        0.0
      ],
      [
        2009,
        0.0
      ],
      [
        2010,
        0.0
      ],
      [
        2011,
        0.0
      ],
      [
        2012,
        0.0
      ],
      [
        2013,
        0.0
      ],
      [
        2014,
        0.0
      ],
      [
        2015,
        0.0
      ],
      [
        2016,
        0.0
      ],
      [
        2017,
        0.0
      ]
    ],
    "idh": [
      [
        1990,
        0.569
      ],
      [
        1991,
        0.575
      ],
      [
        1992,
        0.583
      ],
      [
        1993,
        0.589
      ],
      [
        1994,
        0.6
      ],
      [
        1995,
        0.607
      ],
      [
        1996,
        0.616
      ],
      [
        1997,
        0.623
      ],
      [
        1998,
        0.634
      ],
      [
        1999,
        0.645
      ],
      [
        2000,
        0.653
      ],
      [
        2001,
        0.6609999999999999
      ],
      [
        2002,
        0.6659999999999999
      ],
      [
        2003,
        0.6729999999999999
      ],
      [
        2004,
        0.682
      ],
      [
        2005,
        0.6890000000000001
      ],
      [
        2006,
        0.695
      ],
      [
        2007,
        0.701
      ],
      [
        2008,
        0.7070000000000001
      ],
      [
        2009,
        0.71
      ],
      [
        2010,
        0.716
      ],
      [
        2011,
        0.718
      ],
      [
        2012,
        0.7190000000000001
      ],
      [
        2013,
        0.723
      ],
      [
        2014,
        0.725
      ],
      [
        2015,
        0.728
      ],
      [
        2016,
        0.732
      ],
      [
        2017,
        0.735
      ]
    ],
    "incub_start_up": [
      [
        2016,
        15.0
      ],
      [
        2018,
        17.0
      ]
    ],
    "lib_monde": [
      [
        2013,
        2.0
      ],
      [
        2014,
        2.0
      ],
      [
        2015,
        3.0
      ],
      [
        2016,
        3.0
      ],
      [
        2017,
        3.0
      ],
      [
        2018,
        3.0
      ]
    ],
    "migration": [
      [
        1955,
        -0.9890000000000001
      ],
      [
        1960,
        -9.394
      ],
      [
        1965,
        -6.532
      ],
      [
        1970,
        -4.0169999999999995
      ],
      [
        1975,
        -3.622
      ],
      [
        1980,
        -2.396
      ],
      [
        1985,
        2.498
      ],
      [
        1990,
        1.2590000000000001
      ],
      [
        1995,
        3.2319999999999998
      ],
      [
        2000,
        -0.845
      ],
      [
        2005,
        -2.888
      ],
      [
        2010,
        -0.784
      ],
      [
        2015,
        -2.75
      ],
      [
        2020,
        -0.348
      ],
      [
        2025,
        -0.331
      ],
      [
        2030,
        -0.319
      ],
      [
        2035,
        -0.31
      ],
      [
        2040,
        -0.303
      ],
      [
        2045,
        -0.297
      ],
      [
        2050,
        -0.292
      ],
      [
        2055,
        -0.289
      ],
      [
        2060,
        -0.287
      ],
      [
        2065,
        -0.287
      ],
      [
        2070,
        -0.28800000000000003
      ],
      [
        2075,
        -0.29
      ],
      [
        2080,
        -0.292
      ],
      [
        2085,
        -0.295
      ],
      [
        2090,
        -0.298
      ],
      [
        2095,
        -0.302
      ],
      [
        2100,
        -0.306
      ]
    ],
    "mortal_infant": [
      [
        1960,
        "NA"
      ],
      [
        1961,
        "NA"
      ],
      [
        1962,
        272.9
      ],
      [
        1963,
        260.0
      ],
      [
        1964,
        247.5
      ],
      [
        1965,
        235.3
      ],
      [
        1966,
        223.4
      ],
      [
        1967,
        211.8
      ],
      [
        1968,
        200.5
      ],
      [
        1969,
        189.8
      ],
      [
        1970,
        179.6
      ],
      [
        1971,
        170.0
      ],
      [
        1972,
        160.8
      ],
      [
        1973,
        151.9
      ],
      [
        1974,
        143.0
      ],
      [
        1975,
        134.2
      ],
      [
        1976,
        125.4
      ],
      [
        1977,
        117.0
      ],
      [
        1978,
        109.2
      ],
      [
        1979,
        102.0
      ],
      [
        1980,
        95.5
      ],
      [
        1981,
        89.7
      ],
      [
        1982,
        84.6
      ],
      [
        1983,
        79.7
      ],
      [
        1984,
        75.1
      ],
      [
        1985,
        71.0
      ],
      [
        1986,
        67.2
      ],
      [
        1987,
        63.8
      ],
      [
        1988,
        60.7
      ],
      [
        1989,
        58.0
      ],
      [
        1990,
        55.5
      ],
      [
        1991,
        53.0
      ],
      [
        1992,
        50.6
      ],
      [
        1993,
        48.1
      ],
      [
        1994,
        45.5
      ],
      [
        1995,
        42.8
      ],
      [
        1996,
        40.1
      ],
      [
        1997,
        37.4
      ],
      [
        1998,
        34.7
      ],
      [
        1999,
        32.3
      ],
      [
        2000,
        30.0
      ],
      [
        2001,
        28.0
      ],
      [
        2002,
        26.2
      ],
      [
        2003,
        24.7
      ],
      [
        2004,
        23.3
      ],
      [
        2005,
        22.1
      ],
      [
        2006,
        21.1
      ],
      [
        2007,
        20.2
      ],
      [
        2008,
        19.4
      ],
      [
        2009,
        18.9
      ],
      [
        2010,
        18.4
      ],
      [
        2011,
        18.0
      ],
      [
        2012,
        17.7
      ],
      [
        2013,
        17.5
      ],
      [
        2014,
        17.3
      ],
      [
        2015,
        17.2
      ],
      [
        2016,
        17.1
      ],
      [
        2017,
        17.1
      ],
      [
        2018,
        17.0
      ],
      [
        2019,
        "NA"
      ]
    ],
    "pib": [
      [
        1980,
        9.566
      ],
      [
        1981,
        9.222999999999999
      ],
      [
        1982,
        8.9
      ],
      [
        1983,
        9.202
      ],
      [
        1984,
        9.054
      ],
      [
        1985,
        9.245
      ],
      [
        1986,
        9.91
      ],
      [
        1987,
        10.663
      ],
      [
        1988,
        11.073
      ],
      [
        1989,
        11.069
      ],
      [
        1990,
        13.474
      ],
      [
        1991,
        14.202
      ],
      [
        1992,
        16.977999999999998
      ],
      [
        1993,
        15.944
      ],
      [
        1994,
        17.052
      ],
      [
        1995,
        19.654
      ],
      [
        1996,
        21.283
      ],
      [
        1997,
        20.747
      ],
      [
        1998,
        21.803
      ],
      [
        1999,
        22.943
      ],
      [
        2000,
        21.474
      ],
      [
        2001,
        22.066
      ],
      [
        2002,
        23.142
      ],
      [
        2003,
        27.454
      ],
      [
        2004,
        31.184
      ],
      [
        2005,
        32.272
      ],
      [
        2006,
        34.376999999999995
      ],
      [
        2007,
        38.915
      ],
      [
        2008,
        44.843999999999994
      ],
      [
        2009,
        43.466
      ],
      [
        2010,
        44.053999999999995
      ],
      [
        2011,
        45.81
      ],
      [
        2012,
        45.044
      ],
      [
        2013,
        46.248000000000005
      ],
      [
        2014,
        47.63399999999999
      ],
      [
        2015,
        43.152
      ],
      [
        2016,
        41.802
      ],
      [
        2017,
        39.817
      ],
      [
        2018,
        39.895
      ],
      [
        2019,
        38.732
      ],
      [
        2020,
        39.61
      ],
      [
        2021,
        37.971
      ],
      [
        2022,
        38.461
      ],
      [
        2023,
        41.205
      ],
      [
        2024,
        44.791000000000004
      ]
    ],
    "pib_hab": [
      [
        1980,
        1482.8229999999999
      ],
      [
        1981,
        1390.414
      ],
      [
        1982,
        1309.899
      ],
      [
        1983,
        1322.84
      ],
      [
        1984,
        1286.6
      ],
      [
        1985,
        1271.845
      ],
      [
        1986,
        1312.226
      ],
      [
        1987,
        1382.408
      ],
      [
        1988,
        1411.506
      ],
      [
        1989,
        1386.015
      ],
      [
        1990,
        1636.6429999999998
      ],
      [
        1991,
        1687.19
      ],
      [
        1992,
        1973.4460000000001
      ],
      [
        1993,
        1814.879
      ],
      [
        1994,
        1903.845
      ],
      [
        1995,
        2156.4539999999997
      ],
      [
        1996,
        2299.375
      ],
      [
        1997,
        2210.8089999999997
      ],
      [
        1998,
        2295.188
      ],
      [
        1999,
        2388.986
      ],
      [
        2000,
        2213.949
      ],
      [
        2001,
        2254.913
      ],
      [
        2002,
        2345.99
      ],
      [
        2003,
        2762.051
      ],
      [
        2004,
        3112.91
      ],
      [
        2005,
        3194.48
      ],
      [
        2006,
        3371.538
      ],
      [
        2007,
        3778.8909999999996
      ],
      [
        2008,
        4308.911
      ],
      [
        2009,
        4131.023
      ],
      [
        2010,
        4140.465
      ],
      [
        2011,
        4256.837
      ],
      [
        2012,
        4137.572
      ],
      [
        2013,
        4198.849
      ],
      [
        2014,
        4274.467000000001
      ],
      [
        2015,
        3827.64
      ],
      [
        2016,
        3665.802
      ],
      [
        2017,
        3452.6679999999997
      ],
      [
        2018,
        3421.777
      ],
      [
        2019,
        3287.085
      ],
      [
        2020,
        3327.722
      ],
      [
        2021,
        3159.34
      ],
      [
        2022,
        3170.987
      ],
      [
        2023,
        3367.881
      ],
      [
        2024,
        3631.0559999999996
      ]
    ],
    "pib_ppa": [
      [
        1980,
        13.867
      ],
      [
        1981,
        16.017
      ],
      [
        1982,
        16.925
      ],
      [
        1983,
        18.41
      ],
      [
        1984,
        20.167
      ],
      [
        1985,
        21.985
      ],
      [
        1986,
        22.101
      ],
      [
        1987,
        24.166
      ],
      [
        1988,
        25.035999999999998
      ],
      [
        1989,
        26.688000000000002
      ],
      [
        1990,
        29.646
      ],
      [
        1991,
        31.916999999999998
      ],
      [
        1992,
        35.259
      ],
      [
        1993,
        36.988
      ],
      [
        1994,
        39.148
      ],
      [
        1995,
        41.037
      ],
      [
        1996,
        44.653
      ],
      [
        1997,
        48.023
      ],
      [
        1998,
        50.974
      ],
      [
        1999,
        54.821999999999996
      ],
      [
        2000,
        58.457
      ],
      [
        2001,
        62.007
      ],
      [
        2002,
        63.821000000000005
      ],
      [
        2003,
        68.063
      ],
      [
        2004,
        74.253
      ],
      [
        2005,
        79.236
      ],
      [
        2006,
        85.915
      ],
      [
        2007,
        94.14200000000001
      ],
      [
        2008,
        100.04
      ],
      [
        2009,
        103.87100000000001
      ],
      [
        2010,
        108.771
      ],
      [
        2011,
        108.913
      ],
      [
        2012,
        115.541
      ],
      [
        2013,
        120.885
      ],
      [
        2014,
        126.66
      ],
      [
        2015,
        129.47
      ],
      [
        2016,
        132.445
      ],
      [
        2017,
        137.528
      ],
      [
        2018,
        144.631
      ],
      [
        2019,
        148.688
      ],
      [
        2020,
        143.234
      ],
      [
        2021,
        151.994
      ]
    ],
    "pop_pauvrete": [
      [
        1960,
        "NA"
      ],
      [
        1961,
        "NA"
      ],
      [
        1962,
        "NA"
      ],
      [
        1963,
        "NA"
      ],
      [
        1964,
        "NA"
      ],
      [
        1965,
        "NA"
      ],
      [
        1966,
        "NA"
      ],
      [
        1967,
        "NA"
      ],
      [
        1968,
        "NA"
      ],
      [
        1969,
        "NA"
      ],
      [
        1970,
        "NA"
      ],
      [
        1971,
        "NA"
      ],
      [
        1972,
        "NA"
      ],
      [
        1973,
        "NA"
      ],
      [
        1974,
        "NA"
      ],
      [
        1975,
        "NA"
      ],
      [
        1976,
        "NA"
      ],
      [
        1977,
        "NA"
      ],
      [
        1978,
        "NA"
      ],
      [
        1979,
        "NA"
      ],
      [
        1980,
        "NA"
      ],
      [
        1981,
        "NA"
      ],
      [
        1982,
        "NA"
      ],
      [
        1983,
        "NA"
      ],
      [
        1984,
        "NA"
      ],
      [
        1985,
        15.1
      ],
      [
        1986,
        "NA"
      ],
      [
        1987,
        "NA"
      ],
      [
        1988,
        "NA"
      ],
      [
        1989,
        "NA"
      ],
      [
        1990,
        10.7
      ],
      [
        1991,
        "NA"
      ],
      [
        1992,
        "NA"
      ],
      [
        1993,
        "NA"
      ],
      [
        1994,
        "NA"
      ],
      [
        1995,
        11.8
      ],
      [
        1996,
        "NA"
      ],
      [
        1997,
        "NA"
      ],
      [
        1998,
        "NA"
      ],
      [
        1999,
        "NA"
      ],
      [
        2000,
        6.0
      ],
      [
        2001,
        "NA"
      ],
      [
        2002,
        "NA"
      ],
      [
        2003,
        "NA"
      ],
      [
        2004,
        "NA"
      ],
      [
        2005,
        3.4
      ],
      [
        2006,
        "NA"
      ],
      [
        2007,
        "NA"
      ],
      [
        2008,
        "NA"
      ],
      [
        2009,
        "NA"
      ],
      [
        2010,
        2.0
      ],
      [
        2011,
        "NA"
      ],
      [
        2012,
        "NA"
      ],
      [
        2013,
        "NA"
      ],
      [
        2014,
        "NA"
      ],
      [
        2015,
        0.2
      ],
      [
        2016,
        "NA"
      ],
      [
        2017,
        "NA"
      ],
      [
        2018,
        "NA"
      ],
      [
        2019,
        "NA"
      ]
    ],
    "pop_rurale": [
      [
        1960,
        62.489
      ],
      [
        1961,
        62.05
      ],
      [
        1962,
        61.608999999999995
      ],
      [
        1963,
        61.167
      ],
      [
        1964,
        60.721000000000004
      ],
      [
        1965,
        60.276
      ],
      [
        1966,
        59.77
      ],
      [
        1967,
        58.964
      ],
      [
        1968,
        58.152
      ],
      [
        1969,
        57.338
      ],
      [
        1970,
        56.518
      ],
      [
        1971,
        55.695
      ],
      [
        1972,
        54.868
      ],
      [
        1973,
        54.041000000000004
      ],
      [
        1974,
        53.21
      ],
      [
        1975,
        52.412
      ],
      [
        1976,
        51.816
      ],
      [
        1977,
        51.221000000000004
      ],
      [
        1978,
        50.625
      ],
      [
        1979,
        50.028
      ],
      [
        1980,
        49.431000000000004
      ],
      [
        1981,
        48.836000000000006
      ],
      [
        1982,
        48.24
      ],
      [
        1983,
        47.644
      ],
      [
        1984,
        46.989
      ],
      [
        1985,
        46.161
      ],
      [
        1986,
        45.333
      ],
      [
        1987,
        44.50899999999999
      ],
      [
        1988,
        43.68600000000001
      ],
      [
        1989,
        42.869
      ],
      [
        1990,
        42.053999999999995
      ],
      [
        1991,
        41.244
      ],
      [
        1992,
        40.438
      ],
      [
        1993,
        39.638000000000005
      ],
      [
        1994,
        38.922
      ],
      [
        1995,
        38.525999999999996
      ],
      [
        1996,
        38.13
      ],
      [
        1997,
        37.738
      ],
      [
        1998,
        37.347
      ],
      [
        1999,
        36.957
      ],
      [
        2000,
        36.568000000000005
      ],
      [
        2001,
        36.181999999999995
      ],
      [
        2002,
        35.798
      ],
      [
        2003,
        35.415
      ],
      [
        2004,
        35.05
      ],
      [
        2005,
        34.763000000000005
      ],
      [
        2006,
        34.476
      ],
      [
        2007,
        34.191
      ],
      [
        2008,
        33.907
      ],
      [
        2009,
        33.624
      ],
      [
        2010,
        33.343
      ],
      [
        2011,
        33.062
      ],
      [
        2012,
        32.782
      ],
      [
        2013,
        32.505
      ],
      [
        2014,
        32.228
      ],
      [
        2015,
        31.944000000000003
      ],
      [
        2016,
        31.654
      ],
      [
        2017,
        31.358
      ],
      [
        2018,
        31.055
      ],
      [
        2019,
        "NA"
      ]
    ],
    "pop_tot": [
      [
        1950,
        3.6053059999999997
      ],
      [
        1951,
        3.696166
      ],
      [
        1952,
        3.772928
      ],
      [
        1953,
        3.8380769999999997
      ],
      [
        1954,
        3.8941230000000004
      ],
      [
        1955,
        3.94354
      ],
      [
        1956,
        3.988862
      ],
      [
        1957,
        4.032592
      ],
      [
        1958,
        4.077203
      ],
      [
        1959,
        4.125083
      ],
      [
        1960,
        4.178236
      ],
      [
        1961,
        4.238142
      ],
      [
        1962,
        4.305481
      ],
      [
        1963,
        4.3800680000000005
      ],
      [
        1964,
        4.4611139999999985
      ],
      [
        1965,
        4.547941000000001
      ],
      [
        1966,
        4.641
      ],
      [
        1967,
        4.7405110000000015
      ],
      [
        1968,
        4.845219
      ],
      [
        1969,
        4.9533900000000015
      ],
      [
        1970,
        5.063809
      ],
      [
        1971,
        5.176295
      ],
      [
        1972,
        5.291338
      ],
      [
        1973,
        5.409343
      ],
      [
        1974,
        5.5309750000000015
      ],
      [
        1975,
        5.656914
      ],
      [
        1976,
        5.786478
      ],
      [
        1977,
        5.919965
      ],
      [
        1978,
        6.0601509999999985
      ],
      [
        1979,
        6.210756
      ],
      [
        1980,
        6.374039
      ],
      [
        1981,
        6.551231
      ],
      [
        1982,
        6.7405289999999995
      ],
      [
        1983,
        6.9373309999999995
      ],
      [
        1984,
        7.135269999999999
      ],
      [
        1985,
        7.329594
      ],
      [
        1986,
        7.517858
      ],
      [
        1987,
        7.700736
      ],
      [
        1988,
        7.880332000000001
      ],
      [
        1989,
        8.060210000000001
      ],
      [
        1990,
        8.242496000000001
      ],
      [
        1991,
        8.427857000000001
      ],
      [
        1992,
        8.613861
      ],
      [
        1993,
        8.795932
      ],
      [
        1994,
        8.967915999999997
      ],
      [
        1995,
        9.125398
      ],
      [
        1996,
        9.267339999999999
      ],
      [
        1997,
        9.395123
      ],
      [
        1998,
        9.509857
      ],
      [
        1999,
        9.613588
      ],
      [
        2000,
        9.70835
      ],
      [
        2001,
        9.793903
      ],
      [
        2002,
        9.871250999999999
      ],
      [
        2003,
        9.945277
      ],
      [
        2004,
        10.022277
      ],
      [
        2005,
        10.106771
      ],
      [
        2006,
        10.201214
      ],
      [
        2007,
        10.304725999999999
      ],
      [
        2008,
        10.414433
      ],
      [
        2009,
        10.525694
      ],
      [
        2010,
        10.635244
      ],
      [
        2011,
        10.741879999999998
      ],
      [
        2012,
        10.847002
      ],
      [
        2013,
        10.952951
      ],
      [
        2014,
        11.063201
      ],
      [
        2015,
        11.179949
      ],
      [
        2016,
        11.303945
      ],
      [
        2017,
        11.433443
      ],
      [
        2018,
        11.565200999999998
      ],
      [
        2019,
        11.694719000000001
      ],
      [
        2020,
        11.818619
      ],
      [
        2021,
        11.935766000000001
      ],
      [
        2022,
        12.046656
      ],
      [
        2023,
        12.151566999999998
      ],
      [
        2024,
        12.251381
      ],
      [
        2025,
        12.346741999999999
      ],
      [
        2026,
        12.437545
      ],
      [
        2027,
        12.523469
      ],
      [
        2028,
        12.604853
      ],
      [
        2029,
        12.682149
      ],
      [
        2030,
        12.755757000000001
      ],
      [
        2031,
        12.825881
      ],
      [
        2032,
        12.892686
      ],
      [
        2033,
        12.956627
      ],
      [
        2034,
        13.018222
      ],
      [
        2035,
        13.077865
      ],
      [
        2036,
        13.13579
      ],
      [
        2037,
        13.192097
      ],
      [
        2038,
        13.246986
      ],
      [
        2039,
        13.300645999999999
      ],
      [
        2040,
        13.353185
      ],
      [
        2041,
        13.404685999999998
      ],
      [
        2042,
        13.455113
      ],
      [
        2043,
        13.504297
      ],
      [
        2044,
        13.551998999999999
      ],
      [
        2045,
        13.597966
      ],
      [
        2046,
        13.64214
      ],
      [
        2047,
        13.684409
      ],
      [
        2048,
        13.724460999999998
      ],
      [
        2049,
        13.761959
      ],
      [
        2050,
        13.7966
      ],
      [
        2051,
        13.82826
      ],
      [
        2052,
        13.856859
      ],
      [
        2053,
        13.882247
      ],
      [
        2054,
        13.904279999999998
      ],
      [
        2055,
        13.922835999999998
      ],
      [
        2056,
        13.937888
      ],
      [
        2057,
        13.949459
      ],
      [
        2058,
        13.957629
      ],
      [
        2059,
        13.962515
      ],
      [
        2060,
        13.964270999999998
      ],
      [
        2061,
        13.962982
      ],
      [
        2062,
        13.958744
      ],
      [
        2063,
        13.951803
      ],
      [
        2064,
        13.942444
      ],
      [
        2065,
        13.930904
      ],
      [
        2066,
        13.917357999999998
      ],
      [
        2067,
        13.901955
      ],
      [
        2068,
        13.884903
      ],
      [
        2069,
        13.866491
      ],
      [
        2070,
        13.846917999999999
      ],
      [
        2071,
        13.826332999999998
      ],
      [
        2072,
        13.804874
      ],
      [
        2073,
        13.782662
      ],
      [
        2074,
        13.759828
      ],
      [
        2075,
        13.736476000000001
      ],
      [
        2076,
        13.712691
      ],
      [
        2077,
        13.688532999999998
      ],
      [
        2078,
        13.664036999999999
      ],
      [
        2079,
        13.639215
      ],
      [
        2080,
        13.614084
      ],
      [
        2081,
        13.588632999999998
      ],
      [
        2082,
        13.562868
      ],
      [
        2083,
        13.536757000000001
      ],
      [
        2084,
        13.51022
      ],
      [
        2085,
        13.483204999999998
      ],
      [
        2086,
        13.455673999999998
      ],
      [
        2087,
        13.427579999999999
      ],
      [
        2088,
        13.398821
      ],
      [
        2089,
        13.369254000000002
      ],
      [
        2090,
        13.338788
      ],
      [
        2091,
        13.307325
      ],
      [
        2092,
        13.274834
      ],
      [
        2093,
        13.24126
      ],
      [
        2094,
        13.206598999999999
      ],
      [
        2095,
        13.170781000000002
      ],
      [
        2096,
        13.133782
      ],
      [
        2097,
        13.095532
      ],
      [
        2098,
        13.055928999999999
      ],
      [
        2099,
        13.014886
      ],
      [
        2100,
        12.972292999999999
      ]
    ],
    "pop_urbaine": [
      [
        1960,
        37.510999999999996
      ],
      [
        1961,
        37.95
      ],
      [
        1962,
        38.391
      ],
      [
        1963,
        38.833
      ],
      [
        1964,
        39.279
      ],
      [
        1965,
        39.724000000000004
      ],
      [
        1966,
        40.23
      ],
      [
        1967,
        41.036
      ],
      [
        1968,
        41.848
      ],
      [
        1969,
        42.662
      ],
      [
        1970,
        43.482
      ],
      [
        1971,
        44.305
      ],
      [
        1972,
        45.132
      ],
      [
        1973,
        45.958999999999996
      ],
      [
        1974,
        46.79
      ],
      [
        1975,
        47.588
      ],
      [
        1976,
        48.184
      ],
      [
        1977,
        48.778999999999996
      ],
      [
        1978,
        49.375
      ],
      [
        1979,
        49.972
      ],
      [
        1980,
        50.568999999999996
      ],
      [
        1981,
        51.163999999999994
      ],
      [
        1982,
        51.76
      ],
      [
        1983,
        52.356
      ],
      [
        1984,
        53.011
      ],
      [
        1985,
        53.839
      ],
      [
        1986,
        54.667
      ],
      [
        1987,
        55.49100000000001
      ],
      [
        1988,
        56.31399999999999
      ],
      [
        1989,
        57.131
      ],
      [
        1990,
        57.946000000000005
      ],
      [
        1991,
        58.756
      ],
      [
        1992,
        59.562
      ],
      [
        1993,
        60.361999999999995
      ],
      [
        1994,
        61.078
      ],
      [
        1995,
        61.474
      ],
      [
        1996,
        61.87
      ],
      [
        1997,
        62.262
      ],
      [
        1998,
        62.653
      ],
      [
        1999,
        63.043
      ],
      [
        2000,
        63.431999999999995
      ],
      [
        2001,
        63.818000000000005
      ],
      [
        2002,
        64.202
      ],
      [
        2003,
        64.585
      ],
      [
        2004,
        64.95
      ],
      [
        2005,
        65.237
      ],
      [
        2006,
        65.524
      ],
      [
        2007,
        65.809
      ],
      [
        2008,
        66.093
      ],
      [
        2009,
        66.376
      ],
      [
        2010,
        66.657
      ],
      [
        2011,
        66.938
      ],
      [
        2012,
        67.218
      ],
      [
        2013,
        67.495
      ],
      [
        2014,
        67.77199999999999
      ],
      [
        2015,
        68.056
      ],
      [
        2016,
        68.346
      ],
      [
        2017,
        68.642
      ],
      [
        2018,
        68.945
      ],
      [
        2019,
        "NA"
      ]
    ],
    "prod_elec_renouv": [
      [
        1960,
        "NA"
      ],
      [
        1961,
        "NA"
      ],
      [
        1962,
        "NA"
      ],
      [
        1963,
        "NA"
      ],
      [
        1964,
        "NA"
      ],
      [
        1965,
        "NA"
      ],
      [
        1966,
        "NA"
      ],
      [
        1967,
        "NA"
      ],
      [
        1968,
        "NA"
      ],
      [
        1969,
        "NA"
      ],
      [
        1970,
        "NA"
      ],
      [
        1971,
        0.0
      ],
      [
        1972,
        0.0
      ],
      [
        1973,
        0.0
      ],
      [
        1974,
        0.0
      ],
      [
        1975,
        0.0
      ],
      [
        1976,
        0.0
      ],
      [
        1977,
        0.0
      ],
      [
        1978,
        0.0
      ],
      [
        1979,
        0.0
      ],
      [
        1980,
        0.0
      ],
      [
        1981,
        0.0
      ],
      [
        1982,
        0.0
      ],
      [
        1983,
        0.0
      ],
      [
        1984,
        0.0
      ],
      [
        1985,
        0.0
      ],
      [
        1986,
        0.0
      ],
      [
        1987,
        0.0
      ],
      [
        1988,
        0.0
      ],
      [
        1989,
        0.0
      ],
      [
        1990,
        0.0
      ],
      [
        1991,
        0.0
      ],
      [
        1992,
        0.0
      ],
      [
        1993,
        0.0
      ],
      [
        1994,
        0.0
      ],
      [
        1995,
        0.0
      ],
      [
        1996,
        0.0
      ],
      [
        1997,
        0.0
      ],
      [
        1998,
        0.0
      ],
      [
        1999,
        0.0
      ],
      [
        2000,
        0.2170630427
      ],
      [
        2001,
        0.2106741573
      ],
      [
        2002,
        0.25335698
      ],
      [
        2003,
        0.29229406550000003
      ],
      [
        2004,
        0.36850921270000003
      ],
      [
        2005,
        0.3317273517
      ],
      [
        2006,
        0.2909425006
      ],
      [
        2007,
        0.31297765489999996
      ],
      [
        2008,
        0.2715310172
      ],
      [
        2009,
        0.6359821663
      ],
      [
        2010,
        0.855118495
      ],
      [
        2011,
        0.672849609
      ],
      [
        2012,
        1.1128951885
      ],
      [
        2013,
        2.0075077526
      ],
      [
        2014,
        2.7704004582999997
      ],
      [
        2015,
        2.485261232
      ],
      [
        2016,
        "NA"
      ],
      [
        2017,
        "NA"
      ],
      [
        2018,
        "NA"
      ],
      [
        2019,
        "NA"
      ]
    ],
    "rdt_cerealier": [
      [
        1960,
        "NA"
      ],
      [
        1961,
        499.2
      ],
      [
        1962,
        729.5
      ],
      [
        1963,
        749.6
      ],
      [
        1964,
        641.6
      ],
      [
        1965,
        738.8
      ],
      [
        1966,
        693.1
      ],
      [
        1967,
        618.8
      ],
      [
        1968,
        701.1
      ],
      [
        1969,
        662.6
      ],
      [
        1970,
        553.5
      ],
      [
        1971,
        713.9
      ],
      [
        1972,
        905.4
      ],
      [
        1973,
        825.3
      ],
      [
        1974,
        813.8
      ],
      [
        1975,
        931.6
      ],
      [
        1976,
        734.0
      ],
      [
        1977,
        712.7
      ],
      [
        1978,
        667.5
      ],
      [
        1979,
        597.0
      ],
      [
        1980,
        915.5
      ],
      [
        1981,
        971.7
      ],
      [
        1982,
        1086.1
      ],
      [
        1983,
        582.9
      ],
      [
        1984,
        716.9
      ],
      [
        1985,
        1084.8
      ],
      [
        1986,
        758.5
      ],
      [
        1987,
        1154.9
      ],
      [
        1988,
        935.7
      ],
      [
        1989,
        642.8
      ],
      [
        1990,
        1144.6
      ],
      [
        1991,
        1546.3
      ],
      [
        1992,
        1516.8
      ],
      [
        1993,
        1210.3
      ],
      [
        1994,
        893.9
      ],
      [
        1995,
        1109.8
      ],
      [
        1996,
        1447.1
      ],
      [
        1997,
        1061.2
      ],
      [
        1998,
        1296.0
      ],
      [
        1999,
        1229.0
      ],
      [
        2000,
        984.5
      ],
      [
        2001,
        1715.3
      ],
      [
        2002,
        1233.7
      ],
      [
        2003,
        1515.5
      ],
      [
        2004,
        1309.6
      ],
      [
        2005,
        1442.8
      ],
      [
        2006,
        1256.1
      ],
      [
        2007,
        1622.5
      ],
      [
        2008,
        1467.3
      ],
      [
        2009,
        1877.6
      ],
      [
        2010,
        1694.1
      ],
      [
        2011,
        1710.8
      ],
      [
        2012,
        1674.3
      ],
      [
        2013,
        1136.2
      ],
      [
        2014,
        1805.7
      ],
      [
        2015,
        1102.7
      ],
      [
        2016,
        1542.2
      ],
      [
        2017,
        1532.9
      ],
      [
        2018,
        "NA"
      ],
      [
        2019,
        "NA"
      ]
    ],
    "recette_budg": [
      [
        1980,
        "NA"
      ],
      [
        1981,
        "NA"
      ],
      [
        1982,
        "NA"
      ],
      [
        1983,
        "NA"
      ],
      [
        1984,
        "NA"
      ],
      [
        1985,
        "NA"
      ],
      [
        1986,
        "NA"
      ],
      [
        1987,
        "NA"
      ],
      [
        1988,
        "NA"
      ],
      [
        1989,
        "NA"
      ],
      [
        1990,
        28.818
      ],
      [
        1991,
        23.47
      ],
      [
        1992,
        23.339000000000002
      ],
      [
        1993,
        24.594
      ],
      [
        1994,
        24.201
      ],
      [
        1995,
        23.129
      ],
      [
        1996,
        22.551
      ],
      [
        1997,
        21.846
      ],
      [
        1998,
        22.383000000000003
      ],
      [
        1999,
        21.983
      ],
      [
        2000,
        21.848000000000003
      ],
      [
        2001,
        22.146
      ],
      [
        2002,
        22.633000000000003
      ],
      [
        2003,
        21.848000000000003
      ],
      [
        2004,
        21.944000000000003
      ],
      [
        2005,
        21.451
      ],
      [
        2006,
        21.522
      ],
      [
        2007,
        21.873
      ],
      [
        2008,
        24.179000000000002
      ],
      [
        2009,
        23.13
      ],
      [
        2010,
        24.694000000000003
      ],
      [
        2011,
        25.94
      ],
      [
        2012,
        24.631
      ],
      [
        2013,
        24.999000000000002
      ],
      [
        2014,
        25.933000000000003
      ],
      [
        2015,
        23.866
      ],
      [
        2016,
        22.65
      ],
      [
        2017,
        24.518
      ],
      [
        2018,
        26.127
      ],
      [
        2019,
        28.11
      ],
      [
        2020,
        28.141
      ],
      [
        2021,
        28.518
      ],
      [
        2022,
        28.482
      ],
      [
        2023,
        28.396
      ],
      [
        2024,
        28.309
      ]
    ],
    "regime_pol": [
      [
        1816,
        -20.0
      ],
      [
        1817,
        -20.0
      ],
      [
        1818,
        -20.0
      ],
      [
        1819,
        -20.0
      ],
      [
        1820,
        -20.0
      ],
      [
        1821,
        -20.0
      ],
      [
        1822,
        -20.0
      ],
      [
        1823,
        -20.0
      ],
      [
        1824,
        -20.0
      ],
      [
        1825,
        -20.0
      ],
      [
        1826,
        -20.0
      ],
      [
        1827,
        -20.0
      ],
      [
        1828,
        -20.0
      ],
      [
        1829,
        -20.0
      ],
      [
        1830,
        -20.0
      ],
      [
        1831,
        -20.0
      ],
      [
        1832,
        -20.0
      ],
      [
        1833,
        -20.0
      ],
      [
        1834,
        -20.0
      ],
      [
        1835,
        -20.0
      ],
      [
        1836,
        -20.0
      ],
      [
        1837,
        -20.0
      ],
      [
        1838,
        -20.0
      ],
      [
        1839,
        -20.0
      ],
      [
        1840,
        -20.0
      ],
      [
        1841,
        -20.0
      ],
      [
        1842,
        -20.0
      ],
      [
        1843,
        -20.0
      ],
      [
        1844,
        -20.0
      ],
      [
        1845,
        -20.0
      ],
      [
        1846,
        -20.0
      ],
      [
        1847,
        -20.0
      ],
      [
        1848,
        -20.0
      ],
      [
        1849,
        -20.0
      ],
      [
        1850,
        -20.0
      ],
      [
        1851,
        -20.0
      ],
      [
        1852,
        -20.0
      ],
      [
        1853,
        -20.0
      ],
      [
        1854,
        -20.0
      ],
      [
        1855,
        -20.0
      ],
      [
        1856,
        -20.0
      ],
      [
        1857,
        -20.0
      ],
      [
        1858,
        -20.0
      ],
      [
        1859,
        -20.0
      ],
      [
        1860,
        -20.0
      ],
      [
        1861,
        -20.0
      ],
      [
        1862,
        -20.0
      ],
      [
        1863,
        -20.0
      ],
      [
        1864,
        -20.0
      ],
      [
        1865,
        -20.0
      ],
      [
        1866,
        -20.0
      ],
      [
        1867,
        -20.0
      ],
      [
        1868,
        -20.0
      ],
      [
        1869,
        -20.0
      ],
      [
        1870,
        -20.0
      ],
      [
        1871,
        -20.0
      ],
      [
        1872,
        -20.0
      ],
      [
        1873,
        -20.0
      ],
      [
        1874,
        -20.0
      ],
      [
        1875,
        -20.0
      ],
      [
        1876,
        -20.0
      ],
      [
        1877,
        -20.0
      ],
      [
        1878,
        -20.0
      ],
      [
        1879,
        -20.0
      ],
      [
        1880,
        -20.0
      ],
      [
        1881,
        -20.0
      ],
      [
        1882,
        -20.0
      ],
      [
        1883,
        -20.0
      ],
      [
        1884,
        -20.0
      ],
      [
        1885,
        -20.0
      ],
      [
        1886,
        -20.0
      ],
      [
        1887,
        -20.0
      ],
      [
        1888,
        -20.0
      ],
      [
        1889,
        -20.0
      ],
      [
        1890,
        -20.0
      ],
      [
        1891,
        -20.0
      ],
      [
        1892,
        -20.0
      ],
      [
        1893,
        -20.0
      ],
      [
        1894,
        -20.0
      ],
      [
        1895,
        -20.0
      ],
      [
        1896,
        -20.0
      ],
      [
        1897,
        -20.0
      ],
      [
        1898,
        -20.0
      ],
      [
        1899,
        -20.0
      ],
      [
        1900,
        -20.0
      ],
      [
        1901,
        -20.0
      ],
      [
        1902,
        -20.0
      ],
      [
        1903,
        -20.0
      ],
      [
        1904,
        -20.0
      ],
      [
        1905,
        -20.0
      ],
      [
        1906,
        -20.0
      ],
      [
        1907,
        -20.0
      ],
      [
        1908,
        -20.0
      ],
      [
        1909,
        -20.0
      ],
      [
        1910,
        -20.0
      ],
      [
        1911,
        -20.0
      ],
      [
        1912,
        -20.0
      ],
      [
        1913,
        -20.0
      ],
      [
        1914,
        -20.0
      ],
      [
        1915,
        -20.0
      ],
      [
        1916,
        -20.0
      ],
      [
        1917,
        -20.0
      ],
      [
        1918,
        -20.0
      ],
      [
        1919,
        -20.0
      ],
      [
        1920,
        -20.0
      ],
      [
        1921,
        -20.0
      ],
      [
        1922,
        -20.0
      ],
      [
        1923,
        -20.0
      ],
      [
        1924,
        -20.0
      ],
      [
        1925,
        -20.0
      ],
      [
        1926,
        -20.0
      ],
      [
        1927,
        -20.0
      ],
      [
        1928,
        -20.0
      ],
      [
        1929,
        -20.0
      ],
      [
        1930,
        -20.0
      ],
      [
        1931,
        -20.0
      ],
      [
        1932,
        -20.0
      ],
      [
        1933,
        -20.0
      ],
      [
        1934,
        -20.0
      ],
      [
        1935,
        -20.0
      ],
      [
        1936,
        -20.0
      ],
      [
        1937,
        -20.0
      ],
      [
        1938,
        -20.0
      ],
      [
        1939,
        -20.0
      ],
      [
        1940,
        -20.0
      ],
      [
        1941,
        -20.0
      ],
      [
        1942,
        -20.0
      ],
      [
        1943,
        -20.0
      ],
      [
        1944,
        -20.0
      ],
      [
        1945,
        -20.0
      ],
      [
        1946,
        -20.0
      ],
      [
        1947,
        -20.0
      ],
      [
        1948,
        -20.0
      ],
      [
        1949,
        -20.0
      ],
      [
        1950,
        -20.0
      ],
      [
        1951,
        -20.0
      ],
      [
        1952,
        -20.0
      ],
      [
        1953,
        -20.0
      ],
      [
        1954,
        -20.0
      ],
      [
        1955,
        -20.0
      ],
      [
        1956,
        "NA"
      ],
      [
        1957,
        "NA"
      ],
      [
        1958,
        "NA"
      ],
      [
        1959,
        -9.0
      ],
      [
        1960,
        -9.0
      ],
      [
        1961,
        -9.0
      ],
      [
        1962,
        -9.0
      ],
      [
        1963,
        -9.0
      ],
      [
        1964,
        -9.0
      ],
      [
        1965,
        -9.0
      ],
      [
        1966,
        -9.0
      ],
      [
        1967,
        -9.0
      ],
      [
        1968,
        -9.0
      ],
      [
        1969,
        -9.0
      ],
      [
        1970,
        -8.0
      ],
      [
        1971,
        -9.0
      ],
      [
        1972,
        -9.0
      ],
      [
        1973,
        -9.0
      ],
      [
        1974,
        -9.0
      ],
      [
        1975,
        -9.0
      ],
      [
        1976,
        -9.0
      ],
      [
        1977,
        -9.0
      ],
      [
        1978,
        -9.0
      ],
      [
        1979,
        -9.0
      ],
      [
        1980,
        -9.0
      ],
      [
        1981,
        -8.0
      ],
      [
        1982,
        -8.0
      ],
      [
        1983,
        -8.0
      ],
      [
        1984,
        -8.0
      ],
      [
        1985,
        -8.0
      ],
      [
        1986,
        -8.0
      ],
      [
        1987,
        -5.0
      ],
      [
        1988,
        -5.0
      ],
      [
        1989,
        -5.0
      ],
      [
        1990,
        -5.0
      ],
      [
        1991,
        -5.0
      ],
      [
        1992,
        -5.0
      ],
      [
        1993,
        -3.0
      ],
      [
        1994,
        -3.0
      ],
      [
        1995,
        -3.0
      ],
      [
        1996,
        -3.0
      ],
      [
        1997,
        -3.0
      ],
      [
        1998,
        -3.0
      ],
      [
        1999,
        -3.0
      ],
      [
        2000,
        -3.0
      ],
      [
        2001,
        -3.0
      ],
      [
        2002,
        -4.0
      ],
      [
        2003,
        -4.0
      ],
      [
        2004,
        -4.0
      ],
      [
        2005,
        -4.0
      ],
      [
        2006,
        -4.0
      ],
      [
        2007,
        -4.0
      ],
      [
        2008,
        -4.0
      ],
      [
        2009,
        -4.0
      ],
      [
        2010,
        -4.0
      ],
      [
        2011,
        4.0
      ],
      [
        2012,
        5.0
      ],
      [
        2013,
        6.0
      ],
      [
        2014,
        7.0
      ],
      [
        2015,
        7.0
      ]
    ],
    "sanitaire_primaire": [
      [
        2000,
        "NA"
      ],
      [
        2001,
        "NA"
      ],
      [
        2002,
        "NA"
      ],
      [
        2003,
        "NA"
      ],
      [
        2004,
        "NA"
      ],
      [
        2005,
        "NA"
      ],
      [
        2006,
        "NA"
      ],
      [
        2007,
        "NA"
      ],
      [
        2008,
        "NA"
      ],
      [
        2009,
        "NA"
      ],
      [
        2010,
        "NA"
      ],
      [
        2011,
        "NA"
      ],
      [
        2012,
        "NA"
      ],
      [
        2013,
        "NA"
      ],
      [
        2014,
        "NA"
      ],
      [
        2015,
        "NA"
      ],
      [
        2016,
        99.63258
      ],
      [
        2017,
        99.61763
      ],
      [
        2018,
        "NA"
      ],
      [
        2019,
        "NA"
      ]
    ],
    "sous_nutri": [
      [
        1960,
        "NA"
      ],
      [
        1961,
        "NA"
      ],
      [
        1962,
        272.9
      ],
      [
        1963,
        260.0
      ],
      [
        1964,
        247.5
      ],
      [
        1965,
        235.3
      ],
      [
        1966,
        223.4
      ],
      [
        1967,
        211.8
      ],
      [
        1968,
        200.5
      ],
      [
        1969,
        189.8
      ],
      [
        1970,
        179.6
      ],
      [
        1971,
        170.0
      ],
      [
        1972,
        160.8
      ],
      [
        1973,
        151.9
      ],
      [
        1974,
        143.0
      ],
      [
        1975,
        134.2
      ],
      [
        1976,
        125.4
      ],
      [
        1977,
        117.0
      ],
      [
        1978,
        109.2
      ],
      [
        1979,
        102.0
      ],
      [
        1980,
        95.5
      ],
      [
        1981,
        89.7
      ],
      [
        1982,
        84.6
      ],
      [
        1983,
        79.7
      ],
      [
        1984,
        75.1
      ],
      [
        1985,
        71.0
      ],
      [
        1986,
        67.2
      ],
      [
        1987,
        63.8
      ],
      [
        1988,
        60.7
      ],
      [
        1989,
        58.0
      ],
      [
        1990,
        55.5
      ],
      [
        1991,
        53.0
      ],
      [
        1992,
        50.6
      ],
      [
        1993,
        48.1
      ],
      [
        1994,
        45.5
      ],
      [
        1995,
        42.8
      ],
      [
        1996,
        40.1
      ],
      [
        1997,
        37.4
      ],
      [
        1998,
        34.7
      ],
      [
        1999,
        32.3
      ],
      [
        2000,
        30.0
      ],
      [
        2001,
        28.0
      ],
      [
        2002,
        26.2
      ],
      [
        2003,
        24.7
      ],
      [
        2004,
        23.3
      ],
      [
        2005,
        22.1
      ],
      [
        2006,
        21.1
      ],
      [
        2007,
        20.2
      ],
      [
        2008,
        19.4
      ],
      [
        2009,
        18.9
      ],
      [
        2010,
        18.4
      ],
      [
        2011,
        18.0
      ],
      [
        2012,
        17.7
      ],
      [
        2013,
        17.5
      ],
      [
        2014,
        17.3
      ],
      [
        2015,
        17.2
      ],
      [
        2016,
        17.1
      ],
      [
        2017,
        17.1
      ],
      [
        2018,
        17.0
      ],
      [
        2019,
        "NA"
      ]
    ],
    "volume_exp_biens": [
      [
        1980,
        1.137
      ],
      [
        1981,
        14.700999999999999
      ],
      [
        1982,
        -7.955
      ],
      [
        1983,
        3.06
      ],
      [
        1984,
        2.97
      ],
      [
        1985,
        -0.299
      ],
      [
        1986,
        11.437000000000001
      ],
      [
        1987,
        8.832
      ],
      [
        1988,
        8.644
      ],
      [
        1989,
        18.843
      ],
      [
        1990,
        4.489
      ],
      [
        1991,
        4.416
      ],
      [
        1992,
        -1.643
      ],
      [
        1993,
        4.004
      ],
      [
        1994,
        18.287
      ],
      [
        1995,
        2.991
      ],
      [
        1996,
        -2.406
      ],
      [
        1997,
        10.088
      ],
      [
        1998,
        6.3389999999999995
      ],
      [
        1999,
        6.7010000000000005
      ],
      [
        2000,
        7.313
      ],
      [
        2001,
        15.677999999999999
      ],
      [
        2002,
        1.9069999999999998
      ],
      [
        2003,
        7.212999999999999
      ],
      [
        2004,
        15.231
      ],
      [
        2005,
        1.4909999999999999
      ],
      [
        2006,
        6.345
      ],
      [
        2007,
        17.699
      ],
      [
        2008,
        -2.585
      ],
      [
        2009,
        -2.161
      ],
      [
        2010,
        6.507000000000001
      ],
      [
        2011,
        -3.9389999999999996
      ],
      [
        2012,
        1.6340000000000001
      ],
      [
        2013,
        -0.732
      ],
      [
        2014,
        -2.9360000000000004
      ],
      [
        2015,
        -2.818
      ],
      [
        2016,
        2.021
      ],
      [
        2017,
        3.2089999999999996
      ],
      [
        2018,
        3.508
      ],
      [
        2019,
        -2.0
      ],
      [
        2020,
        1.8
      ],
      [
        2021,
        3.7
      ],
      [
        2022,
        4.3
      ],
      [
        2023,
        4.3
      ],
      [
        2024,
        4.2
      ]
    ],
    "volume_exp_bs": [
      [
        1980,
        0.345
      ],
      [
        1981,
        3.437
      ],
      [
        1982,
        -6.901
      ],
      [
        1983,
        0.9
      ],
      [
        1984,
        2.7
      ],
      [
        1985,
        3.3
      ],
      [
        1986,
        5.23
      ],
      [
        1987,
        13.37
      ],
      [
        1988,
        21.445999999999998
      ],
      [
        1989,
        8.957
      ],
      [
        1990,
        4.489
      ],
      [
        1991,
        4.416
      ],
      [
        1992,
        -1.643
      ],
      [
        1993,
        4.004
      ],
      [
        1994,
        18.287
      ],
      [
        1995,
        2.991
      ],
      [
        1996,
        -2.406
      ],
      [
        1997,
        10.088
      ],
      [
        1998,
        6.3389999999999995
      ],
      [
        1999,
        6.7010000000000005
      ],
      [
        2000,
        7.313
      ],
      [
        2001,
        15.677999999999999
      ],
      [
        2002,
        1.9069999999999998
      ],
      [
        2003,
        7.212999999999999
      ],
      [
        2004,
        15.231
      ],
      [
        2005,
        1.4909999999999999
      ],
      [
        2006,
        6.345
      ],
      [
        2007,
        17.699
      ],
      [
        2008,
        -2.585
      ],
      [
        2009,
        -2.161
      ],
      [
        2010,
        6.507000000000001
      ],
      [
        2011,
        -3.9389999999999996
      ],
      [
        2012,
        1.6340000000000001
      ],
      [
        2013,
        -0.732
      ],
      [
        2014,
        -2.9360000000000004
      ],
      [
        2015,
        -2.818
      ],
      [
        2016,
        2.021
      ],
      [
        2017,
        3.2089999999999996
      ],
      [
        2018,
        3.508
      ],
      [
        2019,
        -2.0
      ],
      [
        2020,
        1.8
      ],
      [
        2021,
        3.7
      ],
      [
        2022,
        4.3
      ],
      [
        2023,
        4.3
      ],
      [
        2024,
        4.2
      ]
    ],
    "volume_import_biens": [
      [
        1980,
        12.148
      ],
      [
        1981,
        22.489
      ],
      [
        1982,
        -0.943
      ],
      [
        1983,
        -3.925
      ],
      [
        1984,
        6.332000000000001
      ],
      [
        1985,
        -15.932
      ],
      [
        1986,
        0.8109999999999999
      ],
      [
        1987,
        -5.256
      ],
      [
        1988,
        19.32
      ],
      [
        1989,
        16.369
      ],
      [
        1990,
        9.602
      ],
      [
        1991,
        -7.875
      ],
      [
        1992,
        13.112
      ],
      [
        1993,
        6.709
      ],
      [
        1994,
        -1.058
      ],
      [
        1995,
        6.29
      ],
      [
        1996,
        -2.487
      ],
      [
        1997,
        8.697000000000001
      ],
      [
        1998,
        5.351
      ],
      [
        1999,
        5.814
      ],
      [
        2000,
        6.4639999999999995
      ],
      [
        2001,
        15.048
      ],
      [
        2002,
        -2.909
      ],
      [
        2003,
        -2.136
      ],
      [
        2004,
        7.184
      ],
      [
        2005,
        -1.177
      ],
      [
        2006,
        5.66
      ],
      [
        2007,
        8.599
      ],
      [
        2008,
        4.785
      ],
      [
        2009,
        -4.632
      ],
      [
        2010,
        15.427
      ],
      [
        2011,
        -3.778
      ],
      [
        2012,
        8.414
      ],
      [
        2013,
        -1.492
      ],
      [
        2014,
        2.9739999999999998
      ],
      [
        2015,
        -2.5639999999999996
      ],
      [
        2016,
        5.202999999999999
      ],
      [
        2017,
        3.3680000000000003
      ],
      [
        2018,
        -0.485
      ],
      [
        2019,
        0.0
      ],
      [
        2020,
        0.25
      ],
      [
        2021,
        0.55
      ],
      [
        2022,
        1.4
      ],
      [
        2023,
        2.82
      ],
      [
        2024,
        2.8280000000000003
      ]
    ],
    "volume_import_bs": [
      [
        1980,
        14.509
      ],
      [
        1981,
        22.796999999999997
      ],
      [
        1982,
        0.932
      ],
      [
        1983,
        -2.2
      ],
      [
        1984,
        5.7
      ],
      [
        1985,
        -13.03
      ],
      [
        1986,
        -2.06
      ],
      [
        1987,
        -3.447
      ],
      [
        1988,
        16.141
      ],
      [
        1989,
        18.547
      ],
      [
        1990,
        9.602
      ],
      [
        1991,
        -7.875
      ],
      [
        1992,
        13.112
      ],
      [
        1993,
        6.709
      ],
      [
        1994,
        -1.058
      ],
      [
        1995,
        6.29
      ],
      [
        1996,
        -2.487
      ],
      [
        1997,
        8.697000000000001
      ],
      [
        1998,
        5.351
      ],
      [
        1999,
        5.814
      ],
      [
        2000,
        6.4639999999999995
      ],
      [
        2001,
        15.048
      ],
      [
        2002,
        -2.909
      ],
      [
        2003,
        -2.136
      ],
      [
        2004,
        7.184
      ],
      [
        2005,
        -1.177
      ],
      [
        2006,
        5.66
      ],
      [
        2007,
        8.599
      ],
      [
        2008,
        4.785
      ],
      [
        2009,
        -4.632
      ],
      [
        2010,
        15.427
      ],
      [
        2011,
        -3.778
      ],
      [
        2012,
        8.414
      ],
      [
        2013,
        -1.492
      ],
      [
        2014,
        2.9739999999999998
      ],
      [
        2015,
        -2.5639999999999996
      ],
      [
        2016,
        5.202999999999999
      ],
      [
        2017,
        3.3680000000000003
      ],
      [
        2018,
        -0.485
      ],
      [
        2019,
        0.0
      ],
      [
        2020,
        0.25
      ],
      [
        2021,
        0.55
      ],
      [
        2022,
        1.4
      ],
      [
        2023,
        2.82
      ],
      [
        2024,
        2.8280000000000003
      ]
    ],
    "vuln_clim_ferdi": [
      [
        2018,
        61.0769989988632
      ]
    ],
    "vuln_clim_ndgain": [
      [
        1995,
        0.411437415044198
      ],
      [
        1996,
        0.409643921569438
      ],
      [
        1997,
        0.407640277855814
      ],
      [
        1998,
        0.40963132332239705
      ],
      [
        1999,
        0.4074298428256121
      ],
      [
        2000,
        0.403938509537174
      ],
      [
        2001,
        0.4041839850919221
      ],
      [
        2002,
        0.403475199246476
      ],
      [
        2003,
        0.401876659447729
      ],
      [
        2004,
        0.399066534584378
      ],
      [
        2005,
        0.396700900537438
      ],
      [
        2006,
        0.396358813106627
      ],
      [
        2007,
        0.3961288363795921
      ],
      [
        2008,
        0.394007244114766
      ],
      [
        2009,
        0.393226471186713
      ],
      [
        2010,
        0.39230431337065
      ],
      [
        2011,
        0.39238652131024704
      ],
      [
        2012,
        0.389996868590755
      ],
      [
        2013,
        0.395250386732115
      ],
      [
        2014,
        0.393555460363228
      ],
      [
        2015,
        0.393338531008675
      ],
      [
        2016,
        0.392863478237725
      ]
    ]
  }
}