{
  "country": "ETH",
  "country_name": "Éthiopie",
  "indicators": {
    "abo_mobile": [
      [
        1960,
        0.0
      ],
      [
        1961,
        "NA"
      ],
      [
        1962,
        "NA"
      ],
      [
        1963,
        "NA"
      ],
      [
        1964,
        "NA"
      ],
      [
        1965,
        0.0
      ],
      [
        1966,
        "NA"
      ],
      [
        1967,
        "NA"
      ],
      [
        1968,
        "NA"
      ],
      [
        1969,
        "NA"
      ],
      [
        1970,
        0.0
      ],
      [
        1971,
        "NA"
      ],
      [
        1972,
        "NA"
      ],
      [
        1973,
        "NA"
      ],
      [
        1974,
        "NA"
      ],
      [
        1975,
        0.0
      ],
      [
        1976,
        0.0
      ],
      [
        1977,
        0.0
      ],
      [
        1978,
        0.0
      ],
      [
        1979,
        0.0
      ],
      [
        1980,
        0.0
      ],
      [
        1981,
        0.0
      ],
      [
        1982,
        0.0
      ],
      [
        1983,
        0.0
      ],
      [
        1984,
        0.0
      ],
      [
        1985,
        0.0
      ],
      [
        1986,
        0.0
      ],
      [
        1987,
        0.0
      ],
      [
        1988,
        0.0
      ],
      [
        1989,
        0.0
      ],
      [
        1990,
        0.0
      ],
      [
        1991,
        0.0
      ],
      [
        1992,
        0.0
      ],
      [
        1993,
        0.0
      ],
      [
        1994,
        0.0
      ],
      [
        1995,
        0.0
      ],
      [
        1996,
        0.0
      ],
      [
        1997,
        0.0
      ],
      [
        1998,
        0.0
      ],
      [
        1999,
        0.00674
      ],
      [
        2000,
        0.017757
      ],
      [
        2001,
        0.0275
      ],
      [
        2002,
        0.050369
      ],
      [
        2003,
        0.051324
      ],
      [
        2004,
        0.155534
      ],
      [
        2005,
        0.41063
      ],
      [
        2006,
        0.8667
      ],
      [
        2007,
        1.2084979999999999
      ],
      [
        2008,
        1.9545270000000001
      ],
      [
        2009,
        4.051703
      ],
      [
        2010,
        6.854
      ],
      [
        2011,
        14.126659
      ],
      [
        2012,
        20.523889
      ],
      [
        2013,
        25.646865
      ],
      [
        2014,
        30.49
      ],
      [
        2015,
        42.311628999999996
      ],
      [
        2016,
        51.224
      ],
      [
        2017,
        39.6
      ],
      [
        2018,
        "NA"
      ],
      [
        2019,
        "NA"
      ]
    ],
    "acces_elec": [
      [
        1960,
        "NA"
      ],
      [
        1961,
        "NA"
      ],
      [
        1962,
        "NA"
      ],
      [
        1963,
        "NA"
      ],
      [
        1964,
        "NA"
      ],
      [
        1965,
        "NA"
      ],
      [
        1966,
        "NA"
      ],
      [
        1967,
        "NA"
      ],
      [
        1968,
        "NA"
      ],
      [
        1969,
        "NA"
      ],
      [
        1970,
        "NA"
      ],
      [
        1971,
        "NA"
      ],
      [
        1972,
        "NA"
      ],
      [
        1973,
        "NA"
      ],
      [
        1974,
        "NA"
      ],
      [
        1975,
        "NA"
      ],
      [
        1976,
        "NA"
      ],
      [
        1977,
        "NA"
      ],
      [
        1978,
        "NA"
      ],
      [
        1979,
        "NA"
      ],
      [
        1980,
        "NA"
      ],
      [
        1981,
        "NA"
      ],
      [
        1982,
        "NA"
      ],
      [
        1983,
        "NA"
      ],
      [
        1984,
        "NA"
      ],
      [
        1985,
        "NA"
      ],
      [
        1986,
        "NA"
      ],
      [
        1987,
        "NA"
      ],
      [
        1988,
        "NA"
      ],
      [
        1989,
        "NA"
      ],
      [
        1990,
        "NA"
      ],
      [
        1991,
        "NA"
      ],
      [
        1992,
        "NA"
      ],
      [
        1993,
        "NA"
      ],
      [
        1994,
        "NA"
      ],
      [
        1995,
        "NA"
      ],
      [
        1996,
        "NA"
      ],
      [
        1997,
        "NA"
      ],
      [
        1998,
        "NA"
      ],
      [
        1999,
        "NA"
      ],
      [
        2000,
        12.7
      ],
      [
        2001,
        25.5699501038
      ],
      [
        2002,
        26.467643737800003
      ],
      [
        2003,
        27.3465824127
      ],
      [
        2004,
        28.202297210700003
      ],
      [
        2005,
        14.0
      ],
      [
        2006,
        29.847581863400002
      ],
      [
        2007,
        79.9308806504
      ],
      [
        2008,
        31.4747695923
      ],
      [
        2009,
        32.3105354309
      ],
      [
        2010,
        33.1765327454
      ],
      [
        2011,
        23.0
      ],
      [
        2012,
        35.0421295166
      ],
      [
        2013,
        36.0444145203
      ],
      [
        2014,
        27.2
      ],
      [
        2015,
        29.0
      ],
      [
        2016,
        42.9
      ],
      [
        2017,
        44.3
      ],
      [
        2018,
        44.9799575806
      ],
      [
        2019,
        "NA"
      ]
    ],
    "alpha_adulte": [
      [
        1960,
        "NA"
      ],
      [
        1961,
        "NA"
      ],
      [
        1962,
        "NA"
      ],
      [
        1963,
        "NA"
      ],
      [
        1964,
        "NA"
      ],
      [
        1965,
        "NA"
      ],
      [
        1966,
        "NA"
      ],
      [
        1967,
        "NA"
      ],
      [
        1968,
        "NA"
      ],
      [
        1969,
        "NA"
      ],
      [
        1970,
        "NA"
      ],
      [
        1971,
        "NA"
      ],
      [
        1972,
        "NA"
      ],
      [
        1973,
        "NA"
      ],
      [
        1974,
        "NA"
      ],
      [
        1975,
        "NA"
      ],
      [
        1976,
        "NA"
      ],
      [
        1977,
        "NA"
      ],
      [
        1978,
        "NA"
      ],
      [
        1979,
        "NA"
      ],
      [
        1980,
        "NA"
      ],
      [
        1981,
        "NA"
      ],
      [
        1982,
        "NA"
      ],
      [
        1983,
        "NA"
      ],
      [
        1984,
        "NA"
      ],
      [
        1985,
        "NA"
      ],
      [
        1986,
        "NA"
      ],
      [
        1987,
        "NA"
      ],
      [
        1988,
        "NA"
      ],
      [
        1989,
        "NA"
      ],
      [
        1990,
        "NA"
      ],
      [
        1991,
        "NA"
      ],
      [
        1992,
        "NA"
      ],
      [
        1993,
        "NA"
      ],
      [
        1994,
        27.011359999999996
      ],
      [
        1995,
        "NA"
      ],
      [
        1996,
        "NA"
      ],
      [
        1997,
        "NA"
      ],
      [
        1998,
        "NA"
      ],
      [
        1999,
        "NA"
      ],
      [
        2000,
        "NA"
      ],
      [
        2001,
        "NA"
      ],
      [
        2002,
        "NA"
      ],
      [
        2003,
        "NA"
      ],
      [
        2004,
        35.9
      ],
      [
        2005,
        29.82034
      ],
      [
        2006,
        "NA"
      ],
      [
        2007,
        38.995979999999996
      ],
      [
        2008,
        "NA"
      ],
      [
        2009,
        "NA"
      ],
      [
        2010,
        "NA"
      ],
      [
        2011,
        "NA"
      ],
      [
        2012,
        "NA"
      ],
      [
        2013,
        "NA"
      ],
      [
        2014,
        "NA"
      ],
      [
        2015,
        "NA"
      ],
      [
        2016,
        "NA"
      ],
      [
        2017,
        51.77118
      ],
      [
        2018,
        "NA"
      ],
      [
        2019,
        "NA"
      ]
    ],
    "alpha_jeune": [
      [
        1960,
        "NA"
      ],
      [
        1961,
        "NA"
      ],
      [
        1962,
        "NA"
      ],
      [
        1963,
        "NA"
      ],
      [
        1964,
        "NA"
      ],
      [
        1965,
        "NA"
      ],
      [
        1966,
        "NA"
      ],
      [
        1967,
        "NA"
      ],
      [
        1968,
        "NA"
      ],
      [
        1969,
        "NA"
      ],
      [
        1970,
        "NA"
      ],
      [
        1971,
        "NA"
      ],
      [
        1972,
        "NA"
      ],
      [
        1973,
        "NA"
      ],
      [
        1974,
        "NA"
      ],
      [
        1975,
        "NA"
      ],
      [
        1976,
        "NA"
      ],
      [
        1977,
        "NA"
      ],
      [
        1978,
        "NA"
      ],
      [
        1979,
        "NA"
      ],
      [
        1980,
        "NA"
      ],
      [
        1981,
        "NA"
      ],
      [
        1982,
        "NA"
      ],
      [
        1983,
        "NA"
      ],
      [
        1984,
        "NA"
      ],
      [
        1985,
        "NA"
      ],
      [
        1986,
        "NA"
      ],
      [
        1987,
        "NA"
      ],
      [
        1988,
        "NA"
      ],
      [
        1989,
        "NA"
      ],
      [
        1990,
        "NA"
      ],
      [
        1991,
        "NA"
      ],
      [
        1992,
        "NA"
      ],
      [
        1993,
        "NA"
      ],
      [
        1994,
        33.5854
      ],
      [
        1995,
        "NA"
      ],
      [
        1996,
        "NA"
      ],
      [
        1997,
        "NA"
      ],
      [
        1998,
        "NA"
      ],
      [
        1999,
        "NA"
      ],
      [
        2000,
        "NA"
      ],
      [
        2001,
        "NA"
      ],
      [
        2002,
        "NA"
      ],
      [
        2003,
        "NA"
      ],
      [
        2004,
        49.9
      ],
      [
        2005,
        44.60597
      ],
      [
        2006,
        "NA"
      ],
      [
        2007,
        54.982980000000005
      ],
      [
        2008,
        "NA"
      ],
      [
        2009,
        "NA"
      ],
      [
        2010,
        "NA"
      ],
      [
        2011,
        "NA"
      ],
      [
        2012,
        "NA"
      ],
      [
        2013,
        "NA"
      ],
      [
        2014,
        "NA"
      ],
      [
        2015,
        "NA"
      ],
      [
        2016,
        "NA"
      ],
      [
        2017,
        72.75482
      ],
      [
        2018,
        "NA"
      ],
      [
        2019,
        "NA"
      ]
    ],
    "bidonvilles": [
      [
        1960,
        "NA"
      ],
      [
        1961,
        "NA"
      ],
      [
        1962,
        "NA"
      ],
      [
        1963,
        "NA"
      ],
      [
        1964,
        "NA"
      ],
      [
        1965,
        "NA"
      ],
      [
        1966,
        "NA"
      ],
      [
        1967,
        "NA"
      ],
      [
        1968,
        "NA"
      ],
      [
        1969,
        "NA"
      ],
      [
        1970,
        "NA"
      ],
      [
        1971,
        "NA"
      ],
      [
        1972,
        "NA"
      ],
      [
        1973,
        "NA"
      ],
      [
        1974,
        "NA"
      ],
      [
        1975,
        "NA"
      ],
      [
        1976,
        "NA"
      ],
      [
        1977,
        "NA"
      ],
      [
        1978,
        "NA"
      ],
      [
        1979,
        "NA"
      ],
      [
        1980,
        "NA"
      ],
      [
        1981,
        "NA"
      ],
      [
        1982,
        "NA"
      ],
      [
        1983,
        "NA"
      ],
      [
        1984,
        "NA"
      ],
      [
        1985,
        "NA"
      ],
      [
        1986,
        "NA"
      ],
      [
        1987,
        "NA"
      ],
      [
        1988,
        "NA"
      ],
      [
        1989,
        "NA"
      ],
      [
        1990,
        95.5
      ],
      [
        1991,
        "NA"
      ],
      [
        1992,
        "NA"
      ],
      [
        1993,
        "NA"
      ],
      [
        1994,
        "NA"
      ],
      [
        1995,
        95.5
      ],
      [
        1996,
        "NA"
      ],
      [
        1997,
        "NA"
      ],
      [
        1998,
        "NA"
      ],
      [
        1999,
        "NA"
      ],
      [
        2000,
        88.6
      ],
      [
        2001,
        "NA"
      ],
      [
        2002,
        "NA"
      ],
      [
        2003,
        "NA"
      ],
      [
        2004,
        "NA"
      ],
      [
        2005,
        81.8
      ],
      [
        2006,
        "NA"
      ],
      [
        2007,
        79.1
      ],
      [
        2008,
        "NA"
      ],
      [
        2009,
        76.4
      ],
      [
        2010,
        "NA"
      ],
      [
        2011,
        "NA"
      ],
      [
        2012,
        "NA"
      ],
      [
        2013,
        "NA"
      ],
      [
        2014,
        73.9
      ],
      [
        2015,
        "NA"
      ],
      [
        2016,
        "NA"
      ],
      [
        2017,
        "NA"
      ],
      [
        2018,
        "NA"
      ],
      [
        2019,
        "NA"
      ]
    ],
    "compte_adulte": [
      [
        1960,
        "NA"
      ],
      [
        1961,
        "NA"
      ],
      [
        1962,
        "NA"
      ],
      [
        1963,
        "NA"
      ],
      [
        1964,
        "NA"
      ],
      [
        1965,
        "NA"
      ],
      [
        1966,
        "NA"
      ],
      [
        1967,
        "NA"
      ],
      [
        1968,
        "NA"
      ],
      [
        1969,
        "NA"
      ],
      [
        1970,
        "NA"
      ],
      [
        1971,
        "NA"
      ],
      [
        1972,
        "NA"
      ],
      [
        1973,
        "NA"
      ],
      [
        1974,
        "NA"
      ],
      [
        1975,
        "NA"
      ],
      [
        1976,
        "NA"
      ],
      [
        1977,
        "NA"
      ],
      [
        1978,
        "NA"
      ],
      [
        1979,
        "NA"
      ],
      [
        1980,
        "NA"
      ],
      [
        1981,
        "NA"
      ],
      [
        1982,
        "NA"
      ],
      [
        1983,
        "NA"
      ],
      [
        1984,
        "NA"
      ],
      [
        1985,
        "NA"
      ],
      [
        1986,
        "NA"
      ],
      [
        1987,
        "NA"
      ],
      [
        1988,
        "NA"
      ],
      [
        1989,
        "NA"
      ],
      [
        1990,
        "NA"
      ],
      [
        1991,
        "NA"
      ],
      [
        1992,
        "NA"
      ],
      [
        1993,
        "NA"
      ],
      [
        1994,
        "NA"
      ],
      [
        1995,
        "NA"
      ],
      [
        1996,
        "NA"
      ],
      [
        1997,
        "NA"
      ],
      [
        1998,
        "NA"
      ],
      [
        1999,
        "NA"
      ],
      [
        2000,
        "NA"
      ],
      [
        2001,
        "NA"
      ],
      [
        2002,
        "NA"
      ],
      [
        2003,
        "NA"
      ],
      [
        2004,
        "NA"
      ],
      [
        2005,
        "NA"
      ],
      [
        2006,
        "NA"
      ],
      [
        2007,
        "NA"
      ],
      [
        2008,
        "NA"
      ],
      [
        2009,
        "NA"
      ],
      [
        2010,
        "NA"
      ],
      [
        2011,
        "NA"
      ],
      [
        2012,
        "NA"
      ],
      [
        2013,
        "NA"
      ],
      [
        2014,
        25.5881404877
      ],
      [
        2015,
        "NA"
      ],
      [
        2016,
        "NA"
      ],
      [
        2017,
        38.361328125
      ],
      [
        2018,
        "NA"
      ],
      [
        2019,
        "NA"
      ]
    ],
    "compte_jeune": [
      [
        1960,
        "NA"
      ],
      [
        1961,
        "NA"
      ],
      [
        1962,
        "NA"
      ],
      [
        1963,
        "NA"
      ],
      [
        1964,
        "NA"
      ],
      [
        1965,
        "NA"
      ],
      [
        1966,
        "NA"
      ],
      [
        1967,
        "NA"
      ],
      [
        1968,
        "NA"
      ],
      [
        1969,
        "NA"
      ],
      [
        1970,
        "NA"
      ],
      [
        1971,
        "NA"
      ],
      [
        1972,
        "NA"
      ],
      [
        1973,
        "NA"
      ],
      [
        1974,
        "NA"
      ],
      [
        1975,
        "NA"
      ],
      [
        1976,
        "NA"
      ],
      [
        1977,
        "NA"
      ],
      [
        1978,
        "NA"
      ],
      [
        1979,
        "NA"
      ],
      [
        1980,
        "NA"
      ],
      [
        1981,
        "NA"
      ],
      [
        1982,
        "NA"
      ],
      [
        1983,
        "NA"
      ],
      [
        1984,
        "NA"
      ],
      [
        1985,
        "NA"
      ],
      [
        1986,
        "NA"
      ],
      [
        1987,
        "NA"
      ],
      [
        1988,
        "NA"
      ],
      [
        1989,
        "NA"
      ],
      [
        1990,
        "NA"
      ],
      [
        1991,
        "NA"
      ],
      [
        1992,
        "NA"
      ],
      [
        1993,
        "NA"
      ],
      [
        1994,
        "NA"
      ],
      [
        1995,
        "NA"
      ],
      [
        1996,
        "NA"
      ],
      [
        1997,
        "NA"
      ],
      [
        1998,
        "NA"
      ],
      [
        1999,
        "NA"
      ],
      [
        2000,
        "NA"
      ],
      [
        2001,
        "NA"
      ],
      [
        2002,
        "NA"
      ],
      [
        2003,
        "NA"
      ],
      [
        2004,
        "NA"
      ],
      [
        2005,
        "NA"
      ],
      [
        2006,
        "NA"
      ],
      [
        2007,
        "NA"
      ],
      [
        2008,
        "NA"
      ],
      [
        2009,
        "NA"
      ],
      [
        2010,
        "NA"
      ],
      [
        2011,
        "NA"
      ],
      [
        2012,
        "NA"
      ],
      [
        2013,
        "NA"
      ],
      [
        2014,
        14.2952260971
      ],
      [
        2015,
        "NA"
      ],
      [
        2016,
        "NA"
      ],
      [
        2017,
        28.1642875671
      ],
      [
        2018,
        "NA"
      ],
      [
        2019,
        "NA"
      ]
    ],
    "croissance_pib": [
      [
        1960,
        "NA"
      ],
      [
        1961,
        "NA"
      ],
      [
        1962,
        "NA"
      ],
      [
        1963,
        "NA"
      ],
      [
        1964,
        "NA"
      ],
      [
        1965,
        "NA"
      ],
      [
        1966,
        "NA"
      ],
      [
        1967,
        "NA"
      ],
      [
        1968,
        "NA"
      ],
      [
        1969,
        "NA"
      ],
      [
        1970,
        "NA"
      ],
      [
        1971,
        "NA"
      ],
      [
        1972,
        "NA"
      ],
      [
        1973,
        "NA"
      ],
      [
        1974,
        "NA"
      ],
      [
        1975,
        "NA"
      ],
      [
        1976,
        "NA"
      ],
      [
        1977,
        "NA"
      ],
      [
        1978,
        "NA"
      ],
      [
        1979,
        "NA"
      ],
      [
        1980,
        "NA"
      ],
      [
        1981,
        "NA"
      ],
      [
        1982,
        0.9160138581
      ],
      [
        1983,
        8.2350057185
      ],
      [
        1984,
        -2.8480214526
      ],
      [
        1985,
        -11.1443529776
      ],
      [
        1986,
        9.6616123593
      ],
      [
        1987,
        13.8593303967
      ],
      [
        1988,
        0.5036748791
      ],
      [
        1989,
        -0.36104418039999997
      ],
      [
        1990,
        2.726451783
      ],
      [
        1991,
        -7.137479700499999
      ],
      [
        1992,
        -8.6724801479
      ],
      [
        1993,
        13.1428339765
      ],
      [
        1994,
        3.1899645822000005
      ],
      [
        1995,
        6.1275114138
      ],
      [
        1996,
        12.4261737775
      ],
      [
        1997,
        3.1339068509
      ],
      [
        1998,
        -3.4581391337
      ],
      [
        1999,
        5.1621458211
      ],
      [
        2000,
        6.0732174796
      ],
      [
        2001,
        8.3013063205
      ],
      [
        2002,
        1.5147257063
      ],
      [
        2003,
        -2.1613597221000003
      ],
      [
        2004,
        13.5726031369
      ],
      [
        2005,
        11.818765946600001
      ],
      [
        2006,
        10.8347270659
      ],
      [
        2007,
        11.456167
      ],
      [
        2008,
        10.7885216854
      ],
      [
        2009,
        8.8025531978
      ],
      [
        2010,
        12.5505383459
      ],
      [
        2011,
        11.1782962272
      ],
      [
        2012,
        8.6478116334
      ],
      [
        2013,
        10.5822700483
      ],
      [
        2014,
        10.257492961
      ],
      [
        2015,
        10.3924630202
      ],
      [
        2016,
        9.433482657799999
      ],
      [
        2017,
        9.5038585711
      ],
      [
        2018,
        6.8101693910000005
      ],
      [
        2019,
        "NA"
      ]
    ],
    "eau_douce_agri": [
      [
        1960,
        "NA"
      ],
      [
        1961,
        "NA"
      ],
      [
        1962,
        "NA"
      ],
      [
        1963,
        "NA"
      ],
      [
        1964,
        "NA"
      ],
      [
        1965,
        "NA"
      ],
      [
        1966,
        "NA"
      ],
      [
        1967,
        "NA"
      ],
      [
        1968,
        "NA"
      ],
      [
        1969,
        "NA"
      ],
      [
        1970,
        "NA"
      ],
      [
        1971,
        "NA"
      ],
      [
        1972,
        "NA"
      ],
      [
        1973,
        "NA"
      ],
      [
        1974,
        "NA"
      ],
      [
        1975,
        "NA"
      ],
      [
        1976,
        "NA"
      ],
      [
        1977,
        "NA"
      ],
      [
        1978,
        "NA"
      ],
      [
        1979,
        "NA"
      ],
      [
        1980,
        "NA"
      ],
      [
        1981,
        "NA"
      ],
      [
        1982,
        "NA"
      ],
      [
        1983,
        "NA"
      ],
      [
        1984,
        "NA"
      ],
      [
        1985,
        "NA"
      ],
      [
        1986,
        "NA"
      ],
      [
        1987,
        "NA"
      ],
      [
        1988,
        "NA"
      ],
      [
        1989,
        "NA"
      ],
      [
        1990,
        "NA"
      ],
      [
        1991,
        "NA"
      ],
      [
        1992,
        "NA"
      ],
      [
        1993,
        "NA"
      ],
      [
        1994,
        "NA"
      ],
      [
        1995,
        "NA"
      ],
      [
        1996,
        "NA"
      ],
      [
        1997,
        "NA"
      ],
      [
        1998,
        "NA"
      ],
      [
        1999,
        "NA"
      ],
      [
        2000,
        "NA"
      ],
      [
        2001,
        "NA"
      ],
      [
        2002,
        93.63
      ],
      [
        2003,
        "NA"
      ],
      [
        2004,
        "NA"
      ],
      [
        2005,
        89.05
      ],
      [
        2006,
        "NA"
      ],
      [
        2007,
        "NA"
      ],
      [
        2008,
        "NA"
      ],
      [
        2009,
        "NA"
      ],
      [
        2010,
        "NA"
      ],
      [
        2011,
        "NA"
      ],
      [
        2012,
        "NA"
      ],
      [
        2013,
        "NA"
      ],
      [
        2014,
        "NA"
      ],
      [
        2015,
        "NA"
      ],
      [
        2016,
        91.82
      ],
      [
        2017,
        "NA"
      ],
      [
        2018,
        "NA"
      ],
      [
        2019,
        "NA"
      ]
    ],
    "emploi_agri": [
      [
        1960,
        "NA"
      ],
      [
        1961,
        "NA"
      ],
      [
        1962,
        "NA"
      ],
      [
        1963,
        "NA"
      ],
      [
        1964,
        "NA"
      ],
      [
        1965,
        "NA"
      ],
      [
        1966,
        "NA"
      ],
      [
        1967,
        "NA"
      ],
      [
        1968,
        "NA"
      ],
      [
        1969,
        "NA"
      ],
      [
        1970,
        "NA"
      ],
      [
        1971,
        "NA"
      ],
      [
        1972,
        "NA"
      ],
      [
        1973,
        "NA"
      ],
      [
        1974,
        "NA"
      ],
      [
        1975,
        "NA"
      ],
      [
        1976,
        "NA"
      ],
      [
        1977,
        "NA"
      ],
      [
        1978,
        "NA"
      ],
      [
        1979,
        "NA"
      ],
      [
        1980,
        "NA"
      ],
      [
        1981,
        "NA"
      ],
      [
        1982,
        "NA"
      ],
      [
        1983,
        "NA"
      ],
      [
        1984,
        "NA"
      ],
      [
        1985,
        "NA"
      ],
      [
        1986,
        "NA"
      ],
      [
        1987,
        "NA"
      ],
      [
        1988,
        "NA"
      ],
      [
        1989,
        "NA"
      ],
      [
        1990,
        "NA"
      ],
      [
        1991,
        77.0820007324
      ],
      [
        1992,
        77.3180007935
      ],
      [
        1993,
        76.9919967651
      ],
      [
        1994,
        76.8820037842
      ],
      [
        1995,
        76.7139968872
      ],
      [
        1996,
        76.3209991455
      ],
      [
        1997,
        76.27100372310001
      ],
      [
        1998,
        76.4850006104
      ],
      [
        1999,
        76.3550033569
      ],
      [
        2000,
        76.68800354
      ],
      [
        2001,
        76.8519973755
      ],
      [
        2002,
        77.34400177
      ],
      [
        2003,
        78.0319976807
      ],
      [
        2004,
        77.9150009155
      ],
      [
        2005,
        78.1210021973
      ],
      [
        2006,
        77.4039993286
      ],
      [
        2007,
        76.591003418
      ],
      [
        2008,
        75.7990036011
      ],
      [
        2009,
        75.0199966431
      ],
      [
        2010,
        73.9739990234
      ],
      [
        2011,
        72.9810028076
      ],
      [
        2012,
        72.1019973755
      ],
      [
        2013,
        71.033996582
      ],
      [
        2014,
        70.0729980469
      ],
      [
        2015,
        69.1029968262
      ],
      [
        2016,
        68.1910018921
      ],
      [
        2017,
        67.3460006714
      ],
      [
        2018,
        66.7060012817
      ],
      [
        2019,
        66.1289978027
      ]
    ],
    "enseignant_primaire": [
      [
        1960,
        "NA"
      ],
      [
        1961,
        "NA"
      ],
      [
        1962,
        "NA"
      ],
      [
        1963,
        "NA"
      ],
      [
        1964,
        "NA"
      ],
      [
        1965,
        "NA"
      ],
      [
        1966,
        "NA"
      ],
      [
        1967,
        "NA"
      ],
      [
        1968,
        "NA"
      ],
      [
        1969,
        "NA"
      ],
      [
        1970,
        "NA"
      ],
      [
        1971,
        "NA"
      ],
      [
        1972,
        "NA"
      ],
      [
        1973,
        "NA"
      ],
      [
        1974,
        "NA"
      ],
      [
        1975,
        "NA"
      ],
      [
        1976,
        "NA"
      ],
      [
        1977,
        "NA"
      ],
      [
        1978,
        "NA"
      ],
      [
        1979,
        "NA"
      ],
      [
        1980,
        "NA"
      ],
      [
        1981,
        "NA"
      ],
      [
        1982,
        "NA"
      ],
      [
        1983,
        "NA"
      ],
      [
        1984,
        "NA"
      ],
      [
        1985,
        "NA"
      ],
      [
        1986,
        "NA"
      ],
      [
        1987,
        "NA"
      ],
      [
        1988,
        "NA"
      ],
      [
        1989,
        "NA"
      ],
      [
        1990,
        "NA"
      ],
      [
        1991,
        "NA"
      ],
      [
        1992,
        "NA"
      ],
      [
        1993,
        "NA"
      ],
      [
        1994,
        "NA"
      ],
      [
        1995,
        "NA"
      ],
      [
        1996,
        "NA"
      ],
      [
        1997,
        "NA"
      ],
      [
        1998,
        "NA"
      ],
      [
        1999,
        "NA"
      ],
      [
        2000,
        "NA"
      ],
      [
        2001,
        "NA"
      ],
      [
        2002,
        "NA"
      ],
      [
        2003,
        "NA"
      ],
      [
        2004,
        "NA"
      ],
      [
        2005,
        "NA"
      ],
      [
        2006,
        "NA"
      ],
      [
        2007,
        "NA"
      ],
      [
        2008,
        89.71701
      ],
      [
        2009,
        84.60987
      ],
      [
        2010,
        "NA"
      ],
      [
        2011,
        "NA"
      ],
      [
        2012,
        "NA"
      ],
      [
        2013,
        "NA"
      ],
      [
        2014,
        "NA"
      ],
      [
        2015,
        "NA"
      ],
      [
        2016,
        "NA"
      ],
      [
        2017,
        "NA"
      ],
      [
        2018,
        "NA"
      ],
      [
        2019,
        "NA"
      ]
    ],
    "enseignant_secondaire": [
      [
        1960,
        "NA"
      ],
      [
        1961,
        "NA"
      ],
      [
        1962,
        "NA"
      ],
      [
        1963,
        "NA"
      ],
      [
        1964,
        "NA"
      ],
      [
        1965,
        "NA"
      ],
      [
        1966,
        "NA"
      ],
      [
        1967,
        "NA"
      ],
      [
        1968,
        "NA"
      ],
      [
        1969,
        "NA"
      ],
      [
        1970,
        "NA"
      ],
      [
        1971,
        "NA"
      ],
      [
        1972,
        "NA"
      ],
      [
        1973,
        "NA"
      ],
      [
        1974,
        "NA"
      ],
      [
        1975,
        "NA"
      ],
      [
        1976,
        "NA"
      ],
      [
        1977,
        "NA"
      ],
      [
        1978,
        "NA"
      ],
      [
        1979,
        "NA"
      ],
      [
        1980,
        "NA"
      ],
      [
        1981,
        "NA"
      ],
      [
        1982,
        "NA"
      ],
      [
        1983,
        "NA"
      ],
      [
        1984,
        "NA"
      ],
      [
        1985,
        "NA"
      ],
      [
        1986,
        "NA"
      ],
      [
        1987,
        "NA"
      ],
      [
        1988,
        "NA"
      ],
      [
        1989,
        "NA"
      ],
      [
        1990,
        "NA"
      ],
      [
        1991,
        "NA"
      ],
      [
        1992,
        "NA"
      ],
      [
        1993,
        "NA"
      ],
      [
        1994,
        "NA"
      ],
      [
        1995,
        "NA"
      ],
      [
        1996,
        "NA"
      ],
      [
        1997,
        "NA"
      ],
      [
        1998,
        "NA"
      ],
      [
        1999,
        "NA"
      ],
      [
        2000,
        "NA"
      ],
      [
        2001,
        "NA"
      ],
      [
        2002,
        "NA"
      ],
      [
        2003,
        "NA"
      ],
      [
        2004,
        "NA"
      ],
      [
        2005,
        "NA"
      ],
      [
        2006,
        "NA"
      ],
      [
        2007,
        "NA"
      ],
      [
        2008,
        64.0967
      ],
      [
        2009,
        "NA"
      ],
      [
        2010,
        "NA"
      ],
      [
        2011,
        "NA"
      ],
      [
        2012,
        "NA"
      ],
      [
        2013,
        "NA"
      ],
      [
        2014,
        "NA"
      ],
      [
        2015,
        "NA"
      ],
      [
        2016,
        "NA"
      ],
      [
        2017,
        "NA"
      ],
      [
        2018,
        "NA"
      ],
      [
        2019,
        "NA"
      ]
    ],
    "frag_pol": [
      [
        2006,
        0.0
      ],
      [
        2007,
        0.0
      ],
      [
        2008,
        0.0
      ],
      [
        2009,
        0.0
      ],
      [
        2010,
        0.0
      ],
      [
        2011,
        0.0
      ],
      [
        2012,
        0.0
      ],
      [
        2013,
        0.0
      ],
      [
        2014,
        0.0
      ],
      [
        2015,
        0.0
      ],
      [
        2016,
        0.0
      ],
      [
        2017,
        0.0
      ]
    ],
    "idh": [
      [
        1990,
        "NA"
      ],
      [
        1991,
        "NA"
      ],
      [
        1992,
        "NA"
      ],
      [
        1993,
        "NA"
      ],
      [
        1994,
        "NA"
      ],
      [
        1995,
        "NA"
      ],
      [
        1996,
        "NA"
      ],
      [
        1997,
        "NA"
      ],
      [
        1998,
        "NA"
      ],
      [
        1999,
        "NA"
      ],
      [
        2000,
        0.28300000000000003
      ],
      [
        2001,
        0.298
      ],
      [
        2002,
        0.306
      ],
      [
        2003,
        0.31
      ],
      [
        2004,
        0.325
      ],
      [
        2005,
        0.34600000000000003
      ],
      [
        2006,
        0.362
      ],
      [
        2007,
        0.378
      ],
      [
        2008,
        0.394
      ],
      [
        2009,
        0.401
      ],
      [
        2010,
        0.412
      ],
      [
        2011,
        0.423
      ],
      [
        2012,
        0.43
      ],
      [
        2013,
        0.438
      ],
      [
        2014,
        0.445
      ],
      [
        2015,
        0.451
      ],
      [
        2016,
        0.457
      ],
      [
        2017,
        0.463
      ]
    ],
    "lib_monde": [
      [
        2013,
        1.0
      ],
      [
        2014,
        1.0
      ],
      [
        2015,
        1.0
      ],
      [
        2016,
        1.0
      ],
      [
        2017,
        1.0
      ],
      [
        2018,
        1.0
      ]
    ],
    "migration": [
      [
        1955,
        -0.21
      ],
      [
        1960,
        -0.19
      ],
      [
        1965,
        -0.17
      ],
      [
        1970,
        -0.316
      ],
      [
        1975,
        -0.391
      ],
      [
        1980,
        -12.479000000000001
      ],
      [
        1985,
        1.3119999999999998
      ],
      [
        1990,
        3.4610000000000003
      ],
      [
        1995,
        5.557
      ],
      [
        2000,
        -0.505
      ],
      [
        2005,
        -0.42100000000000004
      ],
      [
        2010,
        -0.122
      ],
      [
        2015,
        0.8490000000000001
      ],
      [
        2020,
        0.278
      ],
      [
        2025,
        -0.098
      ],
      [
        2030,
        -0.087
      ],
      [
        2035,
        -0.079
      ],
      [
        2040,
        -0.071
      ],
      [
        2045,
        -0.066
      ],
      [
        2050,
        -0.061
      ],
      [
        2055,
        -0.055999999999999994
      ],
      [
        2060,
        -0.053
      ],
      [
        2065,
        -0.05
      ],
      [
        2070,
        -0.048
      ],
      [
        2075,
        -0.046
      ],
      [
        2080,
        -0.044000000000000004
      ],
      [
        2085,
        -0.043
      ],
      [
        2090,
        -0.042
      ],
      [
        2095,
        -0.040999999999999995
      ],
      [
        2100,
        -0.040999999999999995
      ]
    ],
    "mortal_infant": [
      [
        1960,
        "NA"
      ],
      [
        1961,
        "NA"
      ],
      [
        1962,
        "NA"
      ],
      [
        1963,
        "NA"
      ],
      [
        1964,
        "NA"
      ],
      [
        1965,
        "NA"
      ],
      [
        1966,
        244.7
      ],
      [
        1967,
        244.3
      ],
      [
        1968,
        244.0
      ],
      [
        1969,
        243.8
      ],
      [
        1970,
        243.7
      ],
      [
        1971,
        243.5
      ],
      [
        1972,
        243.5
      ],
      [
        1973,
        243.4
      ],
      [
        1974,
        243.1
      ],
      [
        1975,
        242.9
      ],
      [
        1976,
        242.9
      ],
      [
        1977,
        242.6
      ],
      [
        1978,
        242.0
      ],
      [
        1979,
        240.9
      ],
      [
        1980,
        239.2
      ],
      [
        1981,
        236.8
      ],
      [
        1982,
        233.6
      ],
      [
        1983,
        229.9
      ],
      [
        1984,
        226.0
      ],
      [
        1985,
        221.9
      ],
      [
        1986,
        217.8
      ],
      [
        1987,
        213.9
      ],
      [
        1988,
        210.0
      ],
      [
        1989,
        206.1
      ],
      [
        1990,
        201.8
      ],
      [
        1991,
        197.0
      ],
      [
        1992,
        191.6
      ],
      [
        1993,
        185.7
      ],
      [
        1994,
        179.3
      ],
      [
        1995,
        172.6
      ],
      [
        1996,
        166.0
      ],
      [
        1997,
        159.7
      ],
      [
        1998,
        153.6
      ],
      [
        1999,
        147.7
      ],
      [
        2000,
        141.8
      ],
      [
        2001,
        135.8
      ],
      [
        2002,
        129.6
      ],
      [
        2003,
        123.1
      ],
      [
        2004,
        116.6
      ],
      [
        2005,
        110.2
      ],
      [
        2006,
        104.1
      ],
      [
        2007,
        98.2
      ],
      [
        2008,
        92.8
      ],
      [
        2009,
        87.7
      ],
      [
        2010,
        82.9
      ],
      [
        2011,
        78.5
      ],
      [
        2012,
        74.3
      ],
      [
        2013,
        70.5
      ],
      [
        2014,
        66.8
      ],
      [
        2015,
        63.5
      ],
      [
        2016,
        60.4
      ],
      [
        2017,
        57.7
      ],
      [
        2018,
        55.2
      ],
      [
        2019,
        "NA"
      ]
    ],
    "pib": [
      [
        1980,
        7.385
      ],
      [
        1981,
        7.577999999999999
      ],
      [
        1982,
        7.973
      ],
      [
        1983,
        8.863
      ],
      [
        1984,
        8.375
      ],
      [
        1985,
        9.808
      ],
      [
        1986,
        10.187999999999999
      ],
      [
        1987,
        10.89
      ],
      [
        1988,
        11.285
      ],
      [
        1989,
        11.872
      ],
      [
        1990,
        12.595
      ],
      [
        1991,
        13.927999999999999
      ],
      [
        1992,
        14.696
      ],
      [
        1993,
        9.142999999999999
      ],
      [
        1994,
        8.135
      ],
      [
        1995,
        8.431000000000001
      ],
      [
        1996,
        8.826
      ],
      [
        1997,
        8.908999999999999
      ],
      [
        1998,
        8.078
      ],
      [
        1999,
        7.9270000000000005
      ],
      [
        2000,
        8.235
      ],
      [
        2001,
        8.222999999999999
      ],
      [
        2002,
        7.851
      ],
      [
        2003,
        8.623
      ],
      [
        2004,
        10.142000000000001
      ],
      [
        2005,
        12.408
      ],
      [
        2006,
        15.283
      ],
      [
        2007,
        19.701
      ],
      [
        2008,
        26.839000000000002
      ],
      [
        2009,
        32.464
      ],
      [
        2010,
        29.916999999999998
      ],
      [
        2011,
        31.958000000000002
      ],
      [
        2012,
        42.221000000000004
      ],
      [
        2013,
        46.544
      ],
      [
        2014,
        54.165
      ],
      [
        2015,
        63.081
      ],
      [
        2016,
        70.88600000000001
      ],
      [
        2017,
        75.745
      ],
      [
        2018,
        80.289
      ],
      [
        2019,
        91.166
      ],
      [
        2020,
        103.60700000000001
      ],
      [
        2021,
        114.681
      ],
      [
        2022,
        125.255
      ],
      [
        2023,
        135.361
      ],
      [
        2024,
        146.181
      ]
    ],
    "pib_hab": [
      [
        1980,
        215.178
      ],
      [
        1981,
        215.59900000000002
      ],
      [
        1982,
        220.55700000000002
      ],
      [
        1983,
        237.66099999999997
      ],
      [
        1984,
        217.423
      ],
      [
        1985,
        246.507
      ],
      [
        1986,
        247.981
      ],
      [
        1987,
        256.699
      ],
      [
        1988,
        257.56
      ],
      [
        1989,
        262.233
      ],
      [
        1990,
        269.082
      ],
      [
        1991,
        287.651
      ],
      [
        1992,
        293.35
      ],
      [
        1993,
        176.465
      ],
      [
        1994,
        151.965
      ],
      [
        1995,
        152.658
      ],
      [
        1996,
        155.121
      ],
      [
        1997,
        152.171
      ],
      [
        1998,
        134.226
      ],
      [
        1999,
        128.213
      ],
      [
        2000,
        129.678
      ],
      [
        2001,
        125.72200000000001
      ],
      [
        2002,
        116.789
      ],
      [
        2003,
        120.87299999999999
      ],
      [
        2004,
        138.553
      ],
      [
        2005,
        165.218
      ],
      [
        2006,
        198.34400000000002
      ],
      [
        2007,
        249.209
      ],
      [
        2008,
        334.145
      ],
      [
        2009,
        397.80800000000005
      ],
      [
        2010,
        360.829
      ],
      [
        2011,
        379.381
      ],
      [
        2012,
        493.32099999999997
      ],
      [
        2013,
        535.264
      ],
      [
        2014,
        613.101
      ],
      [
        2015,
        702.7669999999999
      ],
      [
        2016,
        777.294
      ],
      [
        2017,
        817.49
      ],
      [
        2018,
        852.883
      ],
      [
        2019,
        953.179
      ],
      [
        2020,
        1066.1989999999998
      ],
      [
        2021,
        1161.5739999999998
      ],
      [
        2022,
        1248.69
      ],
      [
        2023,
        1328.184
      ],
      [
        2024,
        1411.769
      ]
    ],
    "pib_ppa": [
      [
        1980,
        10.755999999999998
      ],
      [
        1981,
        11.773
      ],
      [
        1982,
        12.620999999999999
      ],
      [
        1983,
        14.144
      ],
      [
        1984,
        14.317
      ],
      [
        1985,
        13.084000000000001
      ],
      [
        1986,
        14.640999999999998
      ],
      [
        1987,
        17.084
      ],
      [
        1988,
        17.788
      ],
      [
        1989,
        18.401
      ],
      [
        1990,
        19.586
      ],
      [
        1991,
        18.787
      ],
      [
        1992,
        17.504
      ],
      [
        1993,
        20.313
      ],
      [
        1994,
        21.47
      ],
      [
        1995,
        23.261999999999997
      ],
      [
        1996,
        26.894000000000002
      ],
      [
        1997,
        28.134
      ],
      [
        1998,
        27.26
      ],
      [
        1999,
        29.394000000000002
      ],
      [
        2000,
        33.008
      ],
      [
        2001,
        36.228
      ],
      [
        2002,
        37.39
      ],
      [
        2003,
        37.284
      ],
      [
        2004,
        42.768
      ],
      [
        2005,
        49.657
      ],
      [
        2006,
        57.043
      ],
      [
        2007,
        65.487
      ],
      [
        2008,
        74.238
      ],
      [
        2009,
        82.28399999999999
      ],
      [
        2010,
        92.06700000000001
      ],
      [
        2011,
        104.705
      ],
      [
        2012,
        115.99700000000001
      ],
      [
        2013,
        129.718
      ],
      [
        2014,
        145.726
      ],
      [
        2015,
        162.55700000000002
      ],
      [
        2016,
        177.37900000000002
      ],
      [
        2017,
        199.171
      ],
      [
        2018,
        219.739
      ],
      [
        2019,
        243.618
      ],
      [
        2020,
        253.102
      ],
      [
        2021,
        269.22
      ]
    ],
    "pop_pauvrete": [
      [
        1960,
        "NA"
      ],
      [
        1961,
        "NA"
      ],
      [
        1962,
        "NA"
      ],
      [
        1963,
        "NA"
      ],
      [
        1964,
        "NA"
      ],
      [
        1965,
        "NA"
      ],
      [
        1966,
        "NA"
      ],
      [
        1967,
        "NA"
      ],
      [
        1968,
        "NA"
      ],
      [
        1969,
        "NA"
      ],
      [
        1970,
        "NA"
      ],
      [
        1971,
        "NA"
      ],
      [
        1972,
        "NA"
      ],
      [
        1973,
        "NA"
      ],
      [
        1974,
        "NA"
      ],
      [
        1975,
        "NA"
      ],
      [
        1976,
        "NA"
      ],
      [
        1977,
        "NA"
      ],
      [
        1978,
        "NA"
      ],
      [
        1979,
        "NA"
      ],
      [
        1980,
        "NA"
      ],
      [
        1981,
        "NA"
      ],
      [
        1982,
        "NA"
      ],
      [
        1983,
        "NA"
      ],
      [
        1984,
        "NA"
      ],
      [
        1985,
        "NA"
      ],
      [
        1986,
        "NA"
      ],
      [
        1987,
        "NA"
      ],
      [
        1988,
        "NA"
      ],
      [
        1989,
        "NA"
      ],
      [
        1990,
        "NA"
      ],
      [
        1991,
        "NA"
      ],
      [
        1992,
        "NA"
      ],
      [
        1993,
        "NA"
      ],
      [
        1994,
        "NA"
      ],
      [
        1995,
        71.1
      ],
      [
        1996,
        "NA"
      ],
      [
        1997,
        "NA"
      ],
      [
        1998,
        "NA"
      ],
      [
        1999,
        61.2
      ],
      [
        2000,
        "NA"
      ],
      [
        2001,
        "NA"
      ],
      [
        2002,
        "NA"
      ],
      [
        2003,
        "NA"
      ],
      [
        2004,
        37.2
      ],
      [
        2005,
        "NA"
      ],
      [
        2006,
        "NA"
      ],
      [
        2007,
        "NA"
      ],
      [
        2008,
        "NA"
      ],
      [
        2009,
        "NA"
      ],
      [
        2010,
        33.5
      ],
      [
        2011,
        "NA"
      ],
      [
        2012,
        "NA"
      ],
      [
        2013,
        "NA"
      ],
      [
        2014,
        "NA"
      ],
      [
        2015,
        30.8
      ],
      [
        2016,
        "NA"
      ],
      [
        2017,
        "NA"
      ],
      [
        2018,
        "NA"
      ],
      [
        2019,
        "NA"
      ]
    ],
    "pop_rurale": [
      [
        1960,
        93.56700000000001
      ],
      [
        1961,
        93.35
      ],
      [
        1962,
        93.126
      ],
      [
        1963,
        92.896
      ],
      [
        1964,
        92.65799999999999
      ],
      [
        1965,
        92.413
      ],
      [
        1966,
        92.16
      ],
      [
        1967,
        91.9
      ],
      [
        1968,
        91.74
      ],
      [
        1969,
        91.57799999999999
      ],
      [
        1970,
        91.412
      ],
      [
        1971,
        91.244
      ],
      [
        1972,
        91.072
      ],
      [
        1973,
        90.898
      ],
      [
        1974,
        90.721
      ],
      [
        1975,
        90.54
      ],
      [
        1976,
        90.35600000000001
      ],
      [
        1977,
        90.17
      ],
      [
        1978,
        89.98
      ],
      [
        1979,
        89.786
      ],
      [
        1980,
        89.59
      ],
      [
        1981,
        89.39
      ],
      [
        1982,
        89.18700000000001
      ],
      [
        1983,
        88.98
      ],
      [
        1984,
        88.76799999999999
      ],
      [
        1985,
        88.54700000000001
      ],
      [
        1986,
        88.321
      ],
      [
        1987,
        88.09100000000001
      ],
      [
        1988,
        87.85700000000001
      ],
      [
        1989,
        87.62
      ],
      [
        1990,
        87.37899999999999
      ],
      [
        1991,
        87.133
      ],
      [
        1992,
        86.884
      ],
      [
        1993,
        86.63
      ],
      [
        1994,
        86.37299999999999
      ],
      [
        1995,
        86.17299999999999
      ],
      [
        1996,
        85.994
      ],
      [
        1997,
        85.814
      ],
      [
        1998,
        85.631
      ],
      [
        1999,
        85.447
      ],
      [
        2000,
        85.26
      ],
      [
        2001,
        85.073
      ],
      [
        2002,
        84.882
      ],
      [
        2003,
        84.69
      ],
      [
        2004,
        84.49600000000001
      ],
      [
        2005,
        84.3
      ],
      [
        2006,
        84.101
      ],
      [
        2007,
        83.884
      ],
      [
        2008,
        83.49
      ],
      [
        2009,
        83.09
      ],
      [
        2010,
        82.681
      ],
      [
        2011,
        82.265
      ],
      [
        2012,
        81.84
      ],
      [
        2013,
        81.425
      ],
      [
        2014,
        81.002
      ],
      [
        2015,
        80.572
      ],
      [
        2016,
        80.134
      ],
      [
        2017,
        79.69
      ],
      [
        2018,
        79.237
      ],
      [
        2019,
        "NA"
      ]
    ],
    "pop_tot": [
      [
        1950,
        18.128034
      ],
      [
        1951,
        18.466969
      ],
      [
        1952,
        18.819698000000002
      ],
      [
        1953,
        19.184296
      ],
      [
        1954,
        19.560014000000002
      ],
      [
        1955,
        19.947292
      ],
      [
        1956,
        20.347812
      ],
      [
        1957,
        20.76445
      ],
      [
        1958,
        21.201036
      ],
      [
        1959,
        21.661996
      ],
      [
        1960,
        22.151278
      ],
      [
        1961,
        22.671191
      ],
      [
        1962,
        23.221389000000002
      ],
      [
        1963,
        23.79843
      ],
      [
        1964,
        24.397022
      ],
      [
        1965,
        25.013626000000002
      ],
      [
        1966,
        25.641044
      ],
      [
        1967,
        26.280132
      ],
      [
        1968,
        26.944390000000002
      ],
      [
        1969,
        27.652709
      ],
      [
        1970,
        28.415077
      ],
      [
        1971,
        29.248642999999998
      ],
      [
        1972,
        30.140804
      ],
      [
        1973,
        31.036662
      ],
      [
        1974,
        31.861352
      ],
      [
        1975,
        32.566854
      ],
      [
        1976,
        33.128149
      ],
      [
        1977,
        33.577242
      ],
      [
        1978,
        33.993301
      ],
      [
        1979,
        34.487799
      ],
      [
        1980,
        35.141712
      ],
      [
        1981,
        35.984528000000005
      ],
      [
        1982,
        36.995248
      ],
      [
        1983,
        38.142674
      ],
      [
        1984,
        39.374348
      ],
      [
        1985,
        40.652141
      ],
      [
        1986,
        41.965693
      ],
      [
        1987,
        43.329231
      ],
      [
        1988,
        44.757203
      ],
      [
        1989,
        46.272299
      ],
      [
        1990,
        47.887865000000005
      ],
      [
        1991,
        49.609969
      ],
      [
        1992,
        51.423585
      ],
      [
        1993,
        53.295566
      ],
      [
        1994,
        55.180997999999995
      ],
      [
        1995,
        57.04790799999999
      ],
      [
        1996,
        58.88353000000001
      ],
      [
        1997,
        60.69744300000001
      ],
      [
        1998,
        62.507723999999996
      ],
      [
        1999,
        64.343013
      ],
      [
        2000,
        66.224804
      ],
      [
        2001,
        68.15942299999999
      ],
      [
        2002,
        70.14209100000001
      ],
      [
        2003,
        72.17058399999999
      ],
      [
        2004,
        74.23950500000002
      ],
      [
        2005,
        76.346311
      ],
      [
        2006,
        78.48920600000002
      ],
      [
        2007,
        80.674348
      ],
      [
        2008,
        82.916235
      ],
      [
        2009,
        85.233913
      ],
      [
        2010,
        87.639964
      ],
      [
        2011,
        90.139929
      ],
      [
        2012,
        92.726985
      ],
      [
        2013,
        95.385798
      ],
      [
        2014,
        98.09426500000001
      ],
      [
        2015,
        100.835458
      ],
      [
        2016,
        103.603462
      ],
      [
        2017,
        106.399924
      ],
      [
        2018,
        109.224414
      ],
      [
        2019,
        112.07873000000001
      ],
      [
        2020,
        114.96358799999999
      ],
      [
        2021,
        117.876227
      ],
      [
        2022,
        120.812698
      ],
      [
        2023,
        123.77139
      ],
      [
        2024,
        126.750872
      ],
      [
        2025,
        129.749455
      ],
      [
        2026,
        132.765527
      ],
      [
        2027,
        135.796649
      ],
      [
        2028,
        138.839365
      ],
      [
        2029,
        141.88968400000005
      ],
      [
        2030,
        144.944299
      ],
      [
        2031,
        148.00118600000002
      ],
      [
        2032,
        151.05925
      ],
      [
        2033,
        154.117381
      ],
      [
        2034,
        157.174824
      ],
      [
        2035,
        160.230922
      ],
      [
        2036,
        163.283948
      ],
      [
        2037,
        166.332878
      ],
      [
        2038,
        169.378596
      ],
      [
        2039,
        172.422732
      ],
      [
        2040,
        175.465979
      ],
      [
        2041,
        178.507807
      ],
      [
        2042,
        181.546162
      ],
      [
        2043,
        184.578312
      ],
      [
        2044,
        187.600772
      ],
      [
        2045,
        190.610533
      ],
      [
        2046,
        193.605493
      ],
      [
        2047,
        196.58436
      ],
      [
        2048,
        199.545702
      ],
      [
        2049,
        202.488312
      ],
      [
        2050,
        205.410675
      ],
      [
        2051,
        208.311249
      ],
      [
        2052,
        211.187732
      ],
      [
        2053,
        214.036897
      ],
      [
        2054,
        216.855054
      ],
      [
        2055,
        219.639098
      ],
      [
        2056,
        222.386795
      ],
      [
        2057,
        225.096918
      ],
      [
        2058,
        227.768557
      ],
      [
        2059,
        230.40128
      ],
      [
        2060,
        232.994399
      ],
      [
        2061,
        235.546497
      ],
      [
        2062,
        238.05588200000003
      ],
      [
        2063,
        240.52135
      ],
      [
        2064,
        242.941695
      ],
      [
        2065,
        245.315667
      ],
      [
        2066,
        247.642433
      ],
      [
        2067,
        249.920677
      ],
      [
        2068,
        252.148149
      ],
      [
        2069,
        254.322263
      ],
      [
        2070,
        256.441033
      ],
      [
        2071,
        258.50314000000003
      ],
      [
        2072,
        260.50838200000004
      ],
      [
        2073,
        262.45730299999997
      ],
      [
        2074,
        264.35106800000005
      ],
      [
        2075,
        266.19046000000003
      ],
      [
        2076,
        267.975385
      ],
      [
        2077,
        269.705167
      ],
      [
        2078,
        271.379325
      ],
      [
        2079,
        272.99721800000003
      ],
      [
        2080,
        274.558372
      ],
      [
        2081,
        276.06293999999997
      ],
      [
        2082,
        277.511045
      ],
      [
        2083,
        278.90225899999996
      ],
      [
        2084,
        280.236081
      ],
      [
        2085,
        281.51234500000004
      ],
      [
        2086,
        282.7310839999999
      ],
      [
        2087,
        283.893095
      ],
      [
        2088,
        284.999899
      ],
      [
        2089,
        286.0534980000001
      ],
      [
        2090,
        287.05556
      ],
      [
        2091,
        288.007161
      ],
      [
        2092,
        288.908852
      ],
      [
        2093,
        289.7609270000001
      ],
      [
        2094,
        290.563637
      ],
      [
        2095,
        291.31747
      ],
      [
        2096,
        292.0231990000001
      ],
      [
        2097,
        292.6819500000001
      ],
      [
        2098,
        293.295206
      ],
      [
        2099,
        293.86478900000003
      ],
      [
        2100,
        294.392896
      ]
    ],
    "pop_urbaine": [
      [
        1960,
        6.433
      ],
      [
        1961,
        6.65
      ],
      [
        1962,
        6.874
      ],
      [
        1963,
        7.104
      ],
      [
        1964,
        7.3420000000000005
      ],
      [
        1965,
        7.587000000000001
      ],
      [
        1966,
        7.84
      ],
      [
        1967,
        8.1
      ],
      [
        1968,
        8.26
      ],
      [
        1969,
        8.422
      ],
      [
        1970,
        8.588
      ],
      [
        1971,
        8.756
      ],
      [
        1972,
        8.927999999999999
      ],
      [
        1973,
        9.102
      ],
      [
        1974,
        9.279
      ],
      [
        1975,
        9.46
      ],
      [
        1976,
        9.644
      ],
      [
        1977,
        9.83
      ],
      [
        1978,
        10.02
      ],
      [
        1979,
        10.214
      ],
      [
        1980,
        10.41
      ],
      [
        1981,
        10.61
      ],
      [
        1982,
        10.812999999999999
      ],
      [
        1983,
        11.02
      ],
      [
        1984,
        11.232000000000001
      ],
      [
        1985,
        11.453
      ],
      [
        1986,
        11.679
      ],
      [
        1987,
        11.909
      ],
      [
        1988,
        12.142999999999999
      ],
      [
        1989,
        12.38
      ],
      [
        1990,
        12.620999999999999
      ],
      [
        1991,
        12.867
      ],
      [
        1992,
        13.116
      ],
      [
        1993,
        13.37
      ],
      [
        1994,
        13.627
      ],
      [
        1995,
        13.827
      ],
      [
        1996,
        14.005999999999998
      ],
      [
        1997,
        14.186
      ],
      [
        1998,
        14.369000000000002
      ],
      [
        1999,
        14.552999999999999
      ],
      [
        2000,
        14.74
      ],
      [
        2001,
        14.927
      ],
      [
        2002,
        15.118
      ],
      [
        2003,
        15.31
      ],
      [
        2004,
        15.504000000000001
      ],
      [
        2005,
        15.7
      ],
      [
        2006,
        15.899000000000001
      ],
      [
        2007,
        16.116
      ],
      [
        2008,
        16.51
      ],
      [
        2009,
        16.91
      ],
      [
        2010,
        17.319000000000003
      ],
      [
        2011,
        17.735
      ],
      [
        2012,
        18.16
      ],
      [
        2013,
        18.575
      ],
      [
        2014,
        18.998
      ],
      [
        2015,
        19.428
      ],
      [
        2016,
        19.866
      ],
      [
        2017,
        20.31
      ],
      [
        2018,
        20.763
      ],
      [
        2019,
        "NA"
      ]
    ],
    "prod_elec_renouv": [
      [
        1960,
        "NA"
      ],
      [
        1961,
        "NA"
      ],
      [
        1962,
        "NA"
      ],
      [
        1963,
        "NA"
      ],
      [
        1964,
        "NA"
      ],
      [
        1965,
        "NA"
      ],
      [
        1966,
        "NA"
      ],
      [
        1967,
        "NA"
      ],
      [
        1968,
        "NA"
      ],
      [
        1969,
        "NA"
      ],
      [
        1970,
        "NA"
      ],
      [
        1971,
        0.0
      ],
      [
        1972,
        0.0
      ],
      [
        1973,
        0.0
      ],
      [
        1974,
        0.0
      ],
      [
        1975,
        0.0
      ],
      [
        1976,
        0.0
      ],
      [
        1977,
        0.0
      ],
      [
        1978,
        0.0
      ],
      [
        1979,
        0.0
      ],
      [
        1980,
        0.0
      ],
      [
        1981,
        0.0
      ],
      [
        1982,
        0.0
      ],
      [
        1983,
        0.0
      ],
      [
        1984,
        0.0
      ],
      [
        1985,
        0.0
      ],
      [
        1986,
        0.0
      ],
      [
        1987,
        0.0
      ],
      [
        1988,
        0.0
      ],
      [
        1989,
        0.0
      ],
      [
        1990,
        0.0
      ],
      [
        1991,
        0.0
      ],
      [
        1992,
        0.0
      ],
      [
        1993,
        0.0
      ],
      [
        1994,
        0.0
      ],
      [
        1995,
        0.0
      ],
      [
        1996,
        0.0
      ],
      [
        1997,
        0.0
      ],
      [
        1998,
        1.5728977616
      ],
      [
        1999,
        1.2165450121999999
      ],
      [
        2000,
        0.2986857826
      ],
      [
        2001,
        0.0497017893
      ],
      [
        2002,
        0.0
      ],
      [
        2003,
        0.0
      ],
      [
        2004,
        0.0
      ],
      [
        2005,
        0.0
      ],
      [
        2006,
        0.0
      ],
      [
        2007,
        0.0
      ],
      [
        2008,
        0.3706645486
      ],
      [
        2009,
        0.6012024048
      ],
      [
        2010,
        0.36144578310000003
      ],
      [
        2011,
        0.5839646465
      ],
      [
        2012,
        2.5289778714
      ],
      [
        2013,
        4.0910135600999995
      ],
      [
        2014,
        5.2443510247
      ],
      [
        2015,
        7.2722046565
      ],
      [
        2016,
        "NA"
      ],
      [
        2017,
        "NA"
      ],
      [
        2018,
        "NA"
      ],
      [
        2019,
        "NA"
      ]
    ],
    "rdt_cerealier": [
      [
        1960,
        "NA"
      ],
      [
        1961,
        "NA"
      ],
      [
        1962,
        "NA"
      ],
      [
        1963,
        "NA"
      ],
      [
        1964,
        "NA"
      ],
      [
        1965,
        "NA"
      ],
      [
        1966,
        "NA"
      ],
      [
        1967,
        "NA"
      ],
      [
        1968,
        "NA"
      ],
      [
        1969,
        "NA"
      ],
      [
        1970,
        "NA"
      ],
      [
        1971,
        "NA"
      ],
      [
        1972,
        "NA"
      ],
      [
        1973,
        "NA"
      ],
      [
        1974,
        "NA"
      ],
      [
        1975,
        "NA"
      ],
      [
        1976,
        "NA"
      ],
      [
        1977,
        "NA"
      ],
      [
        1978,
        "NA"
      ],
      [
        1979,
        "NA"
      ],
      [
        1980,
        "NA"
      ],
      [
        1981,
        "NA"
      ],
      [
        1982,
        "NA"
      ],
      [
        1983,
        "NA"
      ],
      [
        1984,
        "NA"
      ],
      [
        1985,
        "NA"
      ],
      [
        1986,
        "NA"
      ],
      [
        1987,
        "NA"
      ],
      [
        1988,
        "NA"
      ],
      [
        1989,
        "NA"
      ],
      [
        1990,
        "NA"
      ],
      [
        1991,
        "NA"
      ],
      [
        1992,
        "NA"
      ],
      [
        1993,
        1313.0
      ],
      [
        1994,
        974.4
      ],
      [
        1995,
        1033.5
      ],
      [
        1996,
        1213.6
      ],
      [
        1997,
        1263.9
      ],
      [
        1998,
        1140.9
      ],
      [
        1999,
        1124.6
      ],
      [
        2000,
        1116.3
      ],
      [
        2001,
        1198.0
      ],
      [
        2002,
        1353.7
      ],
      [
        2003,
        1123.3
      ],
      [
        2004,
        1162.6
      ],
      [
        2005,
        1361.4
      ],
      [
        2006,
        1563.3
      ],
      [
        2007,
        1439.0
      ],
      [
        2008,
        1446.3
      ],
      [
        2009,
        1682.5
      ],
      [
        2010,
        1832.8
      ],
      [
        2011,
        1961.6
      ],
      [
        2012,
        2046.8
      ],
      [
        2013,
        2193.1
      ],
      [
        2014,
        2325.4
      ],
      [
        2015,
        2556.1
      ],
      [
        2016,
        2484.0
      ],
      [
        2017,
        2538.2
      ],
      [
        2018,
        "NA"
      ],
      [
        2019,
        "NA"
      ]
    ],
    "recette_budg": [
      [
        1980,
        10.933
      ],
      [
        1981,
        11.988
      ],
      [
        1982,
        12.808
      ],
      [
        1983,
        13.66
      ],
      [
        1984,
        15.132
      ],
      [
        1985,
        14.987
      ],
      [
        1986,
        15.865
      ],
      [
        1987,
        14.837
      ],
      [
        1988,
        18.087
      ],
      [
        1989,
        19.687
      ],
      [
        1990,
        13.998
      ],
      [
        1991,
        11.321
      ],
      [
        1992,
        9.312999999999999
      ],
      [
        1993,
        9.652000000000001
      ],
      [
        1994,
        12.239
      ],
      [
        1995,
        14.633
      ],
      [
        1996,
        14.860999999999999
      ],
      [
        1997,
        16.176
      ],
      [
        1998,
        17.484
      ],
      [
        1999,
        18.27
      ],
      [
        2000,
        16.718
      ],
      [
        2001,
        18.678
      ],
      [
        2002,
        19.105
      ],
      [
        2003,
        21.221
      ],
      [
        2004,
        20.498
      ],
      [
        2005,
        18.768
      ],
      [
        2006,
        18.279
      ],
      [
        2007,
        16.954
      ],
      [
        2008,
        15.874
      ],
      [
        2009,
        16.180999999999997
      ],
      [
        2010,
        17.162
      ],
      [
        2011,
        16.621
      ],
      [
        2012,
        15.475999999999999
      ],
      [
        2013,
        15.825
      ],
      [
        2014,
        14.901
      ],
      [
        2015,
        15.379000000000001
      ],
      [
        2016,
        15.884
      ],
      [
        2017,
        14.957
      ],
      [
        2018,
        13.057
      ],
      [
        2019,
        12.639000000000001
      ],
      [
        2020,
        11.404000000000002
      ],
      [
        2021,
        10.901
      ],
      [
        2022,
        10.937999999999999
      ],
      [
        2023,
        10.958
      ],
      [
        2024,
        10.97
      ]
    ],
    "regime_pol": [
      [
        1816,
        "NA"
      ],
      [
        1817,
        "NA"
      ],
      [
        1818,
        "NA"
      ],
      [
        1819,
        "NA"
      ],
      [
        1820,
        "NA"
      ],
      [
        1821,
        "NA"
      ],
      [
        1822,
        "NA"
      ],
      [
        1823,
        "NA"
      ],
      [
        1824,
        "NA"
      ],
      [
        1825,
        "NA"
      ],
      [
        1826,
        "NA"
      ],
      [
        1827,
        "NA"
      ],
      [
        1828,
        "NA"
      ],
      [
        1829,
        "NA"
      ],
      [
        1830,
        "NA"
      ],
      [
        1831,
        "NA"
      ],
      [
        1832,
        "NA"
      ],
      [
        1833,
        "NA"
      ],
      [
        1834,
        "NA"
      ],
      [
        1835,
        "NA"
      ],
      [
        1836,
        "NA"
      ],
      [
        1837,
        "NA"
      ],
      [
        1838,
        "NA"
      ],
      [
        1839,
        "NA"
      ],
      [
        1840,
        "NA"
      ],
      [
        1841,
        "NA"
      ],
      [
        1842,
        "NA"
      ],
      [
        1843,
        "NA"
      ],
      [
        1844,
        "NA"
      ],
      [
        1845,
        "NA"
      ],
      [
        1846,
        "NA"
      ],
      [
        1847,
        "NA"
      ],
      [
        1848,
        "NA"
      ],
      [
        1849,
        "NA"
      ],
      [
        1850,
        "NA"
      ],
      [
        1851,
        "NA"
      ],
      [
        1852,
        "NA"
      ],
      [
        1853,
        "NA"
      ],
      [
        1854,
        "NA"
      ],
      [
        1855,
        4.0
      ],
      [
        1856,
        4.0
      ],
      [
        1857,
        4.0
      ],
      [
        1858,
        4.0
      ],
      [
        1859,
        4.0
      ],
      [
        1860,
        4.0
      ],
      [
        1861,
        4.0
      ],
      [
        1862,
        4.0
      ],
      [
        1863,
        4.0
      ],
      [
        1864,
        4.0
      ],
      [
        1865,
        4.0
      ],
      [
        1866,
        4.0
      ],
      [
        1867,
        4.0
      ],
      [
        1868,
        4.0
      ],
      [
        1869,
        4.0
      ],
      [
        1870,
        4.0
      ],
      [
        1871,
        4.0
      ],
      [
        1872,
        4.0
      ],
      [
        1873,
        4.0
      ],
      [
        1874,
        4.0
      ],
      [
        1875,
        4.0
      ],
      [
        1876,
        4.0
      ],
      [
        1877,
        4.0
      ],
      [
        1878,
        4.0
      ],
      [
        1879,
        4.0
      ],
      [
        1880,
        4.0
      ],
      [
        1881,
        4.0
      ],
      [
        1882,
        4.0
      ],
      [
        1883,
        4.0
      ],
      [
        1884,
        4.0
      ],
      [
        1885,
        4.0
      ],
      [
        1886,
        4.0
      ],
      [
        1887,
        4.0
      ],
      [
        1888,
        4.0
      ],
      [
        1889,
        4.0
      ],
      [
        1890,
        4.0
      ],
      [
        1891,
        4.0
      ],
      [
        1892,
        4.0
      ],
      [
        1893,
        4.0
      ],
      [
        1894,
        4.0
      ],
      [
        1895,
        4.0
      ],
      [
        1896,
        4.0
      ],
      [
        1897,
        4.0
      ],
      [
        1898,
        4.0
      ],
      [
        1899,
        4.0
      ],
      [
        1900,
        4.0
      ],
      [
        1901,
        4.0
      ],
      [
        1902,
        4.0
      ],
      [
        1903,
        4.0
      ],
      [
        1904,
        4.0
      ],
      [
        1905,
        4.0
      ],
      [
        1906,
        4.0
      ],
      [
        1907,
        4.0
      ],
      [
        1908,
        4.0
      ],
      [
        1909,
        4.0
      ],
      [
        1910,
        4.0
      ],
      [
        1911,
        4.0
      ],
      [
        1912,
        4.0
      ],
      [
        1913,
        4.0
      ],
      [
        1914,
        4.0
      ],
      [
        1915,
        4.0
      ],
      [
        1916,
        4.0
      ],
      [
        1917,
        4.0
      ],
      [
        1918,
        4.0
      ],
      [
        1919,
        4.0
      ],
      [
        1920,
        4.0
      ],
      [
        1921,
        4.0
      ],
      [
        1922,
        4.0
      ],
      [
        1923,
        4.0
      ],
      [
        1924,
        4.0
      ],
      [
        1925,
        4.0
      ],
      [
        1926,
        4.0
      ],
      [
        1927,
        4.0
      ],
      [
        1928,
        4.0
      ],
      [
        1929,
        4.0
      ],
      [
        1930,
        -5.0
      ],
      [
        1931,
        -5.0
      ],
      [
        1932,
        -5.0
      ],
      [
        1933,
        -5.0
      ],
      [
        1934,
        -5.0
      ],
      [
        1935,
        -5.0
      ],
      [
        1936,
        "NA"
      ],
      [
        1937,
        "NA"
      ],
      [
        1938,
        "NA"
      ],
      [
        1939,
        "NA"
      ],
      [
        1940,
        "NA"
      ],
      [
        1941,
        "NA"
      ],
      [
        1942,
        -5.0
      ],
      [
        1943,
        -5.0
      ],
      [
        1944,
        -5.0
      ],
      [
        1945,
        -5.0
      ],
      [
        1946,
        -9.0
      ],
      [
        1947,
        -9.0
      ],
      [
        1948,
        -9.0
      ],
      [
        1949,
        -9.0
      ],
      [
        1950,
        -9.0
      ],
      [
        1951,
        -9.0
      ],
      [
        1952,
        -9.0
      ],
      [
        1953,
        -9.0
      ],
      [
        1954,
        -9.0
      ],
      [
        1955,
        -9.0
      ],
      [
        1956,
        -9.0
      ],
      [
        1957,
        -9.0
      ],
      [
        1958,
        -9.0
      ],
      [
        1959,
        -9.0
      ],
      [
        1960,
        -9.0
      ],
      [
        1961,
        -9.0
      ],
      [
        1962,
        -9.0
      ],
      [
        1963,
        -9.0
      ],
      [
        1964,
        -9.0
      ],
      [
        1965,
        -9.0
      ],
      [
        1966,
        -9.0
      ],
      [
        1967,
        -9.0
      ],
      [
        1968,
        -9.0
      ],
      [
        1969,
        -9.0
      ],
      [
        1970,
        -9.0
      ],
      [
        1971,
        -9.0
      ],
      [
        1972,
        -9.0
      ],
      [
        1973,
        -9.0
      ],
      [
        1974,
        0.0
      ],
      [
        1975,
        -7.0
      ],
      [
        1976,
        -7.0
      ],
      [
        1977,
        -7.0
      ],
      [
        1978,
        -7.0
      ],
      [
        1979,
        -7.0
      ],
      [
        1980,
        -7.0
      ],
      [
        1981,
        -7.0
      ],
      [
        1982,
        -7.0
      ],
      [
        1983,
        -7.0
      ],
      [
        1984,
        -8.0
      ],
      [
        1985,
        -8.0
      ],
      [
        1986,
        -8.0
      ],
      [
        1987,
        -8.0
      ],
      [
        1988,
        -8.0
      ],
      [
        1989,
        -8.0
      ],
      [
        1990,
        -8.0
      ],
      [
        1991,
        0.0
      ],
      [
        1992,
        0.0
      ],
      [
        1993,
        0.0
      ],
      [
        1994,
        "NA"
      ],
      [
        1995,
        "NA"
      ],
      [
        1996,
        "NA"
      ],
      [
        1997,
        "NA"
      ],
      [
        1998,
        "NA"
      ],
      [
        1999,
        "NA"
      ],
      [
        2000,
        "NA"
      ],
      [
        2001,
        "NA"
      ],
      [
        2002,
        "NA"
      ],
      [
        2003,
        "NA"
      ],
      [
        2004,
        "NA"
      ],
      [
        2005,
        "NA"
      ],
      [
        2006,
        "NA"
      ],
      [
        2007,
        "NA"
      ],
      [
        2008,
        "NA"
      ],
      [
        2009,
        "NA"
      ],
      [
        2010,
        "NA"
      ],
      [
        2011,
        "NA"
      ],
      [
        2012,
        "NA"
      ],
      [
        2013,
        "NA"
      ],
      [
        2014,
        "NA"
      ],
      [
        2015,
        "NA"
      ]
    ],
    "sous_nutri": [
      [
        1960,
        "NA"
      ],
      [
        1961,
        "NA"
      ],
      [
        1962,
        "NA"
      ],
      [
        1963,
        "NA"
      ],
      [
        1964,
        "NA"
      ],
      [
        1965,
        "NA"
      ],
      [
        1966,
        244.7
      ],
      [
        1967,
        244.3
      ],
      [
        1968,
        244.0
      ],
      [
        1969,
        243.8
      ],
      [
        1970,
        243.7
      ],
      [
        1971,
        243.5
      ],
      [
        1972,
        243.5
      ],
      [
        1973,
        243.4
      ],
      [
        1974,
        243.1
      ],
      [
        1975,
        242.9
      ],
      [
        1976,
        242.9
      ],
      [
        1977,
        242.6
      ],
      [
        1978,
        242.0
      ],
      [
        1979,
        240.9
      ],
      [
        1980,
        239.2
      ],
      [
        1981,
        236.8
      ],
      [
        1982,
        233.6
      ],
      [
        1983,
        229.9
      ],
      [
        1984,
        226.0
      ],
      [
        1985,
        221.9
      ],
      [
        1986,
        217.8
      ],
      [
        1987,
        213.9
      ],
      [
        1988,
        210.0
      ],
      [
        1989,
        206.1
      ],
      [
        1990,
        201.8
      ],
      [
        1991,
        197.0
      ],
      [
        1992,
        191.6
      ],
      [
        1993,
        185.7
      ],
      [
        1994,
        179.3
      ],
      [
        1995,
        172.6
      ],
      [
        1996,
        166.0
      ],
      [
        1997,
        159.7
      ],
      [
        1998,
        153.6
      ],
      [
        1999,
        147.7
      ],
      [
        2000,
        141.8
      ],
      [
        2001,
        135.8
      ],
      [
        2002,
        129.6
      ],
      [
        2003,
        123.1
      ],
      [
        2004,
        116.6
      ],
      [
        2005,
        110.2
      ],
      [
        2006,
        104.1
      ],
      [
        2007,
        98.2
      ],
      [
        2008,
        92.8
      ],
      [
        2009,
        87.7
      ],
      [
        2010,
        82.9
      ],
      [
        2011,
        78.5
      ],
      [
        2012,
        74.3
      ],
      [
        2013,
        70.5
      ],
      [
        2014,
        66.8
      ],
      [
        2015,
        63.5
      ],
      [
        2016,
        60.4
      ],
      [
        2017,
        57.7
      ],
      [
        2018,
        55.2
      ],
      [
        2019,
        "NA"
      ]
    ],
    "volume_exp_biens": [
      [
        1980,
        "NA"
      ],
      [
        1981,
        -10.152000000000001
      ],
      [
        1982,
        -3.1260000000000003
      ],
      [
        1983,
        5.579
      ],
      [
        1984,
        10.343
      ],
      [
        1985,
        -22.469
      ],
      [
        1986,
        -4.591
      ],
      [
        1987,
        -15.943
      ],
      [
        1988,
        -7.02
      ],
      [
        1989,
        13.665
      ],
      [
        1990,
        44.265
      ],
      [
        1991,
        2.347
      ],
      [
        1992,
        2.752
      ],
      [
        1993,
        2.099
      ],
      [
        1994,
        1.17
      ],
      [
        1995,
        -0.28600000000000003
      ],
      [
        1996,
        26.188000000000002
      ],
      [
        1997,
        20.669
      ],
      [
        1998,
        -7.888
      ],
      [
        1999,
        8.057
      ],
      [
        2000,
        25.215999999999998
      ],
      [
        2001,
        9.163
      ],
      [
        2002,
        10.477
      ],
      [
        2003,
        20.679000000000002
      ],
      [
        2004,
        57.913000000000004
      ],
      [
        2005,
        -4.322
      ],
      [
        2006,
        -3.9210000000000003
      ],
      [
        2007,
        17.183
      ],
      [
        2008,
        5.428
      ],
      [
        2009,
        4.314
      ],
      [
        2010,
        15.739
      ],
      [
        2011,
        0.895
      ],
      [
        2012,
        -12.55
      ],
      [
        2013,
        15.6
      ],
      [
        2014,
        6.523
      ],
      [
        2015,
        -2.717
      ],
      [
        2016,
        4.953
      ],
      [
        2017,
        -1.079
      ],
      [
        2018,
        2.885
      ],
      [
        2019,
        -6.9239999999999995
      ],
      [
        2020,
        10.489
      ],
      [
        2021,
        4.854
      ],
      [
        2022,
        5.352
      ],
      [
        2023,
        5.144
      ],
      [
        2024,
        5.041
      ]
    ],
    "volume_exp_bs": [
      [
        1980,
        -20.921
      ],
      [
        1981,
        -10.151
      ],
      [
        1982,
        -3.1260000000000003
      ],
      [
        1983,
        5.579
      ],
      [
        1984,
        10.343
      ],
      [
        1985,
        -22.469
      ],
      [
        1986,
        -4.591
      ],
      [
        1987,
        -15.943
      ],
      [
        1988,
        -7.02
      ],
      [
        1989,
        13.665
      ],
      [
        1990,
        44.265
      ],
      [
        1991,
        2.925
      ],
      [
        1992,
        2.752
      ],
      [
        1993,
        2.099
      ],
      [
        1994,
        1.17
      ],
      [
        1995,
        -0.28600000000000003
      ],
      [
        1996,
        26.188000000000002
      ],
      [
        1997,
        20.669
      ],
      [
        1998,
        -7.888
      ],
      [
        1999,
        8.057
      ],
      [
        2000,
        25.215999999999998
      ],
      [
        2001,
        9.163
      ],
      [
        2002,
        10.477
      ],
      [
        2003,
        20.679000000000002
      ],
      [
        2004,
        57.913000000000004
      ],
      [
        2005,
        -4.322
      ],
      [
        2006,
        -3.9210000000000003
      ],
      [
        2007,
        17.183
      ],
      [
        2008,
        5.428
      ],
      [
        2009,
        4.314
      ],
      [
        2010,
        15.739
      ],
      [
        2011,
        0.895
      ],
      [
        2012,
        -12.55
      ],
      [
        2013,
        15.6
      ],
      [
        2014,
        6.853
      ],
      [
        2015,
        1.935
      ],
      [
        2016,
        10.780999999999999
      ],
      [
        2017,
        -8.199
      ],
      [
        2018,
        27.666
      ],
      [
        2019,
        9.809
      ],
      [
        2020,
        12.195
      ],
      [
        2021,
        4.692
      ],
      [
        2022,
        3.74
      ],
      [
        2023,
        9.807
      ],
      [
        2024,
        4.415
      ]
    ],
    "volume_import_biens": [
      [
        1980,
        "NA"
      ],
      [
        1981,
        6.9670000000000005
      ],
      [
        1982,
        16.21
      ],
      [
        1983,
        7.997000000000001
      ],
      [
        1984,
        23.869
      ],
      [
        1985,
        8.362
      ],
      [
        1986,
        -5.579
      ],
      [
        1987,
        17.98
      ],
      [
        1988,
        -6.403
      ],
      [
        1989,
        -10.3
      ],
      [
        1990,
        0.0
      ],
      [
        1991,
        0.0
      ],
      [
        1992,
        0.0
      ],
      [
        1993,
        0.0
      ],
      [
        1994,
        -14.793
      ],
      [
        1995,
        9.975
      ],
      [
        1996,
        2.975
      ],
      [
        1997,
        18.423
      ],
      [
        1998,
        9.857000000000001
      ],
      [
        1999,
        18.393
      ],
      [
        2000,
        -17.897000000000002
      ],
      [
        2001,
        -1.242
      ],
      [
        2002,
        10.612
      ],
      [
        2003,
        1.828
      ],
      [
        2004,
        32.521
      ],
      [
        2005,
        41.062
      ],
      [
        2006,
        15.737
      ],
      [
        2007,
        10.974
      ],
      [
        2008,
        12.095999999999998
      ],
      [
        2009,
        11.0
      ],
      [
        2010,
        11.323
      ],
      [
        2011,
        12.198
      ],
      [
        2012,
        9.294
      ],
      [
        2013,
        10.575
      ],
      [
        2014,
        17.905
      ],
      [
        2015,
        32.461
      ],
      [
        2016,
        13.175
      ],
      [
        2017,
        -4.29
      ],
      [
        2018,
        -8.362
      ],
      [
        2019,
        -0.32799999999999996
      ],
      [
        2020,
        7.062
      ],
      [
        2021,
        4.215
      ],
      [
        2022,
        4.407
      ],
      [
        2023,
        4.5680000000000005
      ],
      [
        2024,
        4.604
      ]
    ],
    "volume_import_bs": [
      [
        1980,
        2.614
      ],
      [
        1981,
        6.9670000000000005
      ],
      [
        1982,
        16.21
      ],
      [
        1983,
        7.997000000000001
      ],
      [
        1984,
        23.869
      ],
      [
        1985,
        8.362
      ],
      [
        1986,
        -5.579
      ],
      [
        1987,
        17.98
      ],
      [
        1988,
        -6.403
      ],
      [
        1989,
        -10.3
      ],
      [
        1990,
        -19.576
      ],
      [
        1991,
        7.859
      ],
      [
        1992,
        -12.93
      ],
      [
        1993,
        -3.49
      ],
      [
        1994,
        -14.793
      ],
      [
        1995,
        9.975
      ],
      [
        1996,
        2.975
      ],
      [
        1997,
        14.899000000000001
      ],
      [
        1998,
        18.852999999999998
      ],
      [
        1999,
        -17.39
      ],
      [
        2000,
        -4.136
      ],
      [
        2001,
        43.873999999999995
      ],
      [
        2002,
        -13.61
      ],
      [
        2003,
        22.193
      ],
      [
        2004,
        68.053
      ],
      [
        2005,
        18.587
      ],
      [
        2006,
        -5.919
      ],
      [
        2007,
        25.63
      ],
      [
        2008,
        13.556
      ],
      [
        2009,
        17.590999999999998
      ],
      [
        2010,
        33.358000000000004
      ],
      [
        2011,
        11.267999999999999
      ],
      [
        2012,
        22.07
      ],
      [
        2013,
        -5.063
      ],
      [
        2014,
        25.585
      ],
      [
        2015,
        26.653000000000002
      ],
      [
        2016,
        17.555
      ],
      [
        2017,
        -12.864
      ],
      [
        2018,
        -1.001
      ],
      [
        2019,
        2.887
      ],
      [
        2020,
        5.231
      ],
      [
        2021,
        2.548
      ],
      [
        2022,
        2.7030000000000003
      ],
      [
        2023,
        7.898
      ],
      [
        2024,
        2.7230000000000003
      ]
    ],
    "vuln_clim_ferdi": [
      [
        2018,
        52.91525684538429
      ]
    ],
    "vuln_clim_ndgain": [
      [
        1995,
        0.611237466881433
      ],
      [
        1996,
        0.6105479696187289
      ],
      [
        1997,
        0.6108635183103189
      ],
      [
        1998,
        0.606948666514147
      ],
      [
        1999,
        0.607627100837245
      ],
      [
        2000,
        0.6047553022608871
      ],
      [
        2001,
        0.607463100994937
      ],
      [
        2002,
        0.593386912519613
      ],
      [
        2003,
        0.6009569928109829
      ],
      [
        2004,
        0.6028567444411371
      ],
      [
        2005,
        0.6022974147196509
      ],
      [
        2006,
        0.598873665533213
      ],
      [
        2007,
        0.595856684965162
      ],
      [
        2008,
        0.593746098421942
      ],
      [
        2009,
        0.591388337295282
      ],
      [
        2010,
        0.5889822036770911
      ],
      [
        2011,
        0.584678672343607
      ],
      [
        2012,
        0.5798186904261999
      ],
      [
        2013,
        0.57727292017412
      ],
      [
        2014,
        0.572656627344366
      ],
      [
        2015,
        0.57101954341292
      ],
      [
        2016,
        0.570725798638829
      ]
    ]
  }
}