{
  "country": "SEN",
  "country_name": "Sénégal",
  "indicators": {
    "abo_mobile": [
      [
        1960,
        0.0
      ],
      [
        1961,
        "NA"
      ],
      [
        1962,
        "NA"
      ],
      [
        1963,
        "NA"
      ],
      [
        1964,
        "NA"
      ],
      [
        1965,
        0.0
      ],
      [
        1966,
        "NA"
      ],
      [
        1967,
        "NA"
      ],
      [
        1968,
        "NA"
      ],
      [
        1969,
        "NA"
      ],
      [
        1970,
        0.0
      ],
      [
        1971,
        "NA"
      ],
      [
        1972,
        "NA"
      ],
      [
        1973,
        "NA"
      ],
      [
        1974,
        "NA"
      ],
      [
        1975,
        0.0
      ],
      [
        1976,
        0.0
      ],
      [
        1977,
        0.0
      ],
      [
        1978,
        0.0
      ],
      [
        1979,
        0.0
      ],
      [
        1980,
        0.0
      ],
      [
        1981,
        0.0
      ],
      [
        1982,
        0.0
      ],
      [
        1983,
        0.0
      ],
      [
        1984,
        0.0
      ],
      [
        1985,
        0.0
      ],
      [
        1986,
        0.0
      ],
      [
        1987,
        0.0
      ],
      [
        1988,
        0.0
      ],
      [
        1989,
        0.0
      ],
      [
        1990,
        0.0
      ],
      [
        1991,
        0.0
      ],
      [
        1992,
        0.0
      ],
      [
        1993,
        0.0
      ],
      [
        1994,
        0.000098
      ],
      [
        1995,
        0.000122
      ],
      [
        1996,
        0.0014119999999999998
      ],
      [
        1997,
        0.006942
      ],
      [
        1998,
        0.027487
      ],
      [
        1999,
        0.087879
      ],
      [
        2000,
        0.250251
      ],
      [
        2001,
        0.301811
      ],
      [
        2002,
        0.553449
      ],
      [
        2003,
        0.782423
      ],
      [
        2004,
        1.121314
      ],
      [
        2005,
        1.7301060000000001
      ],
      [
        2006,
        2.982623
      ],
      [
        2007,
        3.630804
      ],
      [
        2008,
        5.389133
      ],
      [
        2009,
        6.901492
      ],
      [
        2010,
        8.343717
      ],
      [
        2011,
        9.352867999999999
      ],
      [
        2012,
        11.470646
      ],
      [
        2013,
        13.133772
      ],
      [
        2014,
        14.379729000000001
      ],
      [
        2015,
        14.959477
      ],
      [
        2016,
        15.186485000000001
      ],
      [
        2017,
        15.758366
      ],
      [
        2018,
        16.559942000000003
      ],
      [
        2019,
        "NA"
      ]
    ],
    "acces_elec": [
      [
        1960,
        "NA"
      ],
      [
        1961,
        "NA"
      ],
      [
        1962,
        "NA"
      ],
      [
        1963,
        "NA"
      ],
      [
        1964,
        "NA"
      ],
      [
        1965,
        "NA"
      ],
      [
        1966,
        "NA"
      ],
      [
        1967,
        "NA"
      ],
      [
        1968,
        "NA"
      ],
      [
        1969,
        "NA"
      ],
      [
        1970,
        "NA"
      ],
      [
        1971,
        "NA"
      ],
      [
        1972,
        "NA"
      ],
      [
        1973,
        "NA"
      ],
      [
        1974,
        "NA"
      ],
      [
        1975,
        "NA"
      ],
      [
        1976,
        "NA"
      ],
      [
        1977,
        "NA"
      ],
      [
        1978,
        "NA"
      ],
      [
        1979,
        "NA"
      ],
      [
        1980,
        "NA"
      ],
      [
        1981,
        "NA"
      ],
      [
        1982,
        "NA"
      ],
      [
        1983,
        "NA"
      ],
      [
        1984,
        "NA"
      ],
      [
        1985,
        "NA"
      ],
      [
        1986,
        "NA"
      ],
      [
        1987,
        "NA"
      ],
      [
        1988,
        "NA"
      ],
      [
        1989,
        "NA"
      ],
      [
        1990,
        "NA"
      ],
      [
        1991,
        "NA"
      ],
      [
        1992,
        "NA"
      ],
      [
        1993,
        26.0
      ],
      [
        1994,
        27.361673355100002
      ],
      [
        1995,
        29.002305984499998
      ],
      [
        1996,
        30.6453323364
      ],
      [
        1997,
        32.2
      ],
      [
        1998,
        33.9401245117
      ],
      [
        1999,
        36.2
      ],
      [
        2000,
        37.74
      ],
      [
        2001,
        38.8632926941
      ],
      [
        2002,
        36.8
      ],
      [
        2003,
        42.0814323425
      ],
      [
        2004,
        36.8
      ],
      [
        2005,
        47.1
      ],
      [
        2006,
        49.9
      ],
      [
        2007,
        48.27550888060001
      ],
      [
        2008,
        49.813385009799994
      ],
      [
        2009,
        53.5
      ],
      [
        2010,
        56.5
      ],
      [
        2011,
        56.5
      ],
      [
        2012,
        56.5
      ],
      [
        2013,
        57.0
      ],
      [
        2014,
        61.0
      ],
      [
        2015,
        60.5
      ],
      [
        2016,
        64.5
      ],
      [
        2017,
        61.7
      ],
      [
        2018,
        66.9594497681
      ],
      [
        2019,
        "NA"
      ]
    ],
    "acces_elec_primaire": [
      [
        2000,
        "NA"
      ],
      [
        2001,
        "NA"
      ],
      [
        2002,
        "NA"
      ],
      [
        2003,
        "NA"
      ],
      [
        2004,
        "NA"
      ],
      [
        2005,
        "NA"
      ],
      [
        2006,
        "NA"
      ],
      [
        2007,
        "NA"
      ],
      [
        2008,
        "NA"
      ],
      [
        2009,
        "NA"
      ],
      [
        2010,
        "NA"
      ],
      [
        2011,
        "NA"
      ],
      [
        2012,
        "NA"
      ],
      [
        2013,
        "NA"
      ],
      [
        2014,
        "NA"
      ],
      [
        2015,
        "NA"
      ],
      [
        2016,
        33.97782
      ],
      [
        2017,
        36.87481
      ],
      [
        2018,
        49.80202
      ],
      [
        2019,
        "NA"
      ]
    ],
    "alpha_adulte": [
      [
        1960,
        "NA"
      ],
      [
        1961,
        "NA"
      ],
      [
        1962,
        "NA"
      ],
      [
        1963,
        "NA"
      ],
      [
        1964,
        "NA"
      ],
      [
        1965,
        "NA"
      ],
      [
        1966,
        "NA"
      ],
      [
        1967,
        "NA"
      ],
      [
        1968,
        "NA"
      ],
      [
        1969,
        "NA"
      ],
      [
        1970,
        "NA"
      ],
      [
        1971,
        "NA"
      ],
      [
        1972,
        "NA"
      ],
      [
        1973,
        "NA"
      ],
      [
        1974,
        "NA"
      ],
      [
        1975,
        "NA"
      ],
      [
        1976,
        "NA"
      ],
      [
        1977,
        "NA"
      ],
      [
        1978,
        "NA"
      ],
      [
        1979,
        "NA"
      ],
      [
        1980,
        "NA"
      ],
      [
        1981,
        "NA"
      ],
      [
        1982,
        "NA"
      ],
      [
        1983,
        "NA"
      ],
      [
        1984,
        "NA"
      ],
      [
        1985,
        "NA"
      ],
      [
        1986,
        "NA"
      ],
      [
        1987,
        "NA"
      ],
      [
        1988,
        26.86885
      ],
      [
        1989,
        "NA"
      ],
      [
        1990,
        "NA"
      ],
      [
        1991,
        "NA"
      ],
      [
        1992,
        "NA"
      ],
      [
        1993,
        "NA"
      ],
      [
        1994,
        "NA"
      ],
      [
        1995,
        "NA"
      ],
      [
        1996,
        "NA"
      ],
      [
        1997,
        "NA"
      ],
      [
        1998,
        "NA"
      ],
      [
        1999,
        "NA"
      ],
      [
        2000,
        "NA"
      ],
      [
        2001,
        "NA"
      ],
      [
        2002,
        39.27525
      ],
      [
        2003,
        "NA"
      ],
      [
        2004,
        "NA"
      ],
      [
        2005,
        "NA"
      ],
      [
        2006,
        41.89115
      ],
      [
        2007,
        "NA"
      ],
      [
        2008,
        "NA"
      ],
      [
        2009,
        49.69513
      ],
      [
        2010,
        "NA"
      ],
      [
        2011,
        52.05196
      ],
      [
        2012,
        "NA"
      ],
      [
        2013,
        42.8175
      ],
      [
        2014,
        "NA"
      ],
      [
        2015,
        "NA"
      ],
      [
        2016,
        "NA"
      ],
      [
        2017,
        51.900420000000004
      ],
      [
        2018,
        "NA"
      ],
      [
        2019,
        "NA"
      ]
    ],
    "alpha_jeune": [
      [
        1960,
        "NA"
      ],
      [
        1961,
        "NA"
      ],
      [
        1962,
        "NA"
      ],
      [
        1963,
        "NA"
      ],
      [
        1964,
        "NA"
      ],
      [
        1965,
        "NA"
      ],
      [
        1966,
        "NA"
      ],
      [
        1967,
        "NA"
      ],
      [
        1968,
        "NA"
      ],
      [
        1969,
        "NA"
      ],
      [
        1970,
        "NA"
      ],
      [
        1971,
        "NA"
      ],
      [
        1972,
        "NA"
      ],
      [
        1973,
        "NA"
      ],
      [
        1974,
        "NA"
      ],
      [
        1975,
        "NA"
      ],
      [
        1976,
        "NA"
      ],
      [
        1977,
        "NA"
      ],
      [
        1978,
        "NA"
      ],
      [
        1979,
        "NA"
      ],
      [
        1980,
        "NA"
      ],
      [
        1981,
        "NA"
      ],
      [
        1982,
        "NA"
      ],
      [
        1983,
        "NA"
      ],
      [
        1984,
        "NA"
      ],
      [
        1985,
        "NA"
      ],
      [
        1986,
        "NA"
      ],
      [
        1987,
        "NA"
      ],
      [
        1988,
        37.8661
      ],
      [
        1989,
        "NA"
      ],
      [
        1990,
        "NA"
      ],
      [
        1991,
        "NA"
      ],
      [
        1992,
        "NA"
      ],
      [
        1993,
        "NA"
      ],
      [
        1994,
        "NA"
      ],
      [
        1995,
        "NA"
      ],
      [
        1996,
        "NA"
      ],
      [
        1997,
        "NA"
      ],
      [
        1998,
        "NA"
      ],
      [
        1999,
        "NA"
      ],
      [
        2000,
        "NA"
      ],
      [
        2001,
        "NA"
      ],
      [
        2002,
        49.12449
      ],
      [
        2003,
        "NA"
      ],
      [
        2004,
        "NA"
      ],
      [
        2005,
        "NA"
      ],
      [
        2006,
        50.851659999999995
      ],
      [
        2007,
        "NA"
      ],
      [
        2008,
        "NA"
      ],
      [
        2009,
        65.01491
      ],
      [
        2010,
        "NA"
      ],
      [
        2011,
        66.03274
      ],
      [
        2012,
        "NA"
      ],
      [
        2013,
        55.89594
      ],
      [
        2014,
        "NA"
      ],
      [
        2015,
        "NA"
      ],
      [
        2016,
        "NA"
      ],
      [
        2017,
        69.47841
      ],
      [
        2018,
        "NA"
      ],
      [
        2019,
        "NA"
      ]
    ],
    "bidonvilles": [
      [
        1960,
        "NA"
      ],
      [
        1961,
        "NA"
      ],
      [
        1962,
        "NA"
      ],
      [
        1963,
        "NA"
      ],
      [
        1964,
        "NA"
      ],
      [
        1965,
        "NA"
      ],
      [
        1966,
        "NA"
      ],
      [
        1967,
        "NA"
      ],
      [
        1968,
        "NA"
      ],
      [
        1969,
        "NA"
      ],
      [
        1970,
        "NA"
      ],
      [
        1971,
        "NA"
      ],
      [
        1972,
        "NA"
      ],
      [
        1973,
        "NA"
      ],
      [
        1974,
        "NA"
      ],
      [
        1975,
        "NA"
      ],
      [
        1976,
        "NA"
      ],
      [
        1977,
        "NA"
      ],
      [
        1978,
        "NA"
      ],
      [
        1979,
        "NA"
      ],
      [
        1980,
        "NA"
      ],
      [
        1981,
        "NA"
      ],
      [
        1982,
        "NA"
      ],
      [
        1983,
        "NA"
      ],
      [
        1984,
        "NA"
      ],
      [
        1985,
        "NA"
      ],
      [
        1986,
        "NA"
      ],
      [
        1987,
        "NA"
      ],
      [
        1988,
        "NA"
      ],
      [
        1989,
        "NA"
      ],
      [
        1990,
        70.6
      ],
      [
        1991,
        "NA"
      ],
      [
        1992,
        "NA"
      ],
      [
        1993,
        "NA"
      ],
      [
        1994,
        "NA"
      ],
      [
        1995,
        59.8
      ],
      [
        1996,
        "NA"
      ],
      [
        1997,
        "NA"
      ],
      [
        1998,
        "NA"
      ],
      [
        1999,
        "NA"
      ],
      [
        2000,
        48.9
      ],
      [
        2001,
        "NA"
      ],
      [
        2002,
        "NA"
      ],
      [
        2003,
        "NA"
      ],
      [
        2004,
        "NA"
      ],
      [
        2005,
        43.3
      ],
      [
        2006,
        "NA"
      ],
      [
        2007,
        41.1
      ],
      [
        2008,
        "NA"
      ],
      [
        2009,
        38.8
      ],
      [
        2010,
        "NA"
      ],
      [
        2011,
        "NA"
      ],
      [
        2012,
        "NA"
      ],
      [
        2013,
        "NA"
      ],
      [
        2014,
        39.4
      ],
      [
        2015,
        "NA"
      ],
      [
        2016,
        "NA"
      ],
      [
        2017,
        "NA"
      ],
      [
        2018,
        "NA"
      ],
      [
        2019,
        "NA"
      ]
    ],
    "compte_adulte": [
      [
        1960,
        "NA"
      ],
      [
        1961,
        "NA"
      ],
      [
        1962,
        "NA"
      ],
      [
        1963,
        "NA"
      ],
      [
        1964,
        "NA"
      ],
      [
        1965,
        "NA"
      ],
      [
        1966,
        "NA"
      ],
      [
        1967,
        "NA"
      ],
      [
        1968,
        "NA"
      ],
      [
        1969,
        "NA"
      ],
      [
        1970,
        "NA"
      ],
      [
        1971,
        "NA"
      ],
      [
        1972,
        "NA"
      ],
      [
        1973,
        "NA"
      ],
      [
        1974,
        "NA"
      ],
      [
        1975,
        "NA"
      ],
      [
        1976,
        "NA"
      ],
      [
        1977,
        "NA"
      ],
      [
        1978,
        "NA"
      ],
      [
        1979,
        "NA"
      ],
      [
        1980,
        "NA"
      ],
      [
        1981,
        "NA"
      ],
      [
        1982,
        "NA"
      ],
      [
        1983,
        "NA"
      ],
      [
        1984,
        "NA"
      ],
      [
        1985,
        "NA"
      ],
      [
        1986,
        "NA"
      ],
      [
        1987,
        "NA"
      ],
      [
        1988,
        "NA"
      ],
      [
        1989,
        "NA"
      ],
      [
        1990,
        "NA"
      ],
      [
        1991,
        "NA"
      ],
      [
        1992,
        "NA"
      ],
      [
        1993,
        "NA"
      ],
      [
        1994,
        "NA"
      ],
      [
        1995,
        "NA"
      ],
      [
        1996,
        "NA"
      ],
      [
        1997,
        "NA"
      ],
      [
        1998,
        "NA"
      ],
      [
        1999,
        "NA"
      ],
      [
        2000,
        "NA"
      ],
      [
        2001,
        "NA"
      ],
      [
        2002,
        "NA"
      ],
      [
        2003,
        "NA"
      ],
      [
        2004,
        "NA"
      ],
      [
        2005,
        "NA"
      ],
      [
        2006,
        "NA"
      ],
      [
        2007,
        "NA"
      ],
      [
        2008,
        "NA"
      ],
      [
        2009,
        "NA"
      ],
      [
        2010,
        "NA"
      ],
      [
        2011,
        8.7367515564
      ],
      [
        2012,
        "NA"
      ],
      [
        2013,
        "NA"
      ],
      [
        2014,
        19.9401473999
      ],
      [
        2015,
        "NA"
      ],
      [
        2016,
        "NA"
      ],
      [
        2017,
        46.502868652299995
      ],
      [
        2018,
        "NA"
      ],
      [
        2019,
        "NA"
      ]
    ],
    "compte_jeune": [
      [
        1960,
        "NA"
      ],
      [
        1961,
        "NA"
      ],
      [
        1962,
        "NA"
      ],
      [
        1963,
        "NA"
      ],
      [
        1964,
        "NA"
      ],
      [
        1965,
        "NA"
      ],
      [
        1966,
        "NA"
      ],
      [
        1967,
        "NA"
      ],
      [
        1968,
        "NA"
      ],
      [
        1969,
        "NA"
      ],
      [
        1970,
        "NA"
      ],
      [
        1971,
        "NA"
      ],
      [
        1972,
        "NA"
      ],
      [
        1973,
        "NA"
      ],
      [
        1974,
        "NA"
      ],
      [
        1975,
        "NA"
      ],
      [
        1976,
        "NA"
      ],
      [
        1977,
        "NA"
      ],
      [
        1978,
        "NA"
      ],
      [
        1979,
        "NA"
      ],
      [
        1980,
        "NA"
      ],
      [
        1981,
        "NA"
      ],
      [
        1982,
        "NA"
      ],
      [
        1983,
        "NA"
      ],
      [
        1984,
        "NA"
      ],
      [
        1985,
        "NA"
      ],
      [
        1986,
        "NA"
      ],
      [
        1987,
        "NA"
      ],
      [
        1988,
        "NA"
      ],
      [
        1989,
        "NA"
      ],
      [
        1990,
        "NA"
      ],
      [
        1991,
        "NA"
      ],
      [
        1992,
        "NA"
      ],
      [
        1993,
        "NA"
      ],
      [
        1994,
        "NA"
      ],
      [
        1995,
        "NA"
      ],
      [
        1996,
        "NA"
      ],
      [
        1997,
        "NA"
      ],
      [
        1998,
        "NA"
      ],
      [
        1999,
        "NA"
      ],
      [
        2000,
        "NA"
      ],
      [
        2001,
        "NA"
      ],
      [
        2002,
        "NA"
      ],
      [
        2003,
        "NA"
      ],
      [
        2004,
        "NA"
      ],
      [
        2005,
        "NA"
      ],
      [
        2006,
        "NA"
      ],
      [
        2007,
        "NA"
      ],
      [
        2008,
        "NA"
      ],
      [
        2009,
        "NA"
      ],
      [
        2010,
        "NA"
      ],
      [
        2011,
        0.4295527339
      ],
      [
        2012,
        "NA"
      ],
      [
        2013,
        "NA"
      ],
      [
        2014,
        6.750811576799999
      ],
      [
        2015,
        "NA"
      ],
      [
        2016,
        "NA"
      ],
      [
        2017,
        34.4454574585
      ],
      [
        2018,
        "NA"
      ],
      [
        2019,
        "NA"
      ]
    ],
    "croissance_pib": [
      [
        1960,
        "NA"
      ],
      [
        1961,
        2.993448255
      ],
      [
        1962,
        -0.1362353612
      ],
      [
        1963,
        1.8644785677000002
      ],
      [
        1964,
        3.8839271039999996
      ],
      [
        1965,
        1.3321894904
      ],
      [
        1966,
        2.8767609749000003
      ],
      [
        1967,
        -1.2197928651999999
      ],
      [
        1968,
        6.290773532899999
      ],
      [
        1969,
        -6.5541429211
      ],
      [
        1970,
        8.562045510499999
      ],
      [
        1971,
        -0.14044943880000002
      ],
      [
        1972,
        6.3832089163
      ],
      [
        1973,
        -5.583240107999999
      ],
      [
        1974,
        4.200775526
      ],
      [
        1975,
        7.535662599099999
      ],
      [
        1976,
        8.9205037043
      ],
      [
        1977,
        -2.6829053051
      ],
      [
        1978,
        -3.9539312614999997
      ],
      [
        1979,
        7.0016856150999995
      ],
      [
        1980,
        -3.3106477303
      ],
      [
        1981,
        5.0695164361
      ],
      [
        1982,
        7.8430646276
      ],
      [
        1983,
        -5.326392721
      ],
      [
        1984,
        3.7457643599
      ],
      [
        1985,
        3.2834706935000004
      ],
      [
        1986,
        3.1133397148000004
      ],
      [
        1987,
        6.0943745875
      ],
      [
        1988,
        -0.5924310017000001
      ],
      [
        1989,
        3.9778560851
      ],
      [
        1990,
        -0.6756381506999999
      ],
      [
        1991,
        2.5558254392
      ],
      [
        1992,
        1.2426472275
      ],
      [
        1993,
        1.3007804076
      ],
      [
        1994,
        -0.0173286588
      ],
      [
        1995,
        5.3634728866
      ],
      [
        1996,
        2.0121251133
      ],
      [
        1997,
        3.1240332823
      ],
      [
        1998,
        5.8986725635
      ],
      [
        1999,
        6.3471157946000005
      ],
      [
        2000,
        3.1989880356000002
      ],
      [
        2001,
        4.5809164418
      ],
      [
        2002,
        0.6548036476
      ],
      [
        2003,
        6.683228177799999
      ],
      [
        2004,
        5.8707722130999995
      ],
      [
        2005,
        5.6226068565
      ],
      [
        2006,
        2.4615702538999997
      ],
      [
        2007,
        4.9384850827
      ],
      [
        2008,
        4.0563757269
      ],
      [
        2009,
        2.0925270839
      ],
      [
        2010,
        3.5627453899
      ],
      [
        2011,
        1.4583886713999998
      ],
      [
        2012,
        5.1173942367
      ],
      [
        2013,
        2.8221056497
      ],
      [
        2014,
        6.613074741699999
      ],
      [
        2015,
        6.3672634271
      ],
      [
        2016,
        6.3563967915
      ],
      [
        2017,
        7.0829222909
      ],
      [
        2018,
        6.7662938235
      ],
      [
        2019,
        "NA"
      ]
    ],
    "eau_douce_agri": [
      [
        1960,
        "NA"
      ],
      [
        1961,
        "NA"
      ],
      [
        1962,
        "NA"
      ],
      [
        1963,
        "NA"
      ],
      [
        1964,
        "NA"
      ],
      [
        1965,
        "NA"
      ],
      [
        1966,
        "NA"
      ],
      [
        1967,
        "NA"
      ],
      [
        1968,
        "NA"
      ],
      [
        1969,
        "NA"
      ],
      [
        1970,
        "NA"
      ],
      [
        1971,
        "NA"
      ],
      [
        1972,
        "NA"
      ],
      [
        1973,
        "NA"
      ],
      [
        1974,
        "NA"
      ],
      [
        1975,
        "NA"
      ],
      [
        1976,
        "NA"
      ],
      [
        1977,
        "NA"
      ],
      [
        1978,
        "NA"
      ],
      [
        1979,
        "NA"
      ],
      [
        1980,
        "NA"
      ],
      [
        1981,
        "NA"
      ],
      [
        1982,
        "NA"
      ],
      [
        1983,
        "NA"
      ],
      [
        1984,
        "NA"
      ],
      [
        1985,
        "NA"
      ],
      [
        1986,
        "NA"
      ],
      [
        1987,
        91.99
      ],
      [
        1988,
        "NA"
      ],
      [
        1989,
        "NA"
      ],
      [
        1990,
        "NA"
      ],
      [
        1991,
        "NA"
      ],
      [
        1992,
        "NA"
      ],
      [
        1993,
        "NA"
      ],
      [
        1994,
        "NA"
      ],
      [
        1995,
        "NA"
      ],
      [
        1996,
        "NA"
      ],
      [
        1997,
        "NA"
      ],
      [
        1998,
        "NA"
      ],
      [
        1999,
        "NA"
      ],
      [
        2000,
        "NA"
      ],
      [
        2001,
        "NA"
      ],
      [
        2002,
        92.98
      ],
      [
        2003,
        "NA"
      ],
      [
        2004,
        "NA"
      ],
      [
        2005,
        "NA"
      ],
      [
        2006,
        "NA"
      ],
      [
        2007,
        "NA"
      ],
      [
        2008,
        "NA"
      ],
      [
        2009,
        "NA"
      ],
      [
        2010,
        "NA"
      ],
      [
        2011,
        "NA"
      ],
      [
        2012,
        "NA"
      ],
      [
        2013,
        "NA"
      ],
      [
        2014,
        "NA"
      ],
      [
        2015,
        "NA"
      ],
      [
        2016,
        "NA"
      ],
      [
        2017,
        "NA"
      ],
      [
        2018,
        "NA"
      ],
      [
        2019,
        "NA"
      ]
    ],
    "eau_potable_primaire": [
      [
        2000,
        "NA"
      ],
      [
        2001,
        "NA"
      ],
      [
        2002,
        "NA"
      ],
      [
        2003,
        "NA"
      ],
      [
        2004,
        "NA"
      ],
      [
        2005,
        "NA"
      ],
      [
        2006,
        "NA"
      ],
      [
        2007,
        "NA"
      ],
      [
        2008,
        "NA"
      ],
      [
        2009,
        "NA"
      ],
      [
        2010,
        "NA"
      ],
      [
        2011,
        "NA"
      ],
      [
        2012,
        "NA"
      ],
      [
        2013,
        "NA"
      ],
      [
        2014,
        "NA"
      ],
      [
        2015,
        "NA"
      ],
      [
        2016,
        "NA"
      ],
      [
        2017,
        "NA"
      ],
      [
        2018,
        77.5985
      ],
      [
        2019,
        "NA"
      ]
    ],
    "emploi_agri": [
      [
        1960,
        "NA"
      ],
      [
        1961,
        "NA"
      ],
      [
        1962,
        "NA"
      ],
      [
        1963,
        "NA"
      ],
      [
        1964,
        "NA"
      ],
      [
        1965,
        "NA"
      ],
      [
        1966,
        "NA"
      ],
      [
        1967,
        "NA"
      ],
      [
        1968,
        "NA"
      ],
      [
        1969,
        "NA"
      ],
      [
        1970,
        "NA"
      ],
      [
        1971,
        "NA"
      ],
      [
        1972,
        "NA"
      ],
      [
        1973,
        "NA"
      ],
      [
        1974,
        "NA"
      ],
      [
        1975,
        "NA"
      ],
      [
        1976,
        "NA"
      ],
      [
        1977,
        "NA"
      ],
      [
        1978,
        "NA"
      ],
      [
        1979,
        "NA"
      ],
      [
        1980,
        "NA"
      ],
      [
        1981,
        "NA"
      ],
      [
        1982,
        "NA"
      ],
      [
        1983,
        "NA"
      ],
      [
        1984,
        "NA"
      ],
      [
        1985,
        "NA"
      ],
      [
        1986,
        "NA"
      ],
      [
        1987,
        "NA"
      ],
      [
        1988,
        "NA"
      ],
      [
        1989,
        "NA"
      ],
      [
        1990,
        "NA"
      ],
      [
        1991,
        48.7949981689
      ],
      [
        1992,
        48.7159996033
      ],
      [
        1993,
        48.6209983826
      ],
      [
        1994,
        48.569999694799996
      ],
      [
        1995,
        48.2799987793
      ],
      [
        1996,
        48.0929985046
      ],
      [
        1997,
        47.8019981384
      ],
      [
        1998,
        47.304000854499996
      ],
      [
        1999,
        46.7099990845
      ],
      [
        2000,
        46.25799942020001
      ],
      [
        2001,
        45.63000106810001
      ],
      [
        2002,
        45.138999938999994
      ],
      [
        2003,
        44.195999145500004
      ],
      [
        2004,
        43.2319984436
      ],
      [
        2005,
        42.3089981079
      ],
      [
        2006,
        41.5699996948
      ],
      [
        2007,
        40.6199989319
      ],
      [
        2008,
        39.7729988098
      ],
      [
        2009,
        39.0660018921
      ],
      [
        2010,
        38.1910018921
      ],
      [
        2011,
        37.4230003357
      ],
      [
        2012,
        36.4020004272
      ],
      [
        2013,
        35.5200004578
      ],
      [
        2014,
        34.331001281700004
      ],
      [
        2015,
        33.3330001831
      ],
      [
        2016,
        32.4430007935
      ],
      [
        2017,
        31.542999267600003
      ],
      [
        2018,
        30.704999923699997
      ],
      [
        2019,
        30.045999527
      ]
    ],
    "enseignant_primaire": [
      [
        1960,
        "NA"
      ],
      [
        1961,
        "NA"
      ],
      [
        1962,
        "NA"
      ],
      [
        1963,
        "NA"
      ],
      [
        1964,
        "NA"
      ],
      [
        1965,
        "NA"
      ],
      [
        1966,
        "NA"
      ],
      [
        1967,
        "NA"
      ],
      [
        1968,
        "NA"
      ],
      [
        1969,
        "NA"
      ],
      [
        1970,
        "NA"
      ],
      [
        1971,
        "NA"
      ],
      [
        1972,
        "NA"
      ],
      [
        1973,
        "NA"
      ],
      [
        1974,
        "NA"
      ],
      [
        1975,
        "NA"
      ],
      [
        1976,
        "NA"
      ],
      [
        1977,
        "NA"
      ],
      [
        1978,
        "NA"
      ],
      [
        1979,
        "NA"
      ],
      [
        1980,
        "NA"
      ],
      [
        1981,
        "NA"
      ],
      [
        1982,
        "NA"
      ],
      [
        1983,
        "NA"
      ],
      [
        1984,
        "NA"
      ],
      [
        1985,
        "NA"
      ],
      [
        1986,
        "NA"
      ],
      [
        1987,
        "NA"
      ],
      [
        1988,
        "NA"
      ],
      [
        1989,
        "NA"
      ],
      [
        1990,
        "NA"
      ],
      [
        1991,
        "NA"
      ],
      [
        1992,
        "NA"
      ],
      [
        1993,
        "NA"
      ],
      [
        1994,
        "NA"
      ],
      [
        1995,
        "NA"
      ],
      [
        1996,
        "NA"
      ],
      [
        1997,
        "NA"
      ],
      [
        1998,
        "NA"
      ],
      [
        1999,
        "NA"
      ],
      [
        2000,
        "NA"
      ],
      [
        2001,
        "NA"
      ],
      [
        2002,
        "NA"
      ],
      [
        2003,
        55.379059999999996
      ],
      [
        2004,
        50.84206
      ],
      [
        2005,
        45.69771
      ],
      [
        2006,
        49.69535
      ],
      [
        2007,
        46.03869
      ],
      [
        2008,
        46.18381
      ],
      [
        2009,
        42.56055
      ],
      [
        2010,
        47.85285
      ],
      [
        2011,
        63.10219
      ],
      [
        2012,
        64.72176999999999
      ],
      [
        2013,
        72.37909
      ],
      [
        2014,
        69.96822
      ],
      [
        2015,
        68.33981999999999
      ],
      [
        2016,
        69.68075
      ],
      [
        2017,
        74.77264
      ],
      [
        2018,
        79.35576999999999
      ],
      [
        2019,
        "NA"
      ]
    ],
    "enseignant_secondaire": [
      [
        1960,
        "NA"
      ],
      [
        1961,
        "NA"
      ],
      [
        1962,
        "NA"
      ],
      [
        1963,
        "NA"
      ],
      [
        1964,
        "NA"
      ],
      [
        1965,
        "NA"
      ],
      [
        1966,
        "NA"
      ],
      [
        1967,
        "NA"
      ],
      [
        1968,
        "NA"
      ],
      [
        1969,
        "NA"
      ],
      [
        1970,
        "NA"
      ],
      [
        1971,
        "NA"
      ],
      [
        1972,
        "NA"
      ],
      [
        1973,
        "NA"
      ],
      [
        1974,
        "NA"
      ],
      [
        1975,
        "NA"
      ],
      [
        1976,
        "NA"
      ],
      [
        1977,
        "NA"
      ],
      [
        1978,
        "NA"
      ],
      [
        1979,
        "NA"
      ],
      [
        1980,
        "NA"
      ],
      [
        1981,
        "NA"
      ],
      [
        1982,
        "NA"
      ],
      [
        1983,
        "NA"
      ],
      [
        1984,
        "NA"
      ],
      [
        1985,
        "NA"
      ],
      [
        1986,
        "NA"
      ],
      [
        1987,
        "NA"
      ],
      [
        1988,
        "NA"
      ],
      [
        1989,
        "NA"
      ],
      [
        1990,
        "NA"
      ],
      [
        1991,
        "NA"
      ],
      [
        1992,
        "NA"
      ],
      [
        1993,
        "NA"
      ],
      [
        1994,
        "NA"
      ],
      [
        1995,
        "NA"
      ],
      [
        1996,
        "NA"
      ],
      [
        1997,
        "NA"
      ],
      [
        1998,
        "NA"
      ],
      [
        1999,
        "NA"
      ],
      [
        2000,
        "NA"
      ],
      [
        2001,
        "NA"
      ],
      [
        2002,
        "NA"
      ],
      [
        2003,
        "NA"
      ],
      [
        2004,
        "NA"
      ],
      [
        2005,
        "NA"
      ],
      [
        2006,
        "NA"
      ],
      [
        2007,
        "NA"
      ],
      [
        2008,
        "NA"
      ],
      [
        2009,
        "NA"
      ],
      [
        2010,
        "NA"
      ],
      [
        2011,
        39.42585
      ],
      [
        2012,
        45.19019
      ],
      [
        2013,
        55.48466
      ],
      [
        2014,
        61.49653000000001
      ],
      [
        2015,
        72.45545
      ],
      [
        2016,
        76.70994
      ],
      [
        2017,
        "NA"
      ],
      [
        2018,
        "NA"
      ],
      [
        2019,
        "NA"
      ]
    ],
    "frag_pol": [
      [
        2006,
        0.0
      ],
      [
        2007,
        0.0
      ],
      [
        2008,
        0.0
      ],
      [
        2009,
        0.0
      ],
      [
        2010,
        0.0
      ],
      [
        2011,
        0.0
      ],
      [
        2012,
        0.0
      ],
      [
        2013,
        0.0
      ],
      [
        2014,
        0.0
      ],
      [
        2015,
        0.0
      ],
      [
        2016,
        0.0
      ],
      [
        2017,
        0.0
      ]
    ],
    "idh": [
      [
        1990,
        0.3670000000000001
      ],
      [
        1991,
        0.3670000000000001
      ],
      [
        1992,
        0.368
      ],
      [
        1993,
        0.3670000000000001
      ],
      [
        1994,
        0.366
      ],
      [
        1995,
        0.368
      ],
      [
        1996,
        0.369
      ],
      [
        1997,
        0.37
      ],
      [
        1998,
        0.373
      ],
      [
        1999,
        0.375
      ],
      [
        2000,
        0.38
      ],
      [
        2001,
        0.395
      ],
      [
        2002,
        0.4
      ],
      [
        2003,
        0.407
      ],
      [
        2004,
        0.415
      ],
      [
        2005,
        0.422
      ],
      [
        2006,
        0.4270000000000001
      ],
      [
        2007,
        0.436
      ],
      [
        2008,
        0.445
      ],
      [
        2009,
        0.449
      ],
      [
        2010,
        0.456
      ],
      [
        2011,
        0.467
      ],
      [
        2012,
        0.476
      ],
      [
        2013,
        0.481
      ],
      [
        2014,
        0.486
      ],
      [
        2015,
        0.4920000000000001
      ],
      [
        2016,
        0.499
      ],
      [
        2017,
        0.505
      ]
    ],
    "incub_start_up": [
      [
        2016,
        10.0
      ],
      [
        2018,
        13.0
      ]
    ],
    "lib_monde": [
      [
        2013,
        3.0
      ],
      [
        2014,
        3.0
      ],
      [
        2015,
        3.0
      ],
      [
        2016,
        3.0
      ],
      [
        2017,
        3.0
      ],
      [
        2018,
        3.0
      ]
    ],
    "migration": [
      [
        1955,
        2.495
      ],
      [
        1960,
        2.929
      ],
      [
        1965,
        2.903
      ],
      [
        1970,
        4.359
      ],
      [
        1975,
        2.855
      ],
      [
        1980,
        -5.127999999999999
      ],
      [
        1985,
        -2.824
      ],
      [
        1990,
        -1.723
      ],
      [
        1995,
        -1.899
      ],
      [
        2000,
        -4.923
      ],
      [
        2005,
        -3.878
      ],
      [
        2010,
        -3.6689999999999996
      ],
      [
        2015,
        -3.141
      ],
      [
        2020,
        -1.2770000000000001
      ],
      [
        2025,
        -1.117
      ],
      [
        2030,
        -0.985
      ],
      [
        2035,
        -0.8740000000000001
      ],
      [
        2040,
        -0.779
      ],
      [
        2045,
        -0.7
      ],
      [
        2050,
        -0.632
      ],
      [
        2055,
        -0.575
      ],
      [
        2060,
        -0.527
      ],
      [
        2065,
        -0.486
      ],
      [
        2070,
        -0.451
      ],
      [
        2075,
        -0.42
      ],
      [
        2080,
        -0.39399999999999996
      ],
      [
        2085,
        -0.37200000000000005
      ],
      [
        2090,
        -0.35200000000000004
      ],
      [
        2095,
        -0.336
      ],
      [
        2100,
        -0.321
      ]
    ],
    "mortal_infant": [
      [
        1960,
        296.4
      ],
      [
        1961,
        296.3
      ],
      [
        1962,
        296.8
      ],
      [
        1963,
        297.6
      ],
      [
        1964,
        298.0
      ],
      [
        1965,
        298.2
      ],
      [
        1966,
        297.8
      ],
      [
        1967,
        296.7
      ],
      [
        1968,
        294.9
      ],
      [
        1969,
        292.2
      ],
      [
        1970,
        288.3
      ],
      [
        1971,
        283.2
      ],
      [
        1972,
        276.9
      ],
      [
        1973,
        269.6
      ],
      [
        1974,
        261.4
      ],
      [
        1975,
        252.0
      ],
      [
        1976,
        241.6
      ],
      [
        1977,
        230.8
      ],
      [
        1978,
        220.7
      ],
      [
        1979,
        211.9
      ],
      [
        1980,
        204.1
      ],
      [
        1981,
        197.4
      ],
      [
        1982,
        191.3
      ],
      [
        1983,
        185.2
      ],
      [
        1984,
        178.5
      ],
      [
        1985,
        171.1
      ],
      [
        1986,
        163.1
      ],
      [
        1987,
        155.1
      ],
      [
        1988,
        148.1
      ],
      [
        1989,
        142.7
      ],
      [
        1990,
        139.0
      ],
      [
        1991,
        137.1
      ],
      [
        1992,
        136.8
      ],
      [
        1993,
        137.4
      ],
      [
        1994,
        138.6
      ],
      [
        1995,
        139.9
      ],
      [
        1996,
        140.7
      ],
      [
        1997,
        140.7
      ],
      [
        1998,
        139.4
      ],
      [
        1999,
        136.3
      ],
      [
        2000,
        131.5
      ],
      [
        2001,
        124.9
      ],
      [
        2002,
        117.2
      ],
      [
        2003,
        109.1
      ],
      [
        2004,
        101.1
      ],
      [
        2005,
        93.7
      ],
      [
        2006,
        87.0
      ],
      [
        2007,
        80.9
      ],
      [
        2008,
        75.5
      ],
      [
        2009,
        70.7
      ],
      [
        2010,
        66.4
      ],
      [
        2011,
        62.5
      ],
      [
        2012,
        59.0
      ],
      [
        2013,
        55.8
      ],
      [
        2014,
        52.9
      ],
      [
        2015,
        50.1
      ],
      [
        2016,
        47.7
      ],
      [
        2017,
        45.6
      ],
      [
        2018,
        43.6
      ],
      [
        2019,
        "NA"
      ]
    ],
    "pib": [
      [
        1980,
        4.435
      ],
      [
        1981,
        4.022
      ],
      [
        1982,
        3.937
      ],
      [
        1983,
        3.512
      ],
      [
        1984,
        3.425
      ],
      [
        1985,
        3.75
      ],
      [
        1986,
        5.303999999999999
      ],
      [
        1987,
        6.381
      ],
      [
        1988,
        6.311
      ],
      [
        1989,
        6.22
      ],
      [
        1990,
        7.237
      ],
      [
        1991,
        7.111000000000001
      ],
      [
        1992,
        7.602
      ],
      [
        1993,
        7.189
      ],
      [
        1994,
        4.908
      ],
      [
        1995,
        6.1770000000000005
      ],
      [
        1996,
        6.412999999999999
      ],
      [
        1997,
        5.915
      ],
      [
        1998,
        6.404
      ],
      [
        1999,
        6.521
      ],
      [
        2000,
        5.966
      ],
      [
        2001,
        6.18
      ],
      [
        2002,
        6.78
      ],
      [
        2003,
        8.701
      ],
      [
        2004,
        10.181000000000001
      ],
      [
        2005,
        11.033
      ],
      [
        2006,
        11.859000000000002
      ],
      [
        2007,
        14.307
      ],
      [
        2008,
        17.017
      ],
      [
        2009,
        16.296
      ],
      [
        2010,
        16.244
      ],
      [
        2011,
        17.899
      ],
      [
        2012,
        17.836
      ],
      [
        2013,
        18.965999999999998
      ],
      [
        2014,
        19.802
      ],
      [
        2015,
        17.777
      ],
      [
        2016,
        19.035
      ],
      [
        2017,
        20.933000000000003
      ],
      [
        2018,
        23.498
      ],
      [
        2019,
        23.94
      ],
      [
        2020,
        25.768
      ],
      [
        2021,
        28.319000000000003
      ],
      [
        2022,
        31.304000000000002
      ],
      [
        2023,
        35.952
      ],
      [
        2024,
        39.708
      ]
    ],
    "pib_hab": [
      [
        1980,
        781.318
      ],
      [
        1981,
        689.676
      ],
      [
        1982,
        656.587
      ],
      [
        1983,
        569.224
      ],
      [
        1984,
        539.145
      ],
      [
        1985,
        573.039
      ],
      [
        1986,
        786.525
      ],
      [
        1987,
        917.9069999999999
      ],
      [
        1988,
        880.712
      ],
      [
        1989,
        842.541
      ],
      [
        1990,
        952.4169999999999
      ],
      [
        1991,
        910.029
      ],
      [
        1992,
        946.7389999999999
      ],
      [
        1993,
        869.0939999999999
      ],
      [
        1994,
        576.64
      ],
      [
        1995,
        706.207
      ],
      [
        1996,
        714.635
      ],
      [
        1997,
        643.1709999999999
      ],
      [
        1998,
        679.9
      ],
      [
        1999,
        676.041
      ],
      [
        2000,
        603.592
      ],
      [
        2001,
        609.832
      ],
      [
        2002,
        652.081
      ],
      [
        2003,
        815.347
      ],
      [
        2004,
        929.2739999999999
      ],
      [
        2005,
        980.628
      ],
      [
        2006,
        1026.153
      ],
      [
        2007,
        1204.9089999999999
      ],
      [
        2008,
        1394.345
      ],
      [
        2009,
        1298.383
      ],
      [
        2010,
        1257.654
      ],
      [
        2011,
        1345.7020000000002
      ],
      [
        2012,
        1301.5410000000002
      ],
      [
        2013,
        1343.16
      ],
      [
        2014,
        1361.351
      ],
      [
        2015,
        1186.925
      ],
      [
        2016,
        1235.111
      ],
      [
        2017,
        1320.62
      ],
      [
        2018,
        1441.4270000000001
      ],
      [
        2019,
        1427.8729999999998
      ],
      [
        2020,
        1494.3139999999999
      ],
      [
        2021,
        1596.807
      ],
      [
        2022,
        1716.191
      ],
      [
        2023,
        1916.4520000000002
      ],
      [
        2024,
        2058.036
      ]
    ],
    "pib_ppa": [
      [
        1980,
        5.836
      ],
      [
        1981,
        6.712000000000001
      ],
      [
        1982,
        7.685
      ],
      [
        1983,
        7.561
      ],
      [
        1984,
        8.127
      ],
      [
        1985,
        8.658999999999999
      ],
      [
        1986,
        9.109
      ],
      [
        1987,
        9.902999999999999
      ],
      [
        1988,
        10.191
      ],
      [
        1989,
        11.012
      ],
      [
        1990,
        11.347000000000001
      ],
      [
        1991,
        12.030999999999999
      ],
      [
        1992,
        12.458
      ],
      [
        1993,
        12.919
      ],
      [
        1994,
        13.193
      ],
      [
        1995,
        14.192
      ],
      [
        1996,
        14.742
      ],
      [
        1997,
        15.465
      ],
      [
        1998,
        16.561
      ],
      [
        1999,
        17.867
      ],
      [
        2000,
        18.851
      ],
      [
        2001,
        20.147000000000002
      ],
      [
        2002,
        20.599
      ],
      [
        2003,
        22.384
      ],
      [
        2004,
        24.336
      ],
      [
        2005,
        26.505
      ],
      [
        2006,
        27.98
      ],
      [
        2007,
        30.15
      ],
      [
        2008,
        31.983
      ],
      [
        2009,
        32.900999999999996
      ],
      [
        2010,
        34.471
      ],
      [
        2011,
        35.704
      ],
      [
        2012,
        38.251
      ],
      [
        2013,
        40.02
      ],
      [
        2014,
        43.457
      ],
      [
        2015,
        46.705
      ],
      [
        2016,
        50.188
      ],
      [
        2017,
        54.92100000000001
      ],
      [
        2018,
        59.839
      ],
      [
        2019,
        64.101
      ],
      [
        2020,
        66.438
      ],
      [
        2021,
        71.45100000000001
      ]
    ],
    "pop_pauvrete": [
      [
        1960,
        "NA"
      ],
      [
        1961,
        "NA"
      ],
      [
        1962,
        "NA"
      ],
      [
        1963,
        "NA"
      ],
      [
        1964,
        "NA"
      ],
      [
        1965,
        "NA"
      ],
      [
        1966,
        "NA"
      ],
      [
        1967,
        "NA"
      ],
      [
        1968,
        "NA"
      ],
      [
        1969,
        "NA"
      ],
      [
        1970,
        "NA"
      ],
      [
        1971,
        "NA"
      ],
      [
        1972,
        "NA"
      ],
      [
        1973,
        "NA"
      ],
      [
        1974,
        "NA"
      ],
      [
        1975,
        "NA"
      ],
      [
        1976,
        "NA"
      ],
      [
        1977,
        "NA"
      ],
      [
        1978,
        "NA"
      ],
      [
        1979,
        "NA"
      ],
      [
        1980,
        "NA"
      ],
      [
        1981,
        "NA"
      ],
      [
        1982,
        "NA"
      ],
      [
        1983,
        "NA"
      ],
      [
        1984,
        "NA"
      ],
      [
        1985,
        "NA"
      ],
      [
        1986,
        "NA"
      ],
      [
        1987,
        "NA"
      ],
      [
        1988,
        "NA"
      ],
      [
        1989,
        "NA"
      ],
      [
        1990,
        "NA"
      ],
      [
        1991,
        67.9
      ],
      [
        1992,
        "NA"
      ],
      [
        1993,
        "NA"
      ],
      [
        1994,
        56.6
      ],
      [
        1995,
        "NA"
      ],
      [
        1996,
        "NA"
      ],
      [
        1997,
        "NA"
      ],
      [
        1998,
        "NA"
      ],
      [
        1999,
        "NA"
      ],
      [
        2000,
        "NA"
      ],
      [
        2001,
        48.3
      ],
      [
        2002,
        "NA"
      ],
      [
        2003,
        "NA"
      ],
      [
        2004,
        "NA"
      ],
      [
        2005,
        37.4
      ],
      [
        2006,
        "NA"
      ],
      [
        2007,
        "NA"
      ],
      [
        2008,
        "NA"
      ],
      [
        2009,
        "NA"
      ],
      [
        2010,
        "NA"
      ],
      [
        2011,
        38.0
      ],
      [
        2012,
        "NA"
      ],
      [
        2013,
        "NA"
      ],
      [
        2014,
        "NA"
      ],
      [
        2015,
        "NA"
      ],
      [
        2016,
        "NA"
      ],
      [
        2017,
        "NA"
      ],
      [
        2018,
        "NA"
      ],
      [
        2019,
        "NA"
      ]
    ],
    "pop_rurale": [
      [
        1960,
        77.0
      ],
      [
        1961,
        76.355
      ],
      [
        1962,
        75.697
      ],
      [
        1963,
        75.027
      ],
      [
        1964,
        74.343
      ],
      [
        1965,
        73.649
      ],
      [
        1966,
        72.943
      ],
      [
        1967,
        72.22399999999999
      ],
      [
        1968,
        71.493
      ],
      [
        1969,
        70.753
      ],
      [
        1970,
        70.0
      ],
      [
        1971,
        69.28
      ],
      [
        1972,
        68.54899999999999
      ],
      [
        1973,
        67.811
      ],
      [
        1974,
        67.063
      ],
      [
        1975,
        66.307
      ],
      [
        1976,
        65.628
      ],
      [
        1977,
        65.282
      ],
      [
        1978,
        64.933
      ],
      [
        1979,
        64.583
      ],
      [
        1980,
        64.23100000000001
      ],
      [
        1981,
        63.878
      ],
      [
        1982,
        63.523999999999994
      ],
      [
        1983,
        63.168
      ],
      [
        1984,
        62.809
      ],
      [
        1985,
        62.451
      ],
      [
        1986,
        62.091
      ],
      [
        1987,
        61.729
      ],
      [
        1988,
        61.387
      ],
      [
        1989,
        61.245
      ],
      [
        1990,
        61.104
      ],
      [
        1991,
        60.961999999999996
      ],
      [
        1992,
        60.82
      ],
      [
        1993,
        60.678999999999995
      ],
      [
        1994,
        60.536
      ],
      [
        1995,
        60.394
      ],
      [
        1996,
        60.251000000000005
      ],
      [
        1997,
        60.108999999999995
      ],
      [
        1998,
        59.966
      ],
      [
        1999,
        59.823
      ],
      [
        2000,
        59.68
      ],
      [
        2001,
        59.536
      ],
      [
        2002,
        59.393
      ],
      [
        2003,
        59.102
      ],
      [
        2004,
        58.693999999999996
      ],
      [
        2005,
        58.286
      ],
      [
        2006,
        57.876000000000005
      ],
      [
        2007,
        57.465
      ],
      [
        2008,
        57.053000000000004
      ],
      [
        2009,
        56.641000000000005
      ],
      [
        2010,
        56.227
      ],
      [
        2011,
        55.812
      ],
      [
        2012,
        55.397
      ],
      [
        2013,
        54.981
      ],
      [
        2014,
        54.56399999999999
      ],
      [
        2015,
        54.138000000000005
      ],
      [
        2016,
        53.70399999999999
      ],
      [
        2017,
        53.26
      ],
      [
        2018,
        52.808
      ],
      [
        2019,
        "NA"
      ]
    ],
    "pop_tot": [
      [
        1950,
        2.4866349999999997
      ],
      [
        1951,
        2.545339
      ],
      [
        1952,
        2.606624
      ],
      [
        1953,
        2.670744
      ],
      [
        1954,
        2.737905
      ],
      [
        1955,
        2.808225
      ],
      [
        1956,
        2.881764
      ],
      [
        1957,
        2.958485
      ],
      [
        1958,
        3.038296
      ],
      [
        1959,
        3.121085
      ],
      [
        1960,
        3.2067490000000003
      ],
      [
        1961,
        3.295278
      ],
      [
        1962,
        3.386806
      ],
      [
        1963,
        3.4816540000000002
      ],
      [
        1964,
        3.5802389999999997
      ],
      [
        1965,
        3.682876
      ],
      [
        1966,
        3.7893830000000004
      ],
      [
        1967,
        3.8996440000000003
      ],
      [
        1968,
        4.0141029999999995
      ],
      [
        1969,
        4.133322
      ],
      [
        1970,
        4.257505
      ],
      [
        1971,
        4.38754
      ],
      [
        1972,
        4.522893
      ],
      [
        1973,
        4.660725
      ],
      [
        1974,
        4.797187
      ],
      [
        1975,
        4.929846
      ],
      [
        1976,
        5.057378
      ],
      [
        1977,
        5.181514
      ],
      [
        1978,
        5.306680999999998
      ],
      [
        1979,
        5.439066
      ],
      [
        1980,
        5.583165
      ],
      [
        1981,
        5.740444
      ],
      [
        1982,
        5.909738999999999
      ],
      [
        1983,
        6.089572
      ],
      [
        1984,
        6.277424
      ],
      [
        1985,
        6.4713270000000005
      ],
      [
        1986,
        6.6706629999999985
      ],
      [
        1987,
        6.875754
      ],
      [
        1988,
        7.086627
      ],
      [
        1989,
        7.303517
      ],
      [
        1990,
        7.526307000000001
      ],
      [
        1991,
        7.755496000000001
      ],
      [
        1992,
        7.9900959999999985
      ],
      [
        1993,
        8.22676
      ],
      [
        1994,
        8.461068
      ],
      [
        1995,
        8.690164000000001
      ],
      [
        1996,
        8.912861000000003
      ],
      [
        1997,
        9.130877
      ],
      [
        1998,
        9.347774000000001
      ],
      [
        1999,
        9.568722
      ],
      [
        2000,
        9.797734
      ],
      [
        2001,
        10.036104
      ],
      [
        2002,
        10.283699
      ],
      [
        2003,
        10.541466999999999
      ],
      [
        2004,
        10.810083
      ],
      [
        2005,
        11.090116
      ],
      [
        2006,
        11.382268
      ],
      [
        2007,
        11.68708
      ],
      [
        2008,
        12.004701
      ],
      [
        2009,
        12.335084
      ],
      [
        2010,
        12.678147999999998
      ],
      [
        2011,
        13.033809
      ],
      [
        2012,
        13.401992000000002
      ],
      [
        2013,
        13.782423999999999
      ],
      [
        2014,
        14.174739
      ],
      [
        2015,
        14.578459
      ],
      [
        2016,
        14.993519
      ],
      [
        2017,
        15.419355
      ],
      [
        2018,
        15.854323
      ],
      [
        2019,
        16.296364
      ],
      [
        2020,
        16.743927
      ],
      [
        2021,
        17.196301000000002
      ],
      [
        2022,
        17.653671
      ],
      [
        2023,
        18.116524
      ],
      [
        2024,
        18.585814000000003
      ],
      [
        2025,
        19.062240000000006
      ],
      [
        2026,
        19.545820000000003
      ],
      [
        2027,
        20.036315
      ],
      [
        2028,
        20.533941
      ],
      [
        2029,
        21.038926999999997
      ],
      [
        2030,
        21.551460000000002
      ],
      [
        2031,
        22.071532
      ],
      [
        2032,
        22.599122
      ],
      [
        2033,
        23.134324
      ],
      [
        2034,
        23.67724
      ],
      [
        2035,
        24.227859
      ],
      [
        2036,
        24.786135
      ],
      [
        2037,
        25.351824
      ],
      [
        2038,
        25.924429
      ],
      [
        2039,
        26.503328000000003
      ],
      [
        2040,
        27.087982
      ],
      [
        2041,
        27.678068
      ],
      [
        2042,
        28.273349
      ],
      [
        2043,
        28.873551000000003
      ],
      [
        2044,
        29.478383
      ],
      [
        2045,
        30.087548
      ],
      [
        2046,
        30.700802000000003
      ],
      [
        2047,
        31.317822999999997
      ],
      [
        2048,
        31.938159999999996
      ],
      [
        2049,
        32.561306
      ],
      [
        2050,
        33.186859000000005
      ],
      [
        2051,
        33.814468
      ],
      [
        2052,
        34.443982000000005
      ],
      [
        2053,
        35.075453
      ],
      [
        2054,
        35.709024
      ],
      [
        2055,
        36.34473000000001
      ],
      [
        2056,
        36.982514
      ],
      [
        2057,
        37.622064
      ],
      [
        2058,
        38.263017
      ],
      [
        2059,
        38.904905
      ],
      [
        2060,
        39.547373
      ],
      [
        2061,
        40.190104
      ],
      [
        2062,
        40.833058
      ],
      [
        2063,
        41.476325
      ],
      [
        2064,
        42.120142
      ],
      [
        2065,
        42.764595
      ],
      [
        2066,
        43.409617
      ],
      [
        2067,
        44.054901
      ],
      [
        2068,
        44.699971000000005
      ],
      [
        2069,
        45.344243
      ],
      [
        2070,
        45.987237
      ],
      [
        2071,
        46.628597
      ],
      [
        2072,
        47.268215000000005
      ],
      [
        2073,
        47.906116
      ],
      [
        2074,
        48.542442
      ],
      [
        2075,
        49.177213
      ],
      [
        2076,
        49.810249000000006
      ],
      [
        2077,
        50.441148
      ],
      [
        2078,
        51.069368
      ],
      [
        2079,
        51.69426
      ],
      [
        2080,
        52.315234000000004
      ],
      [
        2081,
        52.931966
      ],
      [
        2082,
        53.544226
      ],
      [
        2083,
        54.151688
      ],
      [
        2084,
        54.754056000000006
      ],
      [
        2085,
        55.35106500000001
      ],
      [
        2086,
        55.942446999999994
      ],
      [
        2087,
        56.52794300000001
      ],
      [
        2088,
        57.107264
      ],
      [
        2089,
        57.6801
      ],
      [
        2090,
        58.2462
      ],
      [
        2091,
        58.805388
      ],
      [
        2092,
        59.35753500000001
      ],
      [
        2093,
        59.902566
      ],
      [
        2094,
        60.44042700000001
      ],
      [
        2095,
        60.97108000000001
      ],
      [
        2096,
        61.494489
      ],
      [
        2097,
        62.01064399999999
      ],
      [
        2098,
        62.519516
      ],
      [
        2099,
        63.021094
      ],
      [
        2100,
        63.51536
      ]
    ],
    "pop_urbaine": [
      [
        1960,
        23.0
      ],
      [
        1961,
        23.645
      ],
      [
        1962,
        24.303
      ],
      [
        1963,
        24.973000000000003
      ],
      [
        1964,
        25.656999999999996
      ],
      [
        1965,
        26.351
      ],
      [
        1966,
        27.057
      ],
      [
        1967,
        27.776
      ],
      [
        1968,
        28.506999999999998
      ],
      [
        1969,
        29.247
      ],
      [
        1970,
        30.0
      ],
      [
        1971,
        30.72
      ],
      [
        1972,
        31.451
      ],
      [
        1973,
        32.189
      ],
      [
        1974,
        32.937
      ],
      [
        1975,
        33.693000000000005
      ],
      [
        1976,
        34.372
      ],
      [
        1977,
        34.718
      ],
      [
        1978,
        35.067
      ],
      [
        1979,
        35.417
      ],
      [
        1980,
        35.769
      ],
      [
        1981,
        36.122
      ],
      [
        1982,
        36.476
      ],
      [
        1983,
        36.832
      ],
      [
        1984,
        37.191
      ],
      [
        1985,
        37.549
      ],
      [
        1986,
        37.909
      ],
      [
        1987,
        38.271
      ],
      [
        1988,
        38.613
      ],
      [
        1989,
        38.755
      ],
      [
        1990,
        38.896
      ],
      [
        1991,
        39.038000000000004
      ],
      [
        1992,
        39.18
      ],
      [
        1993,
        39.321
      ],
      [
        1994,
        39.464
      ],
      [
        1995,
        39.606
      ],
      [
        1996,
        39.749
      ],
      [
        1997,
        39.891
      ],
      [
        1998,
        40.034
      ],
      [
        1999,
        40.177
      ],
      [
        2000,
        40.32
      ],
      [
        2001,
        40.464
      ],
      [
        2002,
        40.607
      ],
      [
        2003,
        40.898
      ],
      [
        2004,
        41.306000000000004
      ],
      [
        2005,
        41.714
      ],
      [
        2006,
        42.123999999999995
      ],
      [
        2007,
        42.535
      ],
      [
        2008,
        42.946999999999996
      ],
      [
        2009,
        43.358999999999995
      ],
      [
        2010,
        43.773
      ],
      [
        2011,
        44.188
      ],
      [
        2012,
        44.603
      ],
      [
        2013,
        45.019
      ],
      [
        2014,
        45.43600000000001
      ],
      [
        2015,
        45.861999999999995
      ],
      [
        2016,
        46.29600000000001
      ],
      [
        2017,
        46.74
      ],
      [
        2018,
        47.192
      ],
      [
        2019,
        "NA"
      ]
    ],
    "prod_elec_renouv": [
      [
        1960,
        "NA"
      ],
      [
        1961,
        "NA"
      ],
      [
        1962,
        "NA"
      ],
      [
        1963,
        "NA"
      ],
      [
        1964,
        "NA"
      ],
      [
        1965,
        "NA"
      ],
      [
        1966,
        "NA"
      ],
      [
        1967,
        "NA"
      ],
      [
        1968,
        "NA"
      ],
      [
        1969,
        "NA"
      ],
      [
        1970,
        "NA"
      ],
      [
        1971,
        9.7112860892
      ],
      [
        1972,
        9.5
      ],
      [
        1973,
        8.5972850679
      ],
      [
        1974,
        8.6666666667
      ],
      [
        1975,
        8.141962421699999
      ],
      [
        1976,
        7.6023391813
      ],
      [
        1977,
        7.0546737213
      ],
      [
        1978,
        6.451612903200001
      ],
      [
        1979,
        5.917159763300001
      ],
      [
        1980,
        5.917159763300001
      ],
      [
        1981,
        5.610098176699999
      ],
      [
        1982,
        6.2222222222
      ],
      [
        1983,
        5.607476635499999
      ],
      [
        1984,
        5.2044609665
      ],
      [
        1985,
        5.2303860523
      ],
      [
        1986,
        5.2434456929
      ],
      [
        1987,
        4.971098265899999
      ],
      [
        1988,
        4.8260381594
      ],
      [
        1989,
        4.6688382193
      ],
      [
        1990,
        4.6560846561
      ],
      [
        1991,
        4.5407636739
      ],
      [
        1992,
        4.2775665399000005
      ],
      [
        1993,
        4.3394406943
      ],
      [
        1994,
        4.2056074766
      ],
      [
        1995,
        4.0636042403
      ],
      [
        1996,
        3.9068994181
      ],
      [
        1997,
        3.7180480248000003
      ],
      [
        1998,
        3.6189069424
      ],
      [
        1999,
        3.5765379113
      ],
      [
        2000,
        3.3042394015
      ],
      [
        2001,
        3.2769556025
      ],
      [
        2002,
        3.4246575342
      ],
      [
        2003,
        2.6536312849
      ],
      [
        2004,
        1.9876325088
      ],
      [
        2005,
        2.1619496855
      ],
      [
        2006,
        2.2550225502
      ],
      [
        2007,
        1.5060240963999998
      ],
      [
        2008,
        1.5456506111000001
      ],
      [
        2009,
        1.8544436669
      ],
      [
        2010,
        2.5032509753
      ],
      [
        2011,
        2.5388765471
      ],
      [
        2012,
        1.4202898550999998
      ],
      [
        2013,
        1.7691659646
      ],
      [
        2014,
        1.7765814266
      ],
      [
        2015,
        1.7699115044
      ],
      [
        2016,
        "NA"
      ],
      [
        2017,
        "NA"
      ],
      [
        2018,
        "NA"
      ],
      [
        2019,
        "NA"
      ]
    ],
    "rdt_cerealier": [
      [
        1960,
        "NA"
      ],
      [
        1961,
        549.4
      ],
      [
        1962,
        544.3
      ],
      [
        1963,
        573.3
      ],
      [
        1964,
        588.3
      ],
      [
        1965,
        588.7
      ],
      [
        1966,
        530.8
      ],
      [
        1967,
        636.3
      ],
      [
        1968,
        461.2
      ],
      [
        1969,
        699.0
      ],
      [
        1970,
        475.6
      ],
      [
        1971,
        655.7
      ],
      [
        1972,
        370.9
      ],
      [
        1973,
        508.0
      ],
      [
        1974,
        740.5
      ],
      [
        1975,
        708.2
      ],
      [
        1976,
        706.8
      ],
      [
        1977,
        508.1
      ],
      [
        1978,
        833.2
      ],
      [
        1979,
        616.8
      ],
      [
        1980,
        547.4
      ],
      [
        1981,
        904.7
      ],
      [
        1982,
        684.3
      ],
      [
        1983,
        573.3
      ],
      [
        1984,
        612.1
      ],
      [
        1985,
        819.9
      ],
      [
        1986,
        761.7
      ],
      [
        1987,
        841.4
      ],
      [
        1988,
        712.1
      ],
      [
        1989,
        847.3
      ],
      [
        1990,
        795.0
      ],
      [
        1991,
        822.6
      ],
      [
        1992,
        798.6
      ],
      [
        1993,
        836.5
      ],
      [
        1994,
        757.7
      ],
      [
        1995,
        872.0
      ],
      [
        1996,
        758.5
      ],
      [
        1997,
        716.7
      ],
      [
        1998,
        667.8
      ],
      [
        1999,
        870.4
      ],
      [
        2000,
        879.4
      ],
      [
        2001,
        887.1
      ],
      [
        2002,
        651.6
      ],
      [
        2003,
        1090.7
      ],
      [
        2004,
        974.5
      ],
      [
        2005,
        1201.1
      ],
      [
        2006,
        879.0
      ],
      [
        2007,
        722.5
      ],
      [
        2008,
        1174.2
      ],
      [
        2009,
        1134.6
      ],
      [
        2010,
        1196.5
      ],
      [
        2011,
        966.9
      ],
      [
        2012,
        1221.3
      ],
      [
        2013,
        1124.1
      ],
      [
        2014,
        1111.5
      ],
      [
        2015,
        1376.1
      ],
      [
        2016,
        1340.1
      ],
      [
        2017,
        1275.1
      ],
      [
        2018,
        "NA"
      ],
      [
        2019,
        "NA"
      ]
    ],
    "recette_budg": [
      [
        1980,
        "NA"
      ],
      [
        1981,
        "NA"
      ],
      [
        1982,
        "NA"
      ],
      [
        1983,
        "NA"
      ],
      [
        1984,
        "NA"
      ],
      [
        1985,
        "NA"
      ],
      [
        1986,
        "NA"
      ],
      [
        1987,
        "NA"
      ],
      [
        1988,
        "NA"
      ],
      [
        1989,
        "NA"
      ],
      [
        1990,
        "NA"
      ],
      [
        1991,
        "NA"
      ],
      [
        1992,
        "NA"
      ],
      [
        1993,
        "NA"
      ],
      [
        1994,
        21.081
      ],
      [
        1995,
        16.436
      ],
      [
        1996,
        16.012
      ],
      [
        1997,
        14.917
      ],
      [
        1998,
        14.424000000000001
      ],
      [
        1999,
        14.177
      ],
      [
        2000,
        14.887
      ],
      [
        2001,
        15.027000000000001
      ],
      [
        2002,
        16.22
      ],
      [
        2003,
        16.679000000000002
      ],
      [
        2004,
        18.133
      ],
      [
        2005,
        18.375999999999998
      ],
      [
        2006,
        17.38
      ],
      [
        2007,
        18.953
      ],
      [
        2008,
        17.239
      ],
      [
        2009,
        17.276
      ],
      [
        2010,
        17.641
      ],
      [
        2011,
        18.237000000000002
      ],
      [
        2012,
        18.615
      ],
      [
        2013,
        17.711
      ],
      [
        2014,
        19.204
      ],
      [
        2015,
        19.284000000000002
      ],
      [
        2016,
        20.691
      ],
      [
        2017,
        19.546
      ],
      [
        2018,
        18.590999999999998
      ],
      [
        2019,
        20.233
      ],
      [
        2020,
        20.698
      ],
      [
        2021,
        21.574
      ],
      [
        2022,
        22.087
      ],
      [
        2023,
        22.926
      ],
      [
        2024,
        23.276
      ]
    ],
    "regime_pol": [
      [
        1816,
        -20.0
      ],
      [
        1817,
        -20.0
      ],
      [
        1818,
        -20.0
      ],
      [
        1819,
        -20.0
      ],
      [
        1820,
        -20.0
      ],
      [
        1821,
        -20.0
      ],
      [
        1822,
        -20.0
      ],
      [
        1823,
        -20.0
      ],
      [
        1824,
        -20.0
      ],
      [
        1825,
        -20.0
      ],
      [
        1826,
        -20.0
      ],
      [
        1827,
        -20.0
      ],
      [
        1828,
        -20.0
      ],
      [
        1829,
        -20.0
      ],
      [
        1830,
        -20.0
      ],
      [
        1831,
        -20.0
      ],
      [
        1832,
        -20.0
      ],
      [
        1833,
        -20.0
      ],
      [
        1834,
        -20.0
      ],
      [
        1835,
        -20.0
      ],
      [
        1836,
        -20.0
      ],
      [
        1837,
        -20.0
      ],
      [
        1838,
        -20.0
      ],
      [
        1839,
        -20.0
      ],
      [
        1840,
        -20.0
      ],
      [
        1841,
        -20.0
      ],
      [
        1842,
        -20.0
      ],
      [
        1843,
        -20.0
      ],
      [
        1844,
        -20.0
      ],
      [
        1845,
        -20.0
      ],
      [
        1846,
        -20.0
      ],
      [
        1847,
        -20.0
      ],
      [
        1848,
        -20.0
      ],
      [
        1849,
        -20.0
      ],
      [
        1850,
        -20.0
      ],
      [
        1851,
        -20.0
      ],
      [
        1852,
        -20.0
      ],
      [
        1853,
        -20.0
      ],
      [
        1854,
        -20.0
      ],
      [
        1855,
        -20.0
      ],
      [
        1856,
        -20.0
      ],
      [
        1857,
        -20.0
      ],
      [
        1858,
        -20.0
      ],
      [
        1859,
        -20.0
      ],
      [
        1860,
        -20.0
      ],
      [
        1861,
        -20.0
      ],
      [
        1862,
        -20.0
      ],
      [
        1863,
        -20.0
      ],
      [
        1864,
        -20.0
      ],
      [
        1865,
        -20.0
      ],
      [
        1866,
        -20.0
      ],
      [
        1867,
        -20.0
      ],
      [
        1868,
        -20.0
      ],
      [
        1869,
        -20.0
      ],
      [
        1870,
        -20.0
      ],
      [
        1871,
        -20.0
      ],
      [
        1872,
        -20.0
      ],
      [
        1873,
        -20.0
      ],
      [
        1874,
        -20.0
      ],
      [
        1875,
        -20.0
      ],
      [
        1876,
        -20.0
      ],
      [
        1877,
        -20.0
      ],
      [
        1878,
        -20.0
      ],
      [
        1879,
        -20.0
      ],
      [
        1880,
        -20.0
      ],
      [
        1881,
        -20.0
      ],
      [
        1882,
        -20.0
      ],
      [
        1883,
        -20.0
      ],
      [
        1884,
        -20.0
      ],
      [
        1885,
        -20.0
      ],
      [
        1886,
        -20.0
      ],
      [
        1887,
        -20.0
      ],
      [
        1888,
        -20.0
      ],
      [
        1889,
        -20.0
      ],
      [
        1890,
        -20.0
      ],
      [
        1891,
        -20.0
      ],
      [
        1892,
        -20.0
      ],
      [
        1893,
        -20.0
      ],
      [
        1894,
        -20.0
      ],
      [
        1895,
        -20.0
      ],
      [
        1896,
        -20.0
      ],
      [
        1897,
        -20.0
      ],
      [
        1898,
        -20.0
      ],
      [
        1899,
        -20.0
      ],
      [
        1900,
        -20.0
      ],
      [
        1901,
        -20.0
      ],
      [
        1902,
        -20.0
      ],
      [
        1903,
        -20.0
      ],
      [
        1904,
        -20.0
      ],
      [
        1905,
        -20.0
      ],
      [
        1906,
        -20.0
      ],
      [
        1907,
        -20.0
      ],
      [
        1908,
        -20.0
      ],
      [
        1909,
        -20.0
      ],
      [
        1910,
        -20.0
      ],
      [
        1911,
        -20.0
      ],
      [
        1912,
        -20.0
      ],
      [
        1913,
        -20.0
      ],
      [
        1914,
        -20.0
      ],
      [
        1915,
        -20.0
      ],
      [
        1916,
        -20.0
      ],
      [
        1917,
        -20.0
      ],
      [
        1918,
        -20.0
      ],
      [
        1919,
        -20.0
      ],
      [
        1920,
        -20.0
      ],
      [
        1921,
        -20.0
      ],
      [
        1922,
        -20.0
      ],
      [
        1923,
        -20.0
      ],
      [
        1924,
        -20.0
      ],
      [
        1925,
        -20.0
      ],
      [
        1926,
        -20.0
      ],
      [
        1927,
        -20.0
      ],
      [
        1928,
        -20.0
      ],
      [
        1929,
        -20.0
      ],
      [
        1930,
        -20.0
      ],
      [
        1931,
        -20.0
      ],
      [
        1932,
        -20.0
      ],
      [
        1933,
        -20.0
      ],
      [
        1934,
        -20.0
      ],
      [
        1935,
        -20.0
      ],
      [
        1936,
        -20.0
      ],
      [
        1937,
        -20.0
      ],
      [
        1938,
        -20.0
      ],
      [
        1939,
        -20.0
      ],
      [
        1940,
        -20.0
      ],
      [
        1941,
        -20.0
      ],
      [
        1942,
        -20.0
      ],
      [
        1943,
        -20.0
      ],
      [
        1944,
        -20.0
      ],
      [
        1945,
        -20.0
      ],
      [
        1946,
        -20.0
      ],
      [
        1947,
        -20.0
      ],
      [
        1948,
        -20.0
      ],
      [
        1949,
        -20.0
      ],
      [
        1950,
        -20.0
      ],
      [
        1951,
        -20.0
      ],
      [
        1952,
        -20.0
      ],
      [
        1953,
        -20.0
      ],
      [
        1954,
        -20.0
      ],
      [
        1955,
        -20.0
      ],
      [
        1956,
        -20.0
      ],
      [
        1957,
        -20.0
      ],
      [
        1958,
        -20.0
      ],
      [
        1959,
        -20.0
      ],
      [
        1960,
        -1.0
      ],
      [
        1961,
        -1.0
      ],
      [
        1962,
        -4.0
      ],
      [
        1963,
        -7.0
      ],
      [
        1964,
        -7.0
      ],
      [
        1965,
        -7.0
      ],
      [
        1966,
        -7.0
      ],
      [
        1967,
        -7.0
      ],
      [
        1968,
        -7.0
      ],
      [
        1969,
        -7.0
      ],
      [
        1970,
        -7.0
      ],
      [
        1971,
        -7.0
      ],
      [
        1972,
        -7.0
      ],
      [
        1973,
        -7.0
      ],
      [
        1974,
        -6.0
      ],
      [
        1975,
        -6.0
      ],
      [
        1976,
        -6.0
      ],
      [
        1977,
        -6.0
      ],
      [
        1978,
        -2.0
      ],
      [
        1979,
        -2.0
      ],
      [
        1980,
        -2.0
      ],
      [
        1981,
        -1.0
      ],
      [
        1982,
        -1.0
      ],
      [
        1983,
        -1.0
      ],
      [
        1984,
        -1.0
      ],
      [
        1985,
        -1.0
      ],
      [
        1986,
        -1.0
      ],
      [
        1987,
        -1.0
      ],
      [
        1988,
        -1.0
      ],
      [
        1989,
        -1.0
      ],
      [
        1990,
        -1.0
      ],
      [
        1991,
        -1.0
      ],
      [
        1992,
        -1.0
      ],
      [
        1993,
        -1.0
      ],
      [
        1994,
        -1.0
      ],
      [
        1995,
        -1.0
      ],
      [
        1996,
        -1.0
      ],
      [
        1997,
        -1.0
      ],
      [
        1998,
        -1.0
      ],
      [
        1999,
        -1.0
      ],
      [
        2000,
        8.0
      ],
      [
        2001,
        8.0
      ],
      [
        2002,
        8.0
      ],
      [
        2003,
        8.0
      ],
      [
        2004,
        8.0
      ],
      [
        2005,
        8.0
      ],
      [
        2006,
        8.0
      ],
      [
        2007,
        7.0
      ],
      [
        2008,
        7.0
      ],
      [
        2009,
        7.0
      ],
      [
        2010,
        7.0
      ],
      [
        2011,
        7.0
      ],
      [
        2012,
        7.0
      ],
      [
        2013,
        7.0
      ],
      [
        2014,
        7.0
      ],
      [
        2015,
        7.0
      ]
    ],
    "sanitaire_primaire": [
      [
        2000,
        "NA"
      ],
      [
        2001,
        "NA"
      ],
      [
        2002,
        "NA"
      ],
      [
        2003,
        "NA"
      ],
      [
        2004,
        "NA"
      ],
      [
        2005,
        "NA"
      ],
      [
        2006,
        "NA"
      ],
      [
        2007,
        "NA"
      ],
      [
        2008,
        "NA"
      ],
      [
        2009,
        "NA"
      ],
      [
        2010,
        "NA"
      ],
      [
        2011,
        "NA"
      ],
      [
        2012,
        "NA"
      ],
      [
        2013,
        "NA"
      ],
      [
        2014,
        "NA"
      ],
      [
        2015,
        "NA"
      ],
      [
        2016,
        "NA"
      ],
      [
        2017,
        9.44172
      ],
      [
        2018,
        "NA"
      ],
      [
        2019,
        "NA"
      ]
    ],
    "sous_nutri": [
      [
        1960,
        296.4
      ],
      [
        1961,
        296.3
      ],
      [
        1962,
        296.8
      ],
      [
        1963,
        297.6
      ],
      [
        1964,
        298.0
      ],
      [
        1965,
        298.2
      ],
      [
        1966,
        297.8
      ],
      [
        1967,
        296.7
      ],
      [
        1968,
        294.9
      ],
      [
        1969,
        292.2
      ],
      [
        1970,
        288.3
      ],
      [
        1971,
        283.2
      ],
      [
        1972,
        276.9
      ],
      [
        1973,
        269.6
      ],
      [
        1974,
        261.4
      ],
      [
        1975,
        252.0
      ],
      [
        1976,
        241.6
      ],
      [
        1977,
        230.8
      ],
      [
        1978,
        220.7
      ],
      [
        1979,
        211.9
      ],
      [
        1980,
        204.1
      ],
      [
        1981,
        197.4
      ],
      [
        1982,
        191.3
      ],
      [
        1983,
        185.2
      ],
      [
        1984,
        178.5
      ],
      [
        1985,
        171.1
      ],
      [
        1986,
        163.1
      ],
      [
        1987,
        155.1
      ],
      [
        1988,
        148.1
      ],
      [
        1989,
        142.7
      ],
      [
        1990,
        139.0
      ],
      [
        1991,
        137.1
      ],
      [
        1992,
        136.8
      ],
      [
        1993,
        137.4
      ],
      [
        1994,
        138.6
      ],
      [
        1995,
        139.9
      ],
      [
        1996,
        140.7
      ],
      [
        1997,
        140.7
      ],
      [
        1998,
        139.4
      ],
      [
        1999,
        136.3
      ],
      [
        2000,
        131.5
      ],
      [
        2001,
        124.9
      ],
      [
        2002,
        117.2
      ],
      [
        2003,
        109.1
      ],
      [
        2004,
        101.1
      ],
      [
        2005,
        93.7
      ],
      [
        2006,
        87.0
      ],
      [
        2007,
        80.9
      ],
      [
        2008,
        75.5
      ],
      [
        2009,
        70.7
      ],
      [
        2010,
        66.4
      ],
      [
        2011,
        62.5
      ],
      [
        2012,
        59.0
      ],
      [
        2013,
        55.8
      ],
      [
        2014,
        52.9
      ],
      [
        2015,
        50.1
      ],
      [
        2016,
        47.7
      ],
      [
        2017,
        45.6
      ],
      [
        2018,
        43.6
      ],
      [
        2019,
        "NA"
      ]
    ],
    "volume_exp_biens": [
      [
        1980,
        -5.096
      ],
      [
        1981,
        14.092
      ],
      [
        1982,
        34.189
      ],
      [
        1983,
        7.968
      ],
      [
        1984,
        -6.027
      ],
      [
        1985,
        -16.597
      ],
      [
        1986,
        17.455
      ],
      [
        1987,
        -12.749
      ],
      [
        1988,
        6.341
      ],
      [
        1989,
        13.549000000000001
      ],
      [
        1990,
        5.9110000000000005
      ],
      [
        1991,
        6.2
      ],
      [
        1992,
        -4.824
      ],
      [
        1993,
        -6.047000000000001
      ],
      [
        1994,
        3.7460000000000004
      ],
      [
        1995,
        26.149
      ],
      [
        1996,
        -2.568
      ],
      [
        1997,
        -16.298
      ],
      [
        1998,
        15.363
      ],
      [
        1999,
        4.897
      ],
      [
        2000,
        -26.616
      ],
      [
        2001,
        3.242
      ],
      [
        2002,
        8.247
      ],
      [
        2003,
        20.776999999999997
      ],
      [
        2004,
        14.982999999999999
      ],
      [
        2005,
        -1.546
      ],
      [
        2006,
        -20.142
      ],
      [
        2007,
        16.861
      ],
      [
        2008,
        -6.864
      ],
      [
        2009,
        21.666999999999998
      ],
      [
        2010,
        -1.561
      ],
      [
        2011,
        16.319000000000003
      ],
      [
        2012,
        0.145
      ],
      [
        2013,
        15.254000000000001
      ],
      [
        2014,
        6.83
      ],
      [
        2015,
        -5.763999999999999
      ],
      [
        2016,
        8.623
      ],
      [
        2017,
        14.034
      ],
      [
        2018,
        13.708
      ],
      [
        2019,
        4.718
      ],
      [
        2020,
        8.213
      ],
      [
        2021,
        9.036
      ],
      [
        2022,
        37.132
      ],
      [
        2023,
        41.976000000000006
      ],
      [
        2024,
        8.411
      ]
    ],
    "volume_exp_bs": [
      [
        1980,
        -0.708
      ],
      [
        1981,
        1.864
      ],
      [
        1982,
        28.568
      ],
      [
        1983,
        9.19
      ],
      [
        1984,
        -9.429
      ],
      [
        1985,
        -9.206
      ],
      [
        1986,
        15.754000000000001
      ],
      [
        1987,
        -9.671
      ],
      [
        1988,
        7.428999999999999
      ],
      [
        1989,
        8.833
      ],
      [
        1990,
        9.66
      ],
      [
        1991,
        6.225
      ],
      [
        1992,
        -4.987
      ],
      [
        1993,
        -7.52
      ],
      [
        1994,
        -0.294
      ],
      [
        1995,
        23.659000000000002
      ],
      [
        1996,
        -14.152999999999999
      ],
      [
        1997,
        -9.667
      ],
      [
        1998,
        11.297
      ],
      [
        1999,
        2.66
      ],
      [
        2000,
        -21.439
      ],
      [
        2001,
        3.1039999999999996
      ],
      [
        2002,
        8.691
      ],
      [
        2003,
        18.444000000000003
      ],
      [
        2004,
        13.664000000000001
      ],
      [
        2005,
        2.813
      ],
      [
        2006,
        -12.969000000000001
      ],
      [
        2007,
        26.379
      ],
      [
        2008,
        -2.986
      ],
      [
        2009,
        2.859
      ],
      [
        2010,
        -0.43
      ],
      [
        2011,
        12.267000000000001
      ],
      [
        2012,
        1.6909999999999998
      ],
      [
        2013,
        12.37
      ],
      [
        2014,
        4.1739999999999995
      ],
      [
        2015,
        -5.175
      ],
      [
        2016,
        6.369
      ],
      [
        2017,
        11.335999999999999
      ],
      [
        2018,
        9.433
      ],
      [
        2019,
        3.6489999999999996
      ],
      [
        2020,
        7.029
      ],
      [
        2021,
        10.754000000000001
      ],
      [
        2022,
        28.886999999999997
      ],
      [
        2023,
        34.208
      ],
      [
        2024,
        7.306
      ]
    ],
    "volume_import_biens": [
      [
        1980,
        -8.265
      ],
      [
        1981,
        16.79
      ],
      [
        1982,
        4.907
      ],
      [
        1983,
        2.457
      ],
      [
        1984,
        -6.029
      ],
      [
        1985,
        12.32
      ],
      [
        1986,
        -3.551
      ],
      [
        1987,
        -6.972
      ],
      [
        1988,
        -6.324
      ],
      [
        1989,
        9.687999999999999
      ],
      [
        1990,
        5.024
      ],
      [
        1991,
        2.181
      ],
      [
        1992,
        -16.937
      ],
      [
        1993,
        -3.3819999999999997
      ],
      [
        1994,
        -8.591000000000001
      ],
      [
        1995,
        14.370999999999999
      ],
      [
        1996,
        -2.8480000000000003
      ],
      [
        1997,
        -10.669
      ],
      [
        1998,
        20.207
      ],
      [
        1999,
        -3.424
      ],
      [
        2000,
        -17.531
      ],
      [
        2001,
        1.9180000000000001
      ],
      [
        2002,
        14.758
      ],
      [
        2003,
        24.901999999999997
      ],
      [
        2004,
        19.727999999999998
      ],
      [
        2005,
        5.643
      ],
      [
        2006,
        -6.015
      ],
      [
        2007,
        33.518
      ],
      [
        2008,
        27.366
      ],
      [
        2009,
        -7.731
      ],
      [
        2010,
        -5.657
      ],
      [
        2011,
        14.193
      ],
      [
        2012,
        4.75
      ],
      [
        2013,
        5.494
      ],
      [
        2014,
        4.124
      ],
      [
        2015,
        -3.069
      ],
      [
        2016,
        3.042
      ],
      [
        2017,
        21.406999999999996
      ],
      [
        2018,
        16.845
      ],
      [
        2019,
        -0.8290000000000001
      ],
      [
        2020,
        10.370999999999999
      ],
      [
        2021,
        14.122
      ],
      [
        2022,
        6.864
      ],
      [
        2023,
        10.255999999999998
      ],
      [
        2024,
        8.562999999999999
      ]
    ],
    "volume_import_bs": [
      [
        1980,
        -2.6489999999999996
      ],
      [
        1981,
        13.26
      ],
      [
        1982,
        4.89
      ],
      [
        1983,
        10.857000000000001
      ],
      [
        1984,
        -4.363
      ],
      [
        1985,
        12.902000000000001
      ],
      [
        1986,
        2.21
      ],
      [
        1987,
        -7.5329999999999995
      ],
      [
        1988,
        -5.928
      ],
      [
        1989,
        7.562
      ],
      [
        1990,
        9.732000000000001
      ],
      [
        1991,
        0.564
      ],
      [
        1992,
        0.215
      ],
      [
        1993,
        -4.36
      ],
      [
        1994,
        -11.725999999999999
      ],
      [
        1995,
        15.23
      ],
      [
        1996,
        -11.706
      ],
      [
        1997,
        -9.391
      ],
      [
        1998,
        18.91
      ],
      [
        1999,
        -4.042
      ],
      [
        2000,
        -14.136
      ],
      [
        2001,
        1.9509999999999998
      ],
      [
        2002,
        13.509
      ],
      [
        2003,
        22.182
      ],
      [
        2004,
        17.785999999999998
      ],
      [
        2005,
        7.102
      ],
      [
        2006,
        -4.292
      ],
      [
        2007,
        34.967
      ],
      [
        2008,
        22.714000000000002
      ],
      [
        2009,
        -9.738
      ],
      [
        2010,
        -5.287999999999999
      ],
      [
        2011,
        13.185
      ],
      [
        2012,
        4.4
      ],
      [
        2013,
        5.736000000000001
      ],
      [
        2014,
        3.3930000000000002
      ],
      [
        2015,
        -3.282
      ],
      [
        2016,
        2.8480000000000003
      ],
      [
        2017,
        19.448
      ],
      [
        2018,
        14.106
      ],
      [
        2019,
        2.211
      ],
      [
        2020,
        12.838
      ],
      [
        2021,
        15.307
      ],
      [
        2022,
        4.95
      ],
      [
        2023,
        8.612
      ],
      [
        2024,
        7.893
      ]
    ],
    "vuln_clim_ferdi": [
      [
        2018,
        60.8841757501805
      ]
    ],
    "vuln_clim_ndgain": [
      [
        1995,
        0.5723542187770629
      ],
      [
        1996,
        0.574303025531667
      ],
      [
        1997,
        0.5703662396795861
      ],
      [
        1998,
        0.570500520077189
      ],
      [
        1999,
        0.5734387770392321
      ],
      [
        2000,
        0.572423193846671
      ],
      [
        2001,
        0.5687216164051689
      ],
      [
        2002,
        0.567433061682625
      ],
      [
        2003,
        0.5617664072448331
      ],
      [
        2004,
        0.564838035335413
      ],
      [
        2005,
        0.5633253269619061
      ],
      [
        2006,
        0.561689578176905
      ],
      [
        2007,
        0.551544920606369
      ],
      [
        2008,
        0.5548202417198621
      ],
      [
        2009,
        0.540297164298459
      ],
      [
        2010,
        0.54298301668729
      ],
      [
        2011,
        0.540288300457333
      ],
      [
        2012,
        0.543441489387821
      ],
      [
        2013,
        0.5480684197682579
      ],
      [
        2014,
        0.53743567950559
      ],
      [
        2015,
        0.537151075256579
      ],
      [
        2016,
        0.5375592269365879
      ]
    ]
  }
}