Year,AGO,BDI,BEN,BFA,BWA,CAF,CIV,CMR,COD,COG,COM,CPV,DJI,DZA,EGY,ERI,ETH,GAB,GHA,GIN,GMB,GNB,GNQ,KEN,LBR,LBY,LSO,MAR,MDG,MLI,MOZ,MRT,MUS,MWI,NAM,NER,NGA,RWA,SDN,SEN,SLE,SOM,SSD,STP,SWZ,SYC,TCD,TGO,TUN,TZA,UGA,ZAF,ZMB,ZWE
1980,,,,,,,,,,,,,,,,,10.933,,2.809,,,,44.422,,,,,,15.094,,10.729,,,,,,,,,,,,,,20.418,,,,,,,,,
1981,,,,,,,,,,,,,,,,,11.988,,1.931,,,,32.059,,,,,,10.862,,13.815,,,,,,,,,,,,,,15.471,,,,,,,,,
1982,,,,,,,,,,,,,,,,,12.808,,2.654,,,,36.374,17.457,,,27.869,,9.925,,19.739,,,,,,,,,,,,,,18.213,,,,,,,,,
1983,,,,,,,,,,,,,,,,,13.66,,2.392,,,,44.785,16.593,,,29.025,,9.871,,16.481,,,,,,,,,,,,,,16.521,44.798,,,,,,,,
1984,,,,,,,,,,,17.721,,,,,,15.132,,3.805,,,,43.65,16.407,,,31.634,,10.431,,14.721,,,,,,,,,,,,,,17.906,44.443,,,,,,,,
1985,,,,11.534,,,,,,,19.855,,,,,,14.987,,5.074,,,,26.032,16.695,,,34.471,,12.587,,9.566,,,,,,,,,,,,,,17.868,48.187,,,,,,,,
1986,,,,12.608,,,,,,,20.836,,,,,,15.865,,6.395,,,,21.684,16.398,,,34.076,,11.78,,10.214,,,,,,,,,,,,,,16.522,47.95,,,,,,,,
1987,,,,15.703,,,,,,,19.379,,,,,,14.837,,6.807,,,,25.038,17.587,,,37.45,,10.353,,13.174,,,,,,,,,,,,,,18.751,52.475,,,,,,,,
1988,,,,13.368,,17.711,,,,,17.554,,,,,,18.087,,6.586,,,,19.452,18.597,,,33.468,,14.179,,17.329,,,,,,,,,,,,,,19.985,58.56,,,,,,,,
1989,,,17.966,18.161,,16.367,,,,21.9,18.379,,,,,,19.687,,6.842,,,,40.626,18.536,,,39.653,,15.42,,19.217,,,,,,,,,,,,,,21.027,59.93,,19.845,,,,,,
1990,,29.736,14.879,12.244,,15.411,,,,27.372,19.247,,26.955,28.896,,,13.998,18.758,4.971,14.784,,,52.746,18.514,,34.419,41.724,23.011,16.397,,13.938,22.47,,,27.815,,19.296,,14.758,,,,,,23.013,57.974,,20.504,28.818,,,,,
1991,,27.184,14.149,15.967,,14.637,,,,25.492,17.695,,26.841,31.596,,,11.321,23.053,5.99,13.043,,18.268,48.481,13.151,,37.038,41.054,21.538,11.045,,18.1,19.4,,,30.588,,17.504,,19.223,,,,,,22.201,55.255,,14.936,23.47,14.768,,,,
1992,,25.545,15.69,16.016,,15.765,,,,22.459,18.377,,28.755,29.478,,39.51,9.313,21.641,5.041,11.606,,16.747,37.271,12.418,,26.58,39.634,22.117,13.846,,23.007,17.953,,,32.283,,23.784,16.959,25.904,,,,,,21.33,57.154,,13.994,23.339,12.621,,,,
1993,,26.542,15.813,15.807,,14.963,,,,24.099,17.559,,28.233,26.905,,71.445,9.652,21.526,7.286,10.651,,21.604,38.371,13.779,,25.226,43.196,22.844,12.944,,21.397,21.295,,,30.736,,19.612,16.221,15.644,,,,,,19.23,56.731,,8.535,24.594,14.387,,,,
1994,,20.501,16.391,17.931,,14.778,,,,23.473,18.099,35.446,25.975,29.189,,59.045,12.239,22.38,8.417,10.023,,21.845,22.532,19.514,,26.692,45.304,20.809,11.197,,22.323,19.44,,,29.842,,12.82,4.487,16.519,21.081,,,,,19.395,56.701,,10.546,24.201,13.017,,,,
1995,,21.417,17.581,18.883,,15.729,,,,24.619,14.264,35.496,21.883,29.968,,58.261,14.633,27.717,9.115,10.751,,17.919,18.085,22.769,,32.466,46.464,20.272,11.432,,19.403,19.217,,,30.065,12.157,16.047,18.938,9.398,16.436,,,,,20.14,50.516,11.901,13.124,23.129,13.458,,,,
1996,39.104,18.423,18.003,20.341,,10.653,,,1.611,27.853,12.098,30.644,21.915,32.107,,50.242,14.861,24.343,7.339,9.763,,20.996,16.588,19.612,,43.427,43.002,19.974,12.87,,14.885,24.104,,,29.4,13.411,15.825,17.201,6.695,16.012,,,,,20.907,49.418,11.842,12.307,22.551,14.947,,,,
1997,34.882,16.64,17.989,19.551,,12.895,19.937,,1.456,28.595,13.246,27.773,22.153,33.331,,54.5,16.176,31.104,6.283,10.576,,17.234,17.966,19.501,,33.252,44.368,21.749,14.976,,17.471,20.931,,,31.775,13.859,15.231,17.529,6.79,14.917,,,,,22.05,48.839,12.228,12.97,21.846,12.802,16.91,,,
1998,27.629,18.048,17.388,19.281,,18.051,19.17,,1.236,22.871,11.077,30.083,20.432,27.363,,47.643,17.484,32.384,7.038,10.093,,4.348,27.436,20.074,,31.473,39.218,21.882,13.689,,16.351,18.292,,,32.635,15.191,10.828,16.343,7.228,14.424,,,,,22.415,44.028,10.917,12.836,22.383,11.504,17.187,,,
1999,41.128,17.452,12.69,20.365,,17.7,17.14,,0.799,26.951,11.009,25.399,18.34,29.948,28.387,46.32,18.27,26.611,5.894,9.439,,11.525,18.495,18.915,,33.695,35.319,23.417,15.01,,18.73,18.532,,,31.402,14.129,19.049,21.306,7.596,14.177,,,,,23.837,45.862,11.441,13.69,21.983,11.622,17.483,,,
2000,42.858,18.211,11.949,18.891,46.846,15.155,16.652,16.849,0.637,26.666,8.609,24.302,19.247,38.272,27.313,59.342,16.718,31.429,8.618,10.202,9.447,22.295,19.978,18.623,14.226,41.704,36.855,22.489,15.513,16.749,19.653,20.643,17.232,,28.657,14.28,28.807,21.484,9.664,14.887,13.268,,,62.254,22.846,40.669,12.136,11.406,21.848,11.594,18.95,23.664,22.569,
2001,37.463,16.681,12.178,18.113,38.971,13.265,16.778,16.317,2.985,30.846,10.865,24.59,17.366,34.991,26.792,49.915,18.678,31.901,10.883,11.694,7.159,18.708,28.385,18.432,10.94,38.234,37.233,21.549,14.042,15.544,20.202,21.36,16.442,,27.822,14.99,27.635,20.266,9.099,15.027,13.973,,,39.28,22.654,37.916,10.965,13.675,22.146,11.963,19.738,24.079,22.07,
2002,28.681,18.688,11.954,16.903,40.837,15.473,17.224,16.404,4.892,27.337,12.115,28.588,18.843,35.449,24.156,46.782,19.105,29.447,8.503,11.034,8.654,11.779,28.849,18.505,10.978,49.4,38.068,23.208,10.163,16.845,18.246,30.167,17.315,12.919,28.317,16.358,20.724,21.627,9.855,16.22,15.202,,,33.842,22.133,40.055,12.587,10.982,22.633,12.883,19.064,23.759,23.072,
2003,29.715,21.73,12.614,17.786,42.216,9.231,15.777,15.031,4.944,30.195,10.714,24.54,21.728,37.078,24.909,64.379,21.221,29.002,10.88,10.085,7.57,13.224,21.534,19.467,9.184,49.421,39.985,22.028,15.415,19.627,18.95,29.111,17.852,19.774,25.91,15.166,21.011,19.994,13.312,16.679,14.35,,,35.938,23.07,48.024,13.745,13.919,21.848,13.589,20.098,23.642,21.999,
2004,30.987,25.344,12.655,18.072,40.641,11.338,17.237,13.965,7.017,30.369,10.734,28.752,23.045,36.024,24.356,49.402,20.498,27.867,12.596,9.135,10.611,18.659,24.607,20.123,11.381,54.047,42.499,22.905,20.274,19.399,17.17,26.842,17.936,22.89,25.419,17.185,23.828,22.923,16.668,18.133,15.749,,,35.523,26.21,40.333,10.373,15.067,21.944,14.589,20.676,24.243,20.764,
2005,33.697,22.587,12.615,17.234,43.566,11.813,17.377,16.798,9.366,38.798,11.763,27.544,25.054,40.739,23.623,45.599,18.768,28.745,11.847,9.934,9.614,16.573,32.669,20.042,10.999,60.41,42.101,25.087,18.462,18.87,17.427,24.417,17.806,24.21,26.511,18.184,22.72,23.954,17.874,18.376,16.098,,,70.478,26.527,39.402,11.442,15.626,21.451,15.038,18.556,28.058,20.079,10.409
2006,40.027,26.55,12.859,40.854,45.272,21.954,18.56,43.949,10.113,44.427,10.948,28.277,24.13,42.814,27.186,34.993,18.279,29.807,12.099,11.035,10.828,16.324,39.888,19.329,14.634,62.961,52.348,26.167,20.962,49.854,19.919,27.128,17.024,28.423,28.73,60.087,21.076,21.364,17.5,17.38,15.082,,,49.724,35.182,41.013,16.152,17.247,21.522,14.234,16.942,28.504,36.604,6.392
2007,42.44,36.455,16.031,20.046,41.512,13.915,19.979,18.523,10.188,44.316,11.884,28.562,24.709,39.834,26.362,31.376,16.954,27.451,12.765,9.937,11.469,16.119,36.849,19.677,18.029,62.28,53.267,28.477,15.996,18.705,21.619,23.664,17.682,28.259,31.013,22.188,17.018,21.896,16.741,18.953,33.043,,,164.054,31.805,31.967,19.586,16.75,21.873,16.401,16.111,28.531,18.886,2.59
2008,48.431,38.458,14.509,16.829,39.767,14.796,19.877,18.722,11.194,54.802,13.664,28.7,29.472,47.566,26.639,31.417,15.874,29.923,11.845,10.459,11.097,23.066,34.506,19.447,18.767,80.688,57.184,31.255,15.938,16.899,21.803,21.303,20.041,28.075,31.304,24.133,20.077,24.495,20.203,17.239,12.695,,,44.095,33.986,34.871,22.409,16.257,24.179,16.32,14.209,28.136,18.79,1.983
2009,37.11,32.843,14.756,19.523,37.819,15.455,18.5,15.677,13.395,30.269,14.022,27.614,27.143,36.792,26.331,22.78,16.181,29.368,12.281,11.357,12.706,24.971,33.373,18.794,22.184,65.609,57.49,28.653,11.525,19.097,23.989,20.652,21.441,26.911,30.801,18.618,10.105,23.505,14.959,17.276,15.141,,,32.68,29.965,36.956,14.935,16.297,23.13,15.466,13.165,26.507,15.75,9.659
2010,42.789,37.207,13.8,19.791,34.186,15.912,18.147,14.983,14.919,41.194,17.471,28.635,25.605,37.212,23.911,25.928,17.162,25.789,12.491,10.837,11.627,20.269,26.646,19.801,25.798,70.391,43.15,26.814,13.173,17.694,26.09,21.893,20.507,31.817,27.855,18.209,12.421,24.282,17.462,17.641,15.218,,,38.236,21.087,35.097,20.203,18.583,24.694,15.259,13.164,26.42,15.634,18.709
2011,45.483,38.696,13.746,20.696,36.296,12.023,14.248,16.255,13.0,46.424,14.078,25.632,24.112,40.019,20.948,26.749,16.621,23.483,14.107,15.106,13.53,16.791,28.327,19.455,25.04,42.414,41.611,27.223,11.675,17.145,27.347,22.313,20.321,21.945,29.991,17.93,17.729,24.682,15.906,18.237,16.963,,25.646,39.682,20.641,39.764,24.759,19.227,25.94,15.36,14.504,26.8,17.744,21.073
2012,41.34,33.75,14.02,22.393,36.685,14.85,19.166,16.326,15.486,49.096,16.82,24.402,24.454,39.109,20.831,28.108,15.476,30.154,13.733,17.531,16.296,11.511,27.961,19.144,27.438,74.248,52.181,28.039,10.83,14.575,26.964,30.007,20.406,27.147,30.792,21.431,14.296,22.862,9.113,18.615,15.175,,16.808,34.992,29.567,41.491,24.352,20.214,24.631,15.442,13.505,26.942,18.694,21.211
2013,36.746,31.351,13.529,24.418,37.6,7.464,19.679,16.317,14.624,50.631,25.315,24.535,22.586,35.786,21.694,25.105,15.825,31.605,12.64,14.765,12.114,11.396,24.87,19.7,27.091,82.98,52.292,27.845,10.897,17.387,31.402,24.924,20.465,28.276,31.136,24.638,11.047,25.531,9.563,17.711,13.264,2.847,21.865,33.446,28.505,38.161,20.74,21.462,24.999,15.033,12.716,27.326,17.629,20.3
2014,30.736,28.143,12.574,21.588,38.349,14.081,18.862,16.612,18.473,48.074,14.2,22.875,22.172,33.305,24.387,21.477,14.901,29.735,13.43,16.971,15.046,22.086,24.057,19.76,29.208,69.305,50.039,28.026,12.43,17.131,31.801,24.959,19.87,24.986,33.661,23.01,10.522,24.238,8.792,19.204,14.039,3.665,27.149,25.116,28.777,37.458,17.796,20.663,25.933,14.377,13.417,27.589,18.895,20.028
2015,24.134,21.866,12.6,20.738,31.193,13.375,19.988,16.479,16.826,32.647,21.303,26.892,26.281,30.544,22.03,28.432,15.379,21.136,14.869,14.81,14.203,20.164,26.474,19.105,31.819,51.218,47.789,26.532,11.879,19.117,28.052,29.415,20.813,24.722,33.525,23.347,7.564,24.64,8.414,19.284,16.192,3.487,18.001,27.956,27.479,34.221,13.96,21.826,23.866,13.982,15.179,28.152,18.77,19.107
2016,17.523,14.968,11.139,21.893,33.22,13.172,19.954,14.816,13.982,34.055,13.977,26.606,24.232,28.614,20.264,29.857,15.884,17.138,13.421,15.989,13.148,16.025,16.902,19.183,31.747,31.743,41.257,26.046,14.554,18.321,26.205,28.004,21.08,23.677,30.173,20.263,5.538,23.459,7.075,20.691,14.881,4.074,29.966,28.161,25.058,37.895,12.429,21.562,22.65,14.827,14.841,28.595,18.237,17.131
2017,17.502,14.024,13.581,22.064,30.934,12.8,20.365,14.954,11.743,27.852,17.188,28.599,23.618,32.558,21.761,35.376,14.957,16.415,13.941,15.312,19.268,18.276,17.314,18.276,28.235,51.815,42.862,26.557,14.758,20.046,28.268,28.089,22.512,25.241,30.949,21.151,6.608,22.855,7.178,19.546,14.647,5.956,36.877,24.943,28.027,36.296,14.649,21.365,24.518,15.415,15.108,28.255,17.475,14.371
2018,21.883,13.715,13.58,22.243,28.18,16.638,19.878,16.055,11.562,29.156,15.331,28.212,23.854,33.325,20.697,37.932,13.057,16.873,14.479,14.644,15.435,16.013,18.97,18.108,27.001,63.297,41.39,26.045,14.81,15.474,25.959,30.411,22.543,23.632,29.095,25.012,8.514,24.122,7.471,18.591,15.743,5.723,33.998,23.745,24.777,37.579,15.265,23.893,26.127,14.635,15.958,29.02,19.127,13.054
2019,19.968,13.637,14.356,24.382,28.524,19.99,20.251,15.924,10.84,31.481,17.996,31.832,23.107,30.65,20.483,32.94,12.639,18.308,15.807,15.827,20.122,19.462,17.472,17.947,28.227,85.603,41.985,26.225,16.372,22.071,30.531,26.45,22.6,23.61,28.532,25.653,7.699,23.081,12.404,20.233,17.705,6.942,31.241,22.296,25.3,38.436,15.592,22.929,28.11,13.969,17.106,29.081,19.396,14.775
2020,20.881,13.52,14.433,23.077,28.102,18.95,20.279,15.668,10.913,32.048,17.42,30.551,21.702,28.462,20.358,35.278,11.404,19.22,15.366,15.514,19.792,18.923,17.06,18.124,28.541,78.73,42.552,26.339,14.973,19.771,29.92,27.504,22.308,24.848,29.851,25.982,7.4,22.159,5.745,20.698,17.038,7.161,38.503,23.622,27.211,37.724,16.374,24.379,28.141,14.154,17.208,29.128,19.709,16.85
2021,21.033,13.373,14.433,23.356,26.894,17.119,20.348,15.87,11.474,32.673,16.571,29.067,20.684,27.332,20.501,32.833,10.901,19.736,15.447,15.992,20.484,19.312,16.482,18.193,28.625,76.144,42.119,26.354,14.819,19.798,28.843,27.253,21.975,25.069,29.454,25.412,7.269,21.627,4.733,21.574,17.33,7.432,42.002,23.489,26.04,36.965,16.399,24.77,28.518,14.454,18.168,29.18,19.804,19.523
2022,20.784,13.706,14.433,23.824,26.858,16.666,20.337,16.011,11.925,34.195,15.602,28.93,20.347,26.818,20.38,32.86,10.938,19.764,15.395,16.177,20.439,19.691,16.208,18.205,28.111,75.455,41.887,26.611,14.436,20.275,27.988,27.317,21.974,25.523,29.313,26.184,7.364,22.023,4.115,22.087,18.071,7.729,44.315,23.803,25.53,36.596,16.666,25.419,28.482,14.715,17.991,29.225,19.784,20.842
2023,20.403,13.681,14.433,24.024,27.269,16.855,20.414,15.967,12.222,34.684,15.798,28.911,19.61,25.982,20.328,33.02,10.958,20.015,15.376,16.417,20.219,20.136,16.284,18.235,28.666,74.235,41.775,26.66,14.603,20.487,28.169,27.632,21.923,25.793,29.333,26.077,7.553,22.222,3.731,22.926,18.205,8.004,46.929,23.25,25.523,36.549,17.575,26.019,28.396,14.977,20.506,29.258,19.726,20.842
2024,19.923,13.665,14.433,24.225,28.292,16.941,20.261,15.936,12.609,35.083,15.916,28.955,19.034,27.21,20.318,33.096,10.97,19.9,15.258,16.33,20.248,20.464,15.926,18.306,27.527,71.304,41.733,26.886,14.615,20.645,26.989,27.639,21.828,25.684,29.444,26.18,7.68,22.15,3.43,23.276,18.429,8.303,48.47,22.985,25.531,36.286,17.014,26.659,28.309,15.228,20.973,29.285,19.739,20.842
