{
  "categories": [
    {
      "name": "Afrique au Pluriel",
      "slug": "afri_plur"
    },
    {
      "name": "Afrique en transitions",
      "slug": "afri_trans"
    },
    {
      "name": "Les transitions",
      "slug": "les_trans"
    },
    {
      "name": "Les 6 défis à relever",
      "slug": "les_defis"
    }
  ],
  "indicators": [
    {
      "area_list": [
        "world",
        "africa",
        "africa_dr"
      ],
      "category_slug": "afri_plur",
      "legend": "Milliards USD",
      "long_name": "PIB, prix courants, USD",
      "na_color": "d8d8d8",
      "name": "PIB",
      "scale": "-Inf - 1,1 - 2,2 - 5,5 - 10,10 - 20,20 - Inf",
      "scale_colors": "dbf9d4,b7f4aa,94ee7f,70e955,4ce32a,29de00",
      "scale_type": "continuous",
      "slug": "pib",
      "source": "FMI",
      "unit": "Milliards"
    },
    {
      "area_list": [
        "world",
        "africa",
        "africa_dr"
      ],
      "category_slug": "afri_plur",
      "legend": "PIB par habitant USD",
      "long_name": "PIB par habitant, prix courants - USD",
      "na_color": "d8d8d8",
      "name": "PIB par habitant",
      "scale": "-Inf - 200,200  - 400,400  - 600,600  - 1000,1000 - 1500,1500 - Inf",
      "scale_colors": "dbf9d4,b7f4aa,94ee7f,70e955,4ce32a,29de00",
      "scale_type": "continuous",
      "slug": "pib_hab",
      "source": "Banque Mondiale",
      "unit": "USD"
    },
    {
      "area_list": [
        "world",
        "africa",
        "africa_dr"
      ],
      "category_slug": "afri_plur",
      "legend": "% annuel",
      "long_name": "Croissance du PIB",
      "na_color": "d8d8d8",
      "name": "Croissance du PIB",
      "scale": "-Inf - 0,0 - 2,2 - 4,4 - 6,6 - 8,8 - Inf",
      "scale_colors": "dbf9d4,b7f4aa,94ee7f,70e955,4ce32a,29de00",
      "scale_type": "continuous",
      "slug": "croissance_pib",
      "source": "Banque Mondiale - OCDE",
      "unit": "%"
    },
    {
      "area_list": [
        "world",
        "africa",
        "africa_dr"
      ],
      "category_slug": "afri_plur",
      "legend": "% du PIB",
      "long_name": "Recettes budgétaires hors dons",
      "na_color": "d8d8d8",
      "name": "Recettes budgétaires",
      "scale": "-Inf - 10,10 - 15,15 - 20,20 - 25,25 - 30,30 - Inf",
      "scale_colors": "dfdff9,bfc0f3,a0a1ed,8081e7,6062e1,4143db",
      "scale_type": "continuous",
      "slug": "recette_budg",
      "source": "FMI - Banque Mondiale - OCDE",
      "unit": "%  du PIB"
    },
    {
      "area_list": [
        "world",
        "africa",
        "africa_dr"
      ],
      "category_slug": "afri_plur",
      "legend": "IDH",
      "long_name": "Indicateur de Développement Humain",
      "na_color": "d8d8d8",
      "name": "IDH",
      "scale": "-Inf - 0.4,0.4 - 0.5,0.5 - 0.6,0.6 - 0.7,0.7 - Inf",
      "scale_colors": "d4f8cc,a9f199,7eeb66,53e433,29de00",
      "scale_type": "continuous",
      "slug": "idh",
      "source": "PNUD"
    },
    {
      "area_list": [
        "world",
        "africa",
        "africa_dr"
      ],
      "category_slug": "afri_plur",
      "legend": "% des 15-24 ans",
      "long_name": "Taux d’alphabétisation total des jeunes",
      "na_color": "d8d8d8",
      "name": "Alphabétisation des jeunes",
      "scale": "-Inf - 30,30 - 40,40 - 50,50 - 60,60 - 70,70 - 80,80 - Inf",
      "scale_colors": "e0fada,c1f5b6,a3f091,84ec6d,66e748,47e224,29de00",
      "scale_type": "continuous",
      "slug": "alpha_jeune",
      "source": "Institut de statistique de l'Unesco",
      "unit": "%"
    },
    {
      "area_list": [
        "world",
        "africa",
        "africa_dr"
      ],
      "category_slug": "afri_plur",
      "legend": "% des 15 ans et plus",
      "long_name": "Taux d’alphabétisation total des adultes",
      "na_color": "d8d8d8",
      "name": "Alphabétisation des adultes",
      "scale": "-Inf - 30,30 - 40,40 - 50,50 - 60,60 - 70,70 - 80,80 - Inf",
      "scale_colors": "e0fada,c1f5b6,a3f091,84ec6d,66e748,47e224,29de00",
      "scale_type": "continuous",
      "slug": "alpha_adulte",
      "source": "Institut de statistique de l'Unesco",
      "unit": "%"
    },
    {
      "area_list": [
        "world",
        "africa",
        "africa_dr"
      ],
      "category_slug": "afri_trans",
      "legend": "Millions de personnes",
      "long_name": "Population",
      "na_color": "d8d8d8",
      "name": "Population totale",
      "scale": "-Inf - 0.5,0.5 - 5,5 - 20,20 - 50,50 - 100,100 - Inf",
      "scale_colors": "dfdff9,bfc0f3,a0a1ed,8081e7,6062e1,4143db",
      "scale_type": "continuous",
      "slug": "pop_tot",
      "source": "Nations Unies",
      "unit": "M"
    },
    {
      "area_list": [
        "world",
        "africa",
        "africa_dr"
      ],
      "category_slug": "afri_trans",
      "legend": "% de la population",
      "long_name": "Population rurale",
      "na_color": "d8d8d8",
      "name": "Population rurale",
      "scale": "-Inf - 20,20 - 40,40 - 60,60 - 80,80 - 100",
      "scale_colors": "d9d9f7,b3b3f0,8d8ee9,6768e2,4143db",
      "scale_type": "continuous",
      "slug": "pop_rurale",
      "source": "Banque Mondiale",
      "unit": "%"
    },
    {
      "area_list": [
        "world",
        "africa",
        "africa_dr"
      ],
      "category_slug": "afri_trans",
      "legend": "% de la population",
      "long_name": "Taux de pauvreté à 1,90 $ par jour",
      "na_color": "d8d8d8",
      "name": "Population vivant dans la pauvreté",
      "scale": "-Inf - 10,10 - 20,20 - 30,30 - 40,40 - 50,50 - Inf",
      "scale_colors": "fed7d4,fdb0aa,fc897f,fb6255,fa3b2a,fa1400",
      "scale_type": "continuous",
      "slug": "pop_pauvrete",
      "source": "Banque Mondiale",
      "unit": "%"
    },
    {
      "area_list": [
        "world",
        "africa",
        "africa_dr"
      ],
      "category_slug": "afri_trans",
      "legend": "par enfant",
      "long_name": "Taux de mortalité infantile à 5 ans",
      "na_color": "d8d8d8",
      "name": "Mortalité infantile",
      "scale": "-Inf - 0.05,0.05 - 0.10,0.10 - 0.15,0.15 - 0.20,0.20 - 0.25,0.25 - Inf",
      "scale_colors": "fed7d4,fdb0aa,fc897f,fb6255,fa3b2a,fa1400",
      "scale_type": "continuous",
      "slug": "mortal_infant",
      "source": "Groupe inter-institutions des Nations Unies",
      "unit": "par enfant"
    },
    {
      "area_list": [
        "world",
        "africa",
        "africa_dr"
      ],
      "category_slug": "afri_trans",
      "legend": "% de la population",
      "long_name": "Prévalence de la sous-nutrition",
      "na_color": "d8d8d8",
      "name": "Sous-nutrition",
      "scale": "-Inf - 10,10 - 15,15 - 20,20 - 25,25 - 30,30 - Inf",
      "scale_colors": "fed7d4,fdb0aa,fc897f,fb6255,fa3b2a,fa1400",
      "scale_type": "continuous",
      "slug": "sous_nutri",
      "source": "FAO",
      "unit": "%"
    },
    {
      "area_list": [
        "world",
        "africa",
        "africa_dr"
      ],
      "category_slug": "les_trans",
      "legend": "kg par hectare",
      "long_name": "Rendement céréalier",
      "na_color": "d8d8d8",
      "name": "Rendement céréalier",
      "scale": "-Inf - 500,500 - 750,750 - 1000,1000 - 1250,1250 - 1500,1500 - Inf",
      "scale_colors": "dbf9d4,b7f4aa,94ee7f,70e955,4ce32a,29de00",
      "scale_type": "continuous",
      "slug": "rdt_cerealier",
      "source": "FAO",
      "unit": "kg\/ha"
    },
    {
      "area_list": [
        "world",
        "africa",
        "africa_dr"
      ],
      "category_slug": "les_trans",
      "legend": "% du prélèvement total d'eau douce",
      "long_name": "Prélèvements annuels d'eau douce, agriculture",
      "na_color": "d8d8d8",
      "name": "Eau douce dans l'agriculture",
      "scale": "-Inf - 20,20 - 40,40 - 60,60 - 80,80 - 100",
      "scale_colors": "fed0cc,fda199,fc7266,fb4333,fa1400",
      "scale_type": "continuous",
      "slug": "eau_douce_agri",
      "source": "FAO",
      "unit": "%"
    },
    {
      "area_list": [
        "world",
        "africa",
        "africa_dr"
      ],
      "category_slug": "les_trans",
      "legend": "% de l'emploi total",
      "long_name": "Emploi dans l'agriculture",
      "na_color": "d8d8d8",
      "name": "Emploi dans l'agriculture",
      "scale": "-Inf - 20,20 - 40,40 - 60,60 - 80,80 - 100",
      "scale_colors": "d9d9f7,b3b3f0,8d8ee9,6768e2,4143db",
      "scale_type": "continuous",
      "slug": "emploi_agri",
      "source": "Organisation internationale du travail",
      "unit": "%"
    },
    {
      "area_list": [
        "world",
        "africa",
        "africa_dr"
      ],
      "category_slug": "les_trans",
      "legend": "% de la population urbaine",
      "long_name": "Population vivant dans les bidonvilles",
      "na_color": "d8d8d8",
      "name": "Bidonvilles",
      "scale": "-Inf - 20,20 - 40,40 - 60,60 - 80,80 - 100",
      "scale_colors": "fed0cc,fda199,fc7266,fb4333,fa1400",
      "scale_type": "continuous",
      "slug": "bidonvilles",
      "source": "Nations Unies",
      "unit": "%"
    },
    {
      "area_list": [
        "world",
        "africa",
        "africa_dr"
      ],
      "category_slug": "les_trans",
      "legend": "% de la population",
      "long_name": "Taux d'urbanisation",
      "na_color": "d8d8d8",
      "name": "Urbanisation",
      "scale": "-Inf - 20,20 - 40,40 - 60,60 - 80,80 - 100",
      "scale_colors": "d4f8cc,a9f199,7eeb66,53e433,29de00",
      "scale_type": "continuous",
      "slug": "pop_urbaine",
      "source": "Banque Mondiale",
      "unit": "%"
    },
    {
      "area_list": [
        "world",
        "africa",
        "africa_dr"
      ],
      "category_slug": "les_trans",
      "legend": "% de la population agée de 15-24 ans",
      "long_name": "Titulaire d'un compte dans une institution financière, jeunes adultes",
      "na_color": "d8d8d8",
      "name": "Titulaire d'un compte, jeunes",
      "scale": "-Inf - 10,10 - 20,20 - 30,30 - 40,40 - Inf",
      "scale_colors": "d4f8cc,a9f199,7eeb66,53e433,29de00",
      "scale_type": "continuous",
      "slug": "compte_jeune",
      "source": "Banque Mondiale",
      "unit": "%"
    },
    {
      "area_list": [
        "world",
        "africa",
        "africa_dr"
      ],
      "category_slug": "les_trans",
      "legend": "% de la population agée de 25+ ans",
      "long_name": "Titulaire d'un compte dans une institution financière, adultes",
      "na_color": "d8d8d8",
      "name": "Titulaire d'un compte, adultes",
      "scale": "-Inf - 10,10 - 20,20 - 30,30 - 40,40 - 50,50 - Inf",
      "scale_colors": "dbf9d4,b7f4aa,94ee7f,70e955,4ce32a,29de00",
      "scale_type": "continuous",
      "slug": "compte_adulte",
      "source": "Banque Mondiale",
      "unit": "%"
    },
    {
      "area_list": [
        "world",
        "africa",
        "africa_dr"
      ],
      "category_slug": "les_trans",
      "legend": "% de la population",
      "long_name": "Accès à l'électricité",
      "na_color": "d8d8d8",
      "name": "Accès à l'électricité",
      "scale": "-Inf - 20,20 - 40,40 - 60,60 - 80,80 - 100",
      "scale_colors": "d4f8cc,a9f199,7eeb66,53e433,29de00",
      "scale_type": "continuous",
      "slug": "acces_elec",
      "source": "Banque Mondiale",
      "unit": "%"
    },
    {
      "area_list": [
        "world",
        "africa",
        "africa_dr"
      ],
      "category_slug": "les_trans",
      "legend": "% du total",
      "long_name": "Production d'électricité à partir de sources renouvelables",
      "na_color": "d8d8d8",
      "name": "Production d'électricité renouvelable",
      "scale": "-Inf - 0.25,0.25 - 0.5,0.5 - 1,1 - 2,2 - 5,5 - Inf",
      "scale_colors": "dbf9d4,b7f4aa,94ee7f,70e955,4ce32a,29de00",
      "scale_type": "continuous",
      "slug": "prod_elec_renouv",
      "source": "International Energy Agency - OCDE",
      "unit": "%"
    },
    {
      "area_list": [
        "world",
        "africa",
        "africa_dr"
      ],
      "category_slug": "les_trans",
      "legend": "Millions d'abonnements",
      "long_name": "Abonnements cellulaires mobiles",
      "na_color": "d8d8d8",
      "name": "Abonnements mobiles",
      "scale": "-Inf - 1,1 – 5,5 - 10,10 - 15,15 - Inf",
      "scale_colors": "d4f8cc,a9f199,7eeb66,53e433,29de00",
      "scale_type": "continuous",
      "slug": "abo_mobile",
      "source": "Union internationale des télécommunications",
      "unit": "M"
    },
    {
      "area_list": [
        "world",
        "africa"
      ],
      "category_slug": "les_trans",
      "legend": "Indice de vulnérabilité",
      "long_name": "Vulnérabilité climatique Ndgain",
      "na_color": "d8d8d8",
      "name": "Vulnérabilité climatique Ndgain",
      "scale": "-Inf - 0.45,0.45 - 0.5,0.5 - 0.55,0.55 - 0.6,0.6 - Inf",
      "scale_colors": "fed0cc,fda199,fc7266,fb4333,fa1400",
      "scale_type": "continuous",
      "slug": "vuln_clim_ndgain",
      "source": "NDGAIN"
    },
    {
      "area_list": [
        "world",
        "africa"
      ],
      "category_slug": "les_trans",
      "legend": "Indice de vulnérabilité",
      "long_name": "Vulnérabilité climatique FERDI",
      "na_color": "d8d8d8",
      "name": "Vulnérabilité climatique FERDI",
      "scale": "-Inf - 50,50 - 52,52 - 56,56 - 58,58 - 60,60 - Inf",
      "scale_colors": "fed7d4,fdb0aa,fc897f,fb6255,fa3b2a,fa1400",
      "scale_type": "continuous",
      "slug": "vuln_clim_ferdi",
      "source": "FERDI"
    },
    {
      "area_list": [
        "world",
        "africa"
      ],
      "category_slug": "les_trans",
      "legend": "Liberté dans le monde",
      "long_name": "Liberté dans le monde",
      "na_color": "d8d8d8",
      "name": "Liberté dans le monde",
      "scale": "1:Non libre,2:Partiellement libre,3:Libre",
      "scale_colors": "bff4ef,7feadf,40e0d0",
      "scale_type": "discrete",
      "slug": "lib_monde",
      "source": "Freedom House"
    },
    {
      "area_list": [
        "world",
        "africa"
      ],
      "category_slug": "les_trans",
      "legend": "Fragilité politique",
      "long_name": "Fragilité politique",
      "na_color": "d8d8d8",
      "name": "Fragilité politique",
      "scale": "0:Pas de fragilité politique,1:Fragilité politique",
      "scale_colors": "fa1400,ffd229",
      "scale_type": "discrete",
      "slug": "frag_pol",
      "source": "Banque Mondiale"
    },
    {
      "area_list": [
        "world",
        "africa"
      ],
      "category_slug": "les_trans",
      "legend": "Régimes politiques",
      "long_name": "Régimes politiques",
      "na_color": "d8d8d8",
      "name": "Régimes politiques",
      "scale": "-Inf -  -10:Colonie,-10 - -16:Autocratie,-6 - 0:Anocratie fermée,0 - 5:Anocratie ouverte,5 - 9:Démocratie imparfaite,10 - Inf:Démocratie",
      "scale_colors": "dfdff9,bfc0f3,a0a1ed,8081e7,6062e1,4143db",
      "scale_type": "continuous",
      "slug": "regime_pol",
      "source": "Polity IV"
    },
    {
      "area_list": [
        "world",
        "africa",
        "africa_dr"
      ],
      "category_slug": "les_defis",
      "legend": "Taux de migration net (pour 1 000 habitants)",
      "long_name": "Migration nette",
      "na_color": "d8d8d8",
      "name": "Migration",
      "scale": "-Inf - -2,-2 - -0.5,-0.5 - 0,0 - 1,1 - Inf",
      "scale_colors": "d4f8cc,a9f199,7eeb66,53e433,29de00",
      "scale_type": "continuous",
      "slug": "migration",
      "source": "Nations Unies",
      "unit": "pour 1000 habitants"
    },
    {
      "area_list": [
        "world",
        "africa",
        "africa_dr"
      ],
      "category_slug": "les_defis",
      "legend": "Nombre d'incubateurs",
      "long_name": "Incubateurs de start-up",
      "na_color": "d8d8d8",
      "name": "Incubateurs de start-up",
      "scale": "-Inf - 15,15 - 20,20 - 25,25 - 30,30 - Inf",
      "scale_colors": "d4f8cc,a9f199,7eeb66,53e433,29de00",
      "scale_type": "continuous",
      "slug": "incub_start_up",
      "source": "GSM Association",
      "unit": "Nb"
    },
    {
      "area_list": [
        "world",
        "africa",
        "africa_dr"
      ],
      "category_slug": "les_defis",
      "legend": "%",
      "long_name": "Proportion d'écoles primaires ayant accès à l'eau potable",
      "na_color": "d8d8d8",
      "name": "Écoles primaires - Eau potable",
      "scale": "-Inf - 40,40 - 60,60 - 80,80 - 90,90 - 100",
      "scale_colors": "d4f8cc,a9f199,7eeb66,53e433,29de00",
      "scale_type": "continuous",
      "slug": "eau_potable_primaire",
      "source": "Institut de statistique de l'Unesco",
      "unit": "%"
    },
    {
      "area_list": [
        "world",
        "africa",
        "africa_dr"
      ],
      "category_slug": "les_defis",
      "legend": "%",
      "long_name": "Proportion d'écoles primaires ayant accès à l'électricité",
      "na_color": "d8d8d8",
      "name": "Écoles primaires – Électricité",
      "scale": "-Inf - 20,20 - 40,40 - 60,60 - 80,80 - 100",
      "scale_colors": "d4f8cc,a9f199,7eeb66,53e433,29de00",
      "scale_type": "continuous",
      "slug": "acces_elec_primaire",
      "source": "Institut de statistique de l'Unesco",
      "unit": "%"
    },
    {
      "area_list": [
        "world",
        "africa",
        "africa_dr"
      ],
      "category_slug": "les_defis",
      "legend": "%",
      "long_name": "Écoles primaires disposant d'installations sanitaires non mixtes",
      "na_color": "d8d8d8",
      "name": "Écoles primaires – Sanitaires",
      "scale": "-Inf - 40,40 - 60,60 - 80,80 - 90,90 - 100",
      "scale_colors": "d4f8cc,a9f199,7eeb66,53e433,29de00",
      "scale_type": "continuous",
      "slug": "sanitaire_primaire",
      "source": "Institut de statistique de l'Unesco",
      "unit": "%"
    },
    {
      "area_list": [
        "world",
        "africa",
        "africa_dr"
      ],
      "category_slug": "les_defis",
      "legend": "% du total des enseignants",
      "long_name": "Enseignants formés dans l'enseignement primaire",
      "na_color": "d8d8d8",
      "name": "Enseignants formés – Primaire",
      "scale": "-Inf - 20,20 - 40,40 - 60,60 - 80,80 - 100",
      "scale_colors": "d4f8cc,a9f199,7eeb66,53e433,29de00",
      "scale_type": "continuous",
      "slug": "enseignant_primaire",
      "source": "Institut de statistique de l'Unesco",
      "unit": "%"
    },
    {
      "area_list": [
        "world",
        "africa",
        "africa_dr"
      ],
      "category_slug": "les_defis",
      "legend": "% du total des enseignants",
      "long_name": "Enseignants formés dans l'enseignement secondaire",
      "na_color": "d8d8d8",
      "name": "Enseignants formés – Secondaire",
      "scale": "-Inf - 20,20 - 40,40 - 60,60 - 80,80 - 100",
      "scale_colors": "d4f8cc,a9f199,7eeb66,53e433,29de00",
      "scale_type": "continuous",
      "slug": "enseignant_secondaire",
      "source": "Institut de statistique de l'Unesco",
      "unit": "%"
    },
    {
      "area_list": [
        "world",
        "africa",
        "africa_dr"
      ],
      "category_slug": "les_defis",
      "legend": "Variation en pourcentage par rapport à la période précédente",
      "long_name": "Volume Import – Biens",
      "na_color": "d8d8d8",
      "name": "Volume Import – Biens",
      "scale": "-Inf - -10,-10 - 0,0 - 3,3 - 6,6 - 9,9 - 12,12 - Inf",
      "scale_colors": "e0fada,c1f5b6,a3f091,84ec6d,66e748,47e224,29de00",
      "scale_type": "continuous",
      "slug": "volume_import_biens",
      "source": "OCDE",
      "unit": "%"
    },
    {
      "area_list": [
        "world",
        "africa",
        "africa_dr"
      ],
      "category_slug": "les_defis",
      "legend": "Variation en pourcentage par rapport à la période précédente",
      "long_name": "Volume Export – Biens",
      "na_color": "d8d8d8",
      "name": "Volume Export – Biens",
      "scale": "-Inf - -10,-10 - 0,0 - 3,3 - 6,6 - 9,9 - 12,12 - Inf",
      "scale_colors": "e0fada,c1f5b6,a3f091,84ec6d,66e748,47e224,29de00",
      "scale_type": "continuous",
      "slug": "volume_exp_biens",
      "source": "OCDE",
      "unit": "%"
    },
    {
      "area_list": [
        "world",
        "africa",
        "africa_dr"
      ],
      "category_slug": "les_defis",
      "legend": "Variation en pourcentage par rapport à la période précédente",
      "long_name": "Volume Import – Biens & Services",
      "na_color": "d8d8d8",
      "name": "Volume Import – Biens & Services",
      "scale": "-Inf - -10,-10 - 0,0 - 3,3 - 6,6 - 9,9 - 12,12 - Inf",
      "scale_colors": "e0fada,c1f5b6,a3f091,84ec6d,66e748,47e224,29de00",
      "scale_type": "continuous",
      "slug": "volume_import_bs",
      "source": "OCDE",
      "unit": "%"
    },
    {
      "area_list": [
        "world",
        "africa",
        "africa_dr"
      ],
      "category_slug": "les_defis",
      "legend": "Variation en pourcentage par rapport à la période précédente",
      "long_name": "Volume Export – Biens & Services",
      "na_color": "d8d8d8",
      "name": "Volume Export – Biens & Services",
      "scale": "-Inf - -10,-10 - 0,0 - 3,3 - 6,6 - 9,9 - 12,12 - Inf",
      "scale_colors": "e0fada,c1f5b6,a3f091,84ec6d,66e748,47e224,29de00",
      "scale_type": "continuous",
      "slug": "volume_exp_bs",
      "source": "OCDE",
      "unit": "%"
    }
  ]
}