Year,ABW,AFG,AGO,ALB,AND,ARE,ARG,ARM,ASM,ATG,AUS,AUT,AZE,BDI,BEL,BEN,BFA,BGD,BGR,BHR,BHS,BIH,BLR,BLZ,BMU,BOL,BRA,BRB,BRN,BTN,BWA,CAF,CAN,CHE,CHL,CHN,CIV,CMR,COD,COG,COL,COM,CPV,CRI,CUB,CUW,CYM,CYP,CZE,DEU,DJI,DMA,DNK,DOM,DZA,ECU,EGY,ERI,ESP,EST,ETH,FIN,FJI,FRA,FRO,FSM,GAB,GBR,GEO,GHA,GIB,GIN,GMB,GNB,GNQ,GRC,GRD,GRL,GTM,GUM,GUY,HKG,HND,HRV,HTI,HUN,IDN,IMN,IND,IRL,IRN,IRQ,ISL,ISR,ITA,JAM,JOR,JPN,KAZ,KEN,KGZ,KHM,KIR,KNA,KOR,KWT,LAO,LBN,LBR,LBY,LCA,LIE,LKA,LSO,LTU,LUX,LVA,MAC,MAF,MAR,MCO,MDA,MDG,MDV,MEX,MHL,MKD,MLI,MLT,MMR,MNE,MNG,MNP,MOZ,MRT,MUS,MWI,MYS,NAM,NCL,NER,NGA,NIC,NLD,NOR,NPL,NRU,NZL,OMN,PAK,PAN,PER,PHL,PLW,PNG,POL,PRI,PRK,PRT,PRY,PSE,PYF,QAT,ROU,RUS,RWA,SAU,SDN,SEN,SGP,SLB,SLE,SLV,SMR,SOM,SRB,SSD,STP,SUR,SVK,SVN,SWE,SWZ,SXM,SYC,SYR,TCA,TCD,TGO,THA,TJK,TKM,TLS,TON,TTO,TUN,TUR,TUV,TZA,UGA,UKR,URY,USA,UZB,VCT,VEN,VGB,VIR,VNM,VUT,WSM,YEM,ZAF,ZMB,ZWE
1960,50.776,8.401,10.435,30.705,58.45,73.5,73.611,51.275,66.211,39.656,81.529,64.72,52.663,2.077,92.46,9.275,4.7,5.135,37.1,82.32,59.712,19.04,32.401,54.028,100.0,36.762,46.139,36.777,43.401,3.596,3.06,20.1,69.061,70.924,67.836,16.203,17.679,13.937,22.3,31.601,46.268,12.551,16.679,34.254,58.401,74.71,100.0,35.628,59.548,71.384,50.325,37.846,73.687,30.191,30.51,33.878,37.864,9.799,56.567,57.533,6.433,55.29,29.681,61.88,21.383,22.312,17.398,78.444,43.069,23.252,100.0,10.472,12.129,13.6,25.537,55.936,30.332,58.534,31.121,50.147,29.009,85.2,22.747,30.154,15.593,55.911,14.586,55.123,17.924,45.184,33.735,42.899,80.3,76.848,59.361,33.769,50.879,63.272,44.198,7.362,34.181,10.285,16.29,27.644,27.71,74.893,7.946,42.343,18.632,27.323,21.46,20.437,16.431,3.512,39.46,69.556,52.867,95.289,,29.357,100.0,23.424,10.642,11.173,50.753,35.584,34.02,11.066,90.129,19.226,18.788,35.679,51.219,6.868,6.88,35.111,4.39,26.598,17.909,37.36,5.793,15.41,39.581,59.752,49.92,3.48,100.0,75.998,16.4,22.104,41.249,46.811,30.297,56.823,3.725,47.892,44.547,40.195,34.955,35.569,,42.281,85.275,34.209,53.731,2.6,31.25,10.746,23.0,100.0,5.768,17.352,38.354,48.9,17.312,,8.748,16.073,47.26,33.464,28.204,72.49,3.913,100.0,27.673,36.807,47.679,6.695,10.098,19.672,33.168,46.412,10.091,17.552,34.155,37.511,31.515,15.895,5.246,4.417,46.792,80.241,69.996,33.978,25.943,61.613,12.228,56.477,14.7,10.404,18.926,9.1,46.619,18.145,12.608
1961,50.761,8.684,10.798,30.943,60.983,74.383,74.217,52.147,66.641,39.04,81.941,64.814,52.364,2.115,92.554,9.856,4.796,5.278,38.782,82.337,60.454,19.686,33.522,53.72,100.0,37.059,47.122,36.849,45.228,3.792,3.097,20.751,69.668,71.243,68.66,16.708,18.911,14.488,22.523,32.318,47.702,13.348,16.948,34.329,58.588,75.102,100.0,36.175,60.063,71.697,51.448,37.912,74.417,31.112,31.797,34.466,38.272,10.114,57.303,58.304,6.65,56.321,30.248,62.607,22.141,22.553,18.33,78.374,43.559,23.797,100.0,10.936,12.331,13.747,26.144,56.453,30.519,59.806,31.768,51.23,29.049,85.293,23.318,31.04,15.975,56.335,14.821,55.345,18.032,45.393,34.389,44.432,80.803,77.985,59.856,34.5,52.412,64.213,44.746,7.565,34.511,10.293,16.918,28.269,28.531,75.787,8.02,44.039,19.291,28.197,21.696,20.315,16.592,3.96,40.443,69.927,53.663,95.328,,29.849,100.0,24.216,10.971,11.23,51.59,36.959,35.214,11.361,90.069,19.566,19.502,37.682,52.741,7.051,7.435,35.829,4.489,27.241,18.334,38.781,5.896,15.633,40.03,60.02,50.998,3.571,100.0,76.525,17.475,22.501,41.853,47.398,30.555,57.114,4.024,48.527,45.933,41.162,35.344,35.67,,43.217,85.693,34.894,54.626,2.654,32.373,11.232,23.645,100.0,6.038,17.903,38.527,50.001,17.835,,8.737,16.805,47.297,33.953,29.107,73.295,4.335,100.0,28.717,37.399,48.021,6.962,10.94,19.781,33.56,46.557,10.243,17.929,35.004,37.95,32.064,16.444,5.394,4.617,47.542,80.462,70.377,34.238,26.394,62.875,12.618,57.864,15.031,10.583,18.986,9.459,46.793,18.951,12.821
1962,50.746,8.976,11.204,31.015,63.462,75.248,74.767,53.019,67.068,38.427,82.228,64.863,52.064,2.154,92.679,10.47,4.893,5.498,40.494,82.355,61.193,20.437,34.663,53.41,100.0,37.357,48.099,36.922,47.07,3.999,3.134,21.418,70.494,71.539,69.435,17.226,20.21,15.058,22.749,33.045,49.143,14.189,17.224,34.404,58.776,75.49,100.0,36.674,60.555,71.762,52.619,37.979,75.093,32.074,33.214,35.06,38.624,10.438,58.308,59.072,6.874,57.162,30.823,63.489,22.962,22.797,19.594,78.237,44.051,24.352,100.0,11.418,12.535,13.895,26.234,57.34,30.707,61.406,32.424,52.314,29.089,85.582,23.9,32.001,16.365,56.758,15.058,55.586,18.218,45.603,35.051,45.978,81.297,78.754,60.355,35.239,53.215,65.144,45.296,7.774,34.844,10.333,17.566,28.903,29.461,76.66,8.095,45.752,19.969,29.089,21.934,20.102,16.753,4.464,41.435,70.443,54.459,95.556,,30.345,100.0,25.027,11.309,11.288,52.428,38.358,36.473,11.662,90.008,19.91,20.237,39.73,54.26,7.246,8.031,36.555,4.59,27.895,18.748,40.224,6.0,15.858,40.481,60.204,52.653,3.612,100.0,77.133,18.607,22.751,42.494,48.514,30.816,57.405,4.347,48.926,47.327,42.136,35.722,35.771,,44.16,86.101,35.586,55.518,2.71,33.518,11.737,24.303,100.0,6.321,18.467,38.628,51.104,18.372,,8.725,17.969,47.335,34.714,29.934,74.271,4.8,100.0,29.786,38.044,48.364,7.239,11.844,19.89,33.955,46.702,10.511,18.312,35.864,38.391,32.598,17.008,5.547,4.826,48.294,80.681,70.757,34.5,26.851,63.933,13.019,59.241,15.369,10.765,19.061,9.831,46.906,19.785,13.082
1963,50.73,9.276,11.624,31.086,65.872,76.093,75.309,53.889,67.493,37.817,82.511,64.913,51.764,2.193,92.835,11.118,4.993,5.727,42.23,82.372,61.926,21.209,35.822,53.101,100.0,37.656,49.078,36.995,48.92,4.217,3.171,22.1,71.307,71.834,70.2,17.757,21.575,15.647,22.976,33.78,50.584,15.074,17.503,34.606,58.963,75.875,100.0,37.176,61.044,71.826,53.787,38.046,75.757,33.052,34.662,35.606,38.977,10.772,59.306,59.836,7.104,57.998,31.403,64.702,23.805,23.042,20.923,78.099,44.544,24.915,100.0,11.919,12.862,14.045,26.323,58.222,30.895,62.983,33.086,53.396,29.129,85.867,24.491,32.979,16.762,57.181,15.299,55.826,18.405,45.813,35.718,47.532,81.781,79.502,60.853,35.985,53.565,66.064,45.847,8.038,35.178,10.497,18.233,29.545,30.407,77.511,8.17,47.475,20.664,29.998,22.174,19.89,16.916,5.029,42.434,70.953,55.253,95.773,,30.846,100.0,25.856,11.657,11.345,53.265,39.776,37.75,11.97,89.948,20.259,20.993,41.056,55.771,7.445,8.671,37.286,4.694,28.558,19.17,41.684,6.259,16.087,41.005,60.387,54.302,3.653,100.0,77.73,19.794,23.002,43.137,49.632,31.077,57.696,4.694,49.326,48.724,43.116,36.101,35.916,,45.389,86.5,36.284,56.408,2.766,35.011,12.262,24.973,100.0,6.616,19.06,38.729,52.206,18.92,,8.714,19.194,47.372,35.483,30.776,75.223,5.312,100.0,30.877,38.694,48.706,7.527,12.811,20.0,34.351,46.848,10.785,18.701,36.734,38.833,33.137,17.587,5.704,5.045,49.046,80.899,71.134,34.762,27.314,64.977,13.43,60.604,15.714,10.95,19.141,10.216,47.02,20.712,13.578
1964,50.715,9.586,12.058,31.158,68.205,76.919,75.844,54.758,67.916,37.211,82.792,64.962,51.464,2.233,92.988,11.801,5.095,5.964,43.987,82.389,62.642,22.004,37.0,52.79,100.0,37.957,50.059,37.068,50.776,4.446,3.318,22.803,72.107,72.127,70.955,18.299,23.007,16.255,23.204,34.524,52.027,16.004,17.787,35.197,59.15,76.255,100.0,37.681,61.532,71.891,54.952,38.113,76.409,34.046,36.141,36.122,39.331,11.115,60.298,60.596,7.342,58.832,31.991,65.898,24.669,23.289,22.318,77.96,45.039,25.488,100.0,12.439,13.677,14.197,26.413,59.099,31.085,64.534,33.682,54.475,29.169,86.147,25.094,33.972,17.168,57.603,15.543,56.066,18.595,46.023,36.391,49.093,82.256,80.232,61.35,36.74,53.914,66.972,46.4,8.318,35.515,10.662,18.92,30.197,31.372,78.341,8.246,49.207,21.378,30.924,22.416,19.679,17.014,5.661,43.441,71.459,56.045,95.98,,31.353,100.0,26.703,12.014,11.404,54.1,41.214,39.047,12.286,89.886,20.613,21.77,41.585,57.274,7.65,9.357,38.025,4.8,29.232,19.6,43.161,6.529,16.318,41.855,60.57,55.944,3.695,100.0,78.317,21.04,23.256,43.784,50.752,31.34,57.987,5.069,49.727,50.126,44.102,36.483,36.079,,46.783,86.78,36.989,57.294,2.824,36.872,12.808,25.657,100.0,6.924,19.712,38.83,53.307,19.453,,8.702,20.484,47.341,36.26,31.631,76.153,5.876,100.0,31.991,39.349,49.049,7.877,13.847,20.11,34.751,46.993,11.066,19.098,37.613,39.279,33.68,18.183,5.865,5.273,49.8,81.114,71.508,35.025,27.781,66.009,13.854,61.952,16.064,11.138,19.221,10.614,47.134,22.015,14.092
1965,50.7,9.904,12.504,31.23,70.445,77.723,76.369,55.622,68.334,36.61,83.068,65.011,51.164,2.294,93.137,12.519,5.198,6.211,45.755,82.5,63.343,22.817,38.127,52.481,100.0,38.257,51.037,37.141,52.625,4.687,3.839,23.519,72.892,72.417,71.696,18.086,24.5,16.88,23.434,35.273,52.82,16.978,18.073,35.791,59.337,76.631,100.0,38.188,62.016,71.955,56.109,38.18,77.048,35.052,37.643,36.64,39.686,11.466,61.278,61.348,7.587,59.658,32.582,67.071,25.553,23.537,23.775,77.821,45.534,26.067,100.0,12.978,14.533,14.349,26.502,59.969,31.274,66.05,33.989,55.548,29.209,86.422,25.704,34.977,17.58,58.022,15.789,56.305,18.785,46.233,37.068,50.651,82.72,80.94,61.843,37.499,54.262,67.866,47.047,8.605,35.851,10.83,19.625,30.855,32.351,79.273,8.323,50.935,22.108,33.666,22.66,19.471,17.11,6.366,44.45,71.958,56.832,96.177,,31.862,100.0,27.566,12.379,11.458,54.931,42.663,40.355,12.608,89.825,20.971,22.566,42.114,58.759,7.86,10.09,38.767,4.908,29.913,20.035,44.646,6.809,16.551,42.707,60.753,57.568,3.737,100.0,78.891,22.338,23.511,44.431,51.868,31.604,58.276,5.47,50.126,51.524,45.091,36.866,36.243,,48.178,87.054,37.697,58.173,2.882,38.769,13.373,26.351,100.0,7.245,20.379,38.931,54.402,19.964,,8.69,21.833,47.109,37.043,32.497,77.056,6.494,100.0,33.123,40.006,49.392,8.406,14.95,20.221,35.152,47.139,11.353,19.499,38.498,39.724,34.227,18.793,6.03,5.509,50.649,81.328,71.879,35.289,28.252,67.022,14.287,63.279,16.421,11.329,19.301,11.026,47.248,23.372,14.62
1966,50.685,10.233,12.965,31.302,72.593,78.508,76.888,56.483,68.75,36.012,83.34,65.061,50.864,2.395,93.284,13.275,5.303,6.467,47.233,82.761,64.04,23.652,39.269,52.17,100.0,38.559,52.016,37.214,54.469,4.94,4.437,24.252,73.642,72.706,72.427,17.915,25.206,17.525,23.666,36.031,53.587,18.0,18.363,36.39,59.523,77.003,100.0,38.698,62.498,72.019,57.26,38.247,77.619,36.073,38.84,37.162,40.042,11.828,62.251,62.097,7.84,60.48,33.18,68.225,26.328,23.788,25.297,77.682,46.03,26.656,100.0,13.537,15.433,14.503,26.592,60.833,31.465,67.491,34.298,56.617,29.249,86.692,26.325,35.997,18.001,58.441,16.039,56.47,18.977,46.637,37.752,51.868,83.175,81.63,62.334,38.265,54.61,68.704,47.696,8.902,36.19,11.0,20.351,31.521,33.347,80.716,8.4,52.664,22.856,36.698,22.905,19.264,17.207,7.065,45.465,72.452,57.617,96.365,,32.377,100.0,28.447,12.747,11.393,55.761,44.126,41.68,12.938,89.764,21.334,23.383,42.647,60.231,8.075,10.874,39.516,5.018,30.604,20.478,46.142,7.1,16.788,43.565,60.936,59.179,3.78,100.0,79.421,23.694,23.769,45.08,52.983,31.869,58.565,5.902,50.526,52.921,46.084,37.25,36.407,,49.578,87.323,38.345,59.048,2.942,40.702,13.959,27.057,100.0,7.579,21.064,39.033,55.494,20.487,,8.679,23.247,46.877,37.833,33.376,77.914,7.157,100.0,34.277,40.667,49.734,8.968,16.125,20.332,35.555,47.284,11.646,19.908,39.392,40.23,34.949,19.419,6.199,5.757,51.499,81.539,72.247,35.554,28.729,68.022,14.732,64.587,16.784,11.522,19.382,11.451,47.362,24.789,15.165
1967,50.67,10.57,13.441,31.374,74.641,79.272,77.398,57.341,69.163,35.418,83.507,65.11,50.564,2.501,93.428,14.069,5.411,6.733,48.499,83.019,64.73,24.509,40.422,51.86,100.0,38.862,52.993,37.287,56.3,5.207,5.124,25.0,74.155,72.993,73.146,17.785,25.926,18.19,23.899,36.796,54.352,18.34,18.657,36.993,59.709,77.37,100.0,39.21,62.978,72.083,58.404,38.314,78.163,37.106,39.004,37.686,40.399,12.2,63.214,62.839,8.1,61.295,33.604,69.357,26.723,24.04,26.883,77.541,46.527,27.254,100.0,14.116,16.379,14.658,26.682,61.691,31.656,68.853,34.608,57.68,29.289,86.958,26.955,37.03,18.429,58.859,16.293,56.311,19.171,47.795,38.557,52.945,83.621,82.3,62.822,39.036,54.957,69.516,48.346,9.209,36.53,12.098,21.097,32.196,34.971,82.081,8.692,54.386,23.622,39.839,23.153,19.059,17.304,7.425,46.484,72.941,58.398,96.544,,32.896,100.0,29.345,13.074,11.336,56.587,45.6,43.016,13.274,89.702,21.701,24.22,43.181,61.688,8.296,11.712,40.269,5.249,31.304,20.929,47.646,7.493,17.027,44.427,61.118,60.77,3.823,100.0,79.852,25.106,24.028,45.732,54.096,32.135,58.853,6.712,50.926,54.314,47.081,37.636,36.571,,50.979,87.588,38.835,59.918,3.003,42.665,14.567,27.776,100.0,7.928,21.765,39.134,56.581,21.02,,8.667,24.724,46.644,38.63,34.266,78.727,7.729,100.0,35.449,41.332,50.077,9.564,17.374,20.444,35.96,47.43,11.946,20.097,40.294,41.036,35.759,20.061,6.373,6.014,52.348,81.749,72.612,35.82,29.21,69.005,15.188,65.874,17.153,11.718,19.593,11.891,47.476,26.261,15.727
1968,50.654,10.918,13.932,31.446,76.588,79.8,77.901,58.195,69.574,34.829,83.672,65.159,50.263,2.611,93.569,14.903,5.52,7.009,49.768,83.275,65.416,25.387,41.588,51.549,100.0,39.166,53.97,37.36,58.118,5.487,5.912,25.815,74.662,73.279,73.854,17.656,26.659,18.875,24.134,37.569,55.117,18.685,18.954,37.601,59.895,77.734,100.0,39.726,63.456,72.147,59.54,38.381,78.698,38.153,39.169,38.215,40.758,12.358,64.168,63.577,8.26,62.106,33.987,70.238,27.122,24.295,28.533,77.4,47.025,27.86,100.0,14.716,17.373,14.815,26.773,62.543,31.848,70.186,34.919,58.738,29.329,87.22,27.596,38.076,18.866,59.276,16.549,56.151,19.366,48.956,39.437,54.02,84.057,82.952,63.309,39.815,55.296,70.316,48.997,9.525,36.871,13.291,21.863,32.878,36.846,83.371,8.994,56.101,24.407,43.07,23.403,18.855,17.402,7.802,47.507,73.425,59.175,96.715,,33.419,100.0,30.26,13.41,11.516,57.411,48.229,44.364,13.619,89.682,22.073,25.079,43.717,64.592,8.522,12.606,41.028,5.505,32.013,21.387,49.156,7.906,17.269,45.293,61.3,62.34,3.867,100.0,80.277,26.575,24.289,46.385,55.207,32.403,59.142,7.625,51.326,55.702,49.012,38.025,36.735,,52.38,87.848,39.328,60.783,3.066,44.654,15.197,28.507,100.0,8.292,22.484,39.236,57.663,21.563,,8.656,26.264,46.412,39.435,35.169,79.519,8.344,100.0,36.641,42.001,50.42,10.196,18.7,20.556,36.368,47.575,12.253,20.127,41.203,41.848,36.577,20.719,6.804,6.283,53.197,81.958,72.974,36.087,29.697,69.973,15.657,67.14,17.529,11.918,19.844,12.347,47.59,27.791,16.306
1969,50.639,11.275,14.436,31.548,78.424,79.8,78.394,59.042,69.98,34.245,83.836,65.208,49.963,2.726,93.707,15.776,5.632,7.296,51.034,83.526,66.093,26.283,42.76,51.238,100.0,39.47,54.94,37.433,59.908,5.781,6.81,26.645,75.161,73.561,74.547,17.528,27.404,19.577,24.37,38.345,55.877,19.035,19.255,38.212,60.081,78.093,100.0,40.242,63.93,72.211,60.664,38.448,79.222,39.207,39.334,38.744,41.117,12.517,65.108,64.307,8.422,62.908,34.371,70.648,27.524,24.551,30.237,77.259,47.522,28.473,100.0,15.336,18.41,14.972,26.863,63.385,32.04,71.481,35.232,59.784,29.369,87.476,28.244,39.13,19.31,59.691,16.809,55.991,19.562,50.115,40.321,55.089,84.483,83.582,63.792,40.596,55.633,71.102,49.647,9.85,37.214,14.579,22.871,33.567,38.756,84.582,9.304,57.796,25.207,46.352,23.654,18.654,17.5,8.196,48.53,73.902,59.946,96.877,,33.946,100.0,31.189,13.751,11.698,58.229,50.861,45.718,13.971,89.69,22.449,25.955,44.336,67.384,8.753,13.554,41.79,5.773,32.729,21.852,50.442,8.339,17.513,46.16,61.481,63.881,3.911,100.0,80.695,28.093,24.552,47.038,56.309,32.672,59.429,8.649,51.726,57.077,51.609,38.414,36.9,,53.773,88.103,39.822,61.638,3.129,46.655,15.848,29.247,100.0,8.67,23.218,39.337,58.735,22.115,,8.645,27.861,46.18,40.243,36.081,80.287,9.001,100.0,37.846,42.671,50.763,10.862,20.098,20.668,36.777,47.721,12.566,20.157,42.115,42.662,37.401,21.392,7.311,6.562,54.042,82.164,73.333,36.354,30.187,70.92,16.135,68.378,17.911,12.12,20.097,12.815,47.704,29.37,16.88
1970,50.624,11.643,14.957,31.74,80.155,79.8,78.88,59.864,70.384,33.819,83.999,65.258,50.008,2.845,93.843,16.691,5.746,7.593,52.3,83.775,66.764,27.201,44.01,50.963,100.0,39.776,55.909,37.55,61.675,6.089,7.834,27.492,75.654,73.843,75.227,17.4,28.163,20.3,24.608,39.129,56.635,19.39,19.559,38.827,60.266,78.448,100.0,40.761,64.402,72.274,61.777,38.683,79.737,40.274,39.5,39.278,41.477,12.678,66.038,64.947,8.588,63.704,34.758,71.055,27.951,24.808,32.0,77.117,48.006,28.958,100.0,15.977,19.496,15.132,26.954,64.22,32.212,72.744,35.545,61.92,29.425,87.729,28.902,40.196,19.762,60.112,17.071,55.831,19.76,51.276,41.212,56.154,84.9,84.195,64.272,41.324,55.971,71.877,50.236,10.295,37.466,15.97,24.088,34.141,40.704,85.661,9.625,59.475,26.025,49.671,23.907,18.453,17.598,8.608,49.555,74.374,60.713,97.032,,34.477,100.0,32.068,14.1,11.893,59.021,53.492,47.079,14.33,89.699,22.83,26.853,45.052,70.062,8.99,14.564,42.556,6.053,33.454,22.292,51.232,8.794,17.76,47.03,61.663,65.396,3.956,100.0,81.106,29.665,24.817,47.64,57.406,32.979,59.715,9.796,52.125,58.328,54.2,38.804,37.065,,55.162,88.354,40.319,62.471,3.194,48.669,16.523,30.0,100.0,8.917,23.969,39.439,59.8,22.678,,8.633,29.518,45.948,41.057,37.004,81.034,9.705,100.0,39.068,43.345,51.106,11.568,21.28,20.889,36.876,47.78,12.886,20.187,43.035,43.482,38.234,22.081,7.852,6.664,54.831,82.368,73.602,36.714,30.683,71.852,16.635,69.592,18.3,12.325,20.353,13.3,47.809,30.351,17.362
1971,50.609,12.021,15.632,31.933,81.78,79.8,79.321,60.657,70.784,33.898,84.16,65.301,50.462,2.97,93.976,17.647,5.861,7.901,53.36,84.021,67.429,28.094,45.349,50.805,100.0,40.082,56.894,37.809,63.412,6.413,8.998,28.356,76.09,73.992,75.883,17.292,28.934,21.584,24.847,39.919,57.39,19.75,19.9,39.445,60.976,78.799,100.0,41.283,65.295,72.332,62.878,39.47,80.239,41.351,39.665,39.813,41.838,12.841,66.848,65.483,8.756,64.523,35.147,71.459,28.417,25.068,34.082,77.03,48.474,29.174,100.0,16.641,20.63,15.293,27.045,64.951,32.281,73.433,35.861,67.153,29.533,88.039,29.569,41.168,20.222,60.539,17.338,55.556,19.991,52.269,42.11,57.214,85.269,84.789,64.75,41.858,56.308,72.666,50.753,10.778,37.609,18.717,25.348,34.317,42.261,86.444,9.955,61.06,26.86,52.992,24.162,18.364,17.697,9.039,50.719,74.916,61.433,97.208,,35.012,100.0,32.879,14.526,12.842,59.779,56.103,48.246,14.697,89.708,23.215,27.769,45.77,72.609,9.298,15.636,43.326,6.345,34.271,22.559,52.022,9.271,18.151,47.785,61.913,66.23,4.005,100.0,81.491,31.287,25.084,47.919,58.496,33.493,60.001,11.078,52.668,59.23,54.702,39.197,37.23,,56.203,88.6,40.818,63.278,3.336,50.688,17.22,30.72,100.0,8.958,24.737,39.544,62.281,23.251,,8.622,30.205,45.716,42.009,37.972,81.563,10.458,100.0,40.337,43.751,51.487,12.313,21.602,21.442,36.607,47.735,13.213,20.217,43.959,44.305,38.945,22.786,8.431,6.737,55.552,82.57,73.613,37.184,31.182,72.764,17.174,70.779,18.396,12.533,20.611,13.598,47.869,31.241,17.855
1972,50.593,12.41,16.455,32.127,83.301,79.8,79.743,61.445,71.182,33.978,84.32,65.311,50.917,3.101,94.106,18.648,5.98,8.221,54.419,84.265,68.088,28.875,46.697,50.646,100.0,40.389,57.879,38.07,63.736,6.754,9.695,29.238,75.971,74.046,76.528,17.184,29.719,22.927,25.089,40.715,58.143,20.115,20.272,40.068,61.8,79.146,100.0,41.807,66.484,72.389,63.968,40.264,80.731,42.437,39.831,40.352,42.2,13.006,67.541,66.017,8.928,65.366,35.538,71.86,28.888,25.33,36.231,77.195,48.942,29.392,100.0,17.327,21.814,15.455,27.136,65.454,32.351,73.675,36.177,71.999,29.641,88.474,30.246,41.839,20.323,60.965,17.779,54.77,20.321,52.611,43.014,58.269,85.63,85.351,65.039,42.395,56.645,73.452,51.269,11.282,37.753,21.818,26.654,34.495,43.692,87.192,10.295,62.58,27.713,56.292,24.419,18.354,17.796,9.474,51.968,75.528,62.122,97.397,,35.675,100.0,33.701,14.964,13.858,60.532,58.685,48.827,15.072,89.716,23.606,28.706,46.491,75.021,9.671,16.773,44.1,6.651,35.104,22.829,52.811,9.772,18.549,48.063,62.232,66.725,4.198,100.0,81.819,32.958,25.353,48.199,59.547,34.012,60.287,11.3,53.324,60.127,55.204,39.591,37.396,,56.718,88.678,41.319,64.078,3.491,52.707,17.941,31.451,100.0,8.999,25.522,40.043,64.703,23.835,,8.61,30.561,46.76,43.064,39.058,81.886,11.264,100.0,41.802,44.078,51.882,13.1,21.929,22.006,36.337,47.691,13.548,20.247,44.888,45.132,39.6,23.507,9.048,6.812,56.272,82.771,73.623,37.657,31.687,73.575,17.728,71.941,18.492,12.744,20.752,13.901,47.929,32.146,18.36
1973,50.578,12.809,17.31,32.321,84.716,79.8,80.158,62.225,71.576,34.057,84.478,65.321,51.371,3.236,94.233,19.689,6.1,8.553,55.471,84.504,68.738,29.666,48.046,50.488,100.0,40.696,58.855,38.331,63.889,7.11,10.381,30.133,75.851,74.1,77.159,17.184,30.513,24.324,25.331,41.514,58.89,20.484,20.649,40.655,62.614,79.488,100.0,42.757,67.649,72.446,65.04,41.061,81.211,43.527,39.997,40.892,42.563,13.173,68.224,66.545,9.102,66.197,35.93,72.256,29.362,25.593,38.43,77.358,49.409,29.61,100.0,18.033,22.941,15.618,27.227,65.952,32.421,73.914,36.494,76.371,29.75,88.894,30.93,42.511,20.35,61.388,18.28,53.983,20.653,52.952,43.92,59.313,85.983,85.793,65.241,42.933,56.98,74.22,51.785,11.805,37.897,25.263,27.997,34.672,45.131,87.902,10.597,64.072,28.581,59.528,24.677,18.344,17.896,9.905,53.21,76.127,62.805,97.573,,36.349,100.0,34.531,15.411,14.936,61.279,61.212,49.407,15.454,89.725,23.903,29.659,47.211,77.28,10.056,17.971,43.881,6.97,35.944,23.1,53.597,10.296,18.952,48.341,62.55,67.216,4.399,100.0,82.141,34.669,25.671,48.479,60.188,34.533,60.571,11.507,53.977,61.014,55.703,39.985,37.916,,57.231,88.755,41.821,64.869,3.652,54.712,18.548,32.189,100.0,9.041,26.321,40.543,67.046,24.427,,8.599,30.917,49.087,44.122,40.153,82.203,12.12,100.0,43.277,44.405,52.275,13.882,22.258,22.579,36.07,47.646,13.889,20.277,45.819,45.959,40.258,24.242,9.704,6.887,56.987,82.97,73.633,38.131,32.195,74.325,18.294,73.07,18.588,12.958,20.832,14.209,47.989,33.061,18.874
1974,50.563,13.219,18.202,32.516,86.032,79.8,80.567,63.0,71.967,34.137,84.636,65.331,51.698,3.377,94.358,20.775,6.222,9.034,56.519,84.741,69.381,30.471,49.4,50.329,100.0,41.004,59.826,38.592,64.041,7.484,11.11,31.045,75.731,74.154,77.778,17.292,31.321,25.78,25.575,42.357,59.607,20.859,21.031,41.002,63.423,79.827,100.0,45.007,68.794,72.503,66.099,41.864,81.683,44.626,40.163,41.457,42.926,13.341,68.901,67.069,9.279,67.019,36.324,72.65,29.842,25.741,40.681,77.521,49.876,29.829,100.0,18.763,23.675,15.783,27.319,66.448,32.491,74.152,36.809,80.252,29.858,89.301,31.571,43.186,20.377,61.81,18.793,53.194,20.991,53.294,44.832,60.351,86.33,86.224,65.442,43.472,57.315,74.975,52.3,12.349,38.042,29.055,28.96,34.849,46.579,88.579,10.837,65.54,29.47,61.237,24.938,18.334,17.996,10.355,54.451,76.717,63.484,97.738,,37.029,100.0,35.372,15.869,16.085,62.022,61.093,49.988,15.845,89.734,23.913,30.632,47.933,79.016,10.456,19.237,43.662,7.304,36.794,23.374,54.382,10.845,19.363,48.62,62.867,67.703,4.61,100.0,82.46,36.423,26.005,48.759,60.827,35.059,60.855,11.717,54.629,61.896,56.202,40.382,38.447,,57.742,88.832,42.325,65.652,3.821,56.704,18.744,32.937,100.0,9.083,27.137,41.046,69.309,25.03,,8.587,31.277,51.421,45.187,41.259,82.517,13.033,100.0,44.767,44.733,52.669,14.704,22.591,23.164,35.802,47.602,14.237,20.307,46.754,46.79,40.92,24.994,10.403,6.963,57.7,83.167,73.643,38.608,32.708,75.063,18.875,74.172,18.685,13.175,20.912,14.524,48.049,33.992,19.4
1975,50.548,13.641,19.128,32.712,87.252,79.8,80.969,63.611,72.354,34.217,84.792,65.341,51.897,3.525,94.48,21.904,6.347,9.836,57.562,84.975,70.017,31.288,50.614,50.171,100.0,41.314,60.789,38.855,64.193,7.876,11.884,31.971,75.611,74.208,78.386,17.4,32.229,27.292,25.821,43.264,60.306,21.239,21.419,41.349,64.224,80.161,100.0,47.277,69.917,72.56,67.142,42.671,82.146,45.729,40.33,42.363,43.291,13.511,69.57,67.589,9.46,67.831,36.721,72.926,30.326,25.858,42.971,77.683,50.344,30.049,100.0,19.515,24.426,15.95,27.41,66.94,32.561,74.389,37.125,83.632,29.967,89.695,32.11,43.864,20.404,62.231,19.317,52.403,21.332,53.634,45.747,61.379,86.669,86.643,65.643,44.013,57.65,75.716,52.564,12.914,38.186,4.477,29.606,35.027,48.033,89.384,11.081,66.978,30.382,62.785,25.2,18.324,18.097,10.822,55.685,77.297,64.157,97.891,,37.714,100.0,36.222,16.334,17.304,62.759,60.632,50.569,16.244,89.742,23.922,31.622,48.656,80.554,10.869,20.569,43.443,7.652,37.652,23.651,55.165,11.419,19.78,48.898,63.183,68.187,4.83,100.0,82.774,38.213,26.341,49.038,61.461,35.56,61.138,11.93,55.28,62.77,56.7,40.779,38.981,,58.252,88.909,42.831,66.427,3.998,58.349,18.943,33.693,100.0,9.125,27.729,41.551,71.484,25.498,,8.576,31.639,53.749,46.257,42.374,82.73,14.004,100.0,46.266,45.061,53.063,15.566,22.927,23.758,35.536,47.557,14.593,20.337,47.691,47.588,41.586,25.761,11.146,7.04,58.389,83.387,73.653,39.087,33.225,75.786,19.47,75.245,18.782,13.395,20.992,14.844,48.109,34.934,19.873
1976,50.532,14.074,20.092,32.908,88.382,79.903,81.366,64.219,72.739,34.297,84.947,65.351,52.096,3.678,94.6,23.079,6.668,10.701,58.526,85.206,70.647,32.118,51.829,50.012,100.0,41.624,61.745,39.118,64.345,8.288,12.705,32.575,75.503,74.262,78.982,17.46,33.594,28.678,26.068,44.177,61.003,21.625,21.812,41.698,65.018,80.491,100.0,49.563,71.018,72.617,68.17,43.484,82.6,46.838,40.497,43.276,43.656,13.684,70.231,68.106,9.644,68.634,37.119,72.997,30.815,25.975,45.295,77.844,50.812,30.27,100.0,20.291,25.193,16.118,27.502,67.429,32.631,74.625,37.443,86.534,30.076,90.077,32.653,44.545,20.431,62.65,19.853,51.799,21.677,53.975,46.666,62.398,87.002,87.053,65.844,44.557,57.984,75.944,52.828,13.503,38.331,4.82,30.262,35.206,49.719,90.745,11.331,68.387,31.311,64.31,25.465,18.314,18.198,11.213,56.915,77.867,64.826,98.035,,38.405,100.0,37.082,16.755,18.596,63.491,60.168,51.151,16.651,89.751,23.933,32.63,49.381,82.007,11.297,21.971,43.224,8.015,38.519,23.929,55.873,12.021,20.205,49.177,63.498,68.667,5.061,100.0,83.028,40.039,26.681,49.319,62.093,35.917,61.421,12.147,55.929,63.637,56.74,41.179,39.518,,58.76,88.985,43.339,67.194,4.182,59.897,19.143,34.372,100.0,9.271,28.14,42.058,73.566,25.748,,8.565,32.004,56.064,47.331,43.499,82.802,15.037,100.0,47.774,45.39,53.456,16.47,23.268,24.365,35.27,47.513,14.956,20.367,48.631,48.184,42.087,26.545,11.937,7.118,59.075,83.806,73.663,39.568,33.747,76.496,20.081,76.288,18.88,13.619,21.073,15.171,48.169,35.89,20.356
1977,50.517,14.517,21.088,33.105,89.42,80.106,81.755,64.821,73.12,34.377,85.1,65.361,52.294,3.838,94.806,24.293,7.151,11.63,59.428,85.434,71.266,32.957,53.039,49.854,100.0,42.446,62.689,39.381,64.496,8.717,13.572,32.897,75.543,74.316,79.565,17.52,34.983,29.469,26.317,45.091,61.693,22.014,22.209,42.046,65.802,80.817,100.0,51.843,72.092,72.674,69.178,44.297,82.886,47.948,40.928,44.191,43.81,13.857,70.883,68.617,9.83,69.423,37.319,73.068,31.307,26.092,47.633,78.005,51.279,30.492,100.0,21.087,25.974,16.287,27.594,67.912,32.701,74.966,37.762,88.983,30.186,90.445,33.2,45.227,20.459,63.066,20.398,51.795,22.026,54.315,47.47,63.404,87.326,87.45,66.044,45.1,58.316,76.002,53.092,14.112,38.476,5.186,30.925,35.385,51.476,91.944,11.584,69.759,32.252,65.802,25.73,18.304,18.299,11.272,58.132,78.426,65.487,98.169,,39.099,100.0,37.948,17.184,19.958,64.215,59.704,51.73,17.083,89.76,23.942,33.652,50.103,83.37,11.739,23.327,43.005,8.394,39.391,24.21,56.262,12.648,20.636,49.456,63.811,69.142,5.302,100.0,83.128,41.888,27.023,49.598,62.719,36.275,61.702,12.366,56.575,64.492,56.78,41.578,40.056,,59.171,89.06,43.942,67.95,4.374,61.421,19.344,34.718,100.0,9.583,28.554,42.565,75.615,25.999,,8.553,32.37,58.346,48.405,44.627,82.873,15.474,100.0,49.282,45.718,53.848,17.413,23.611,24.98,35.006,47.469,15.326,20.504,49.57,48.779,42.508,27.341,12.773,7.197,59.756,84.215,73.673,40.051,34.271,77.189,20.703,77.298,18.978,13.845,21.113,15.502,48.229,36.855,20.846
1978,50.502,14.973,22.122,33.302,90.378,80.309,82.139,65.419,73.497,34.457,85.252,65.371,52.492,4.005,95.005,25.552,7.668,12.629,60.326,85.659,71.879,33.808,54.247,49.695,100.0,43.442,63.625,39.646,64.647,9.168,14.489,33.221,75.583,74.37,80.136,17.9,36.4,30.274,26.567,46.01,62.379,22.41,22.612,42.396,66.579,81.138,100.0,54.119,73.142,72.73,70.169,45.115,83.169,49.061,41.794,45.111,43.826,14.033,71.527,69.124,10.02,70.202,37.469,73.14,31.355,26.209,49.985,78.164,51.747,30.714,100.0,21.907,26.772,16.457,27.687,68.393,32.771,75.355,38.081,91.036,30.295,90.801,33.752,45.911,20.486,63.48,20.956,51.791,22.379,54.655,48.21,64.178,87.644,87.838,66.243,45.645,58.649,76.06,53.356,14.745,38.621,5.578,31.596,35.564,53.233,93.0,11.843,71.099,33.209,67.265,25.998,18.294,18.401,11.331,59.342,78.975,66.143,98.294,,39.798,100.0,38.822,17.622,20.978,64.934,59.237,52.31,17.54,89.768,23.952,34.69,50.827,84.651,12.197,24.627,42.787,8.636,40.271,24.493,56.651,13.025,21.074,49.734,64.123,69.614,5.553,100.0,83.229,43.762,27.368,49.879,63.341,36.635,61.983,12.59,57.22,65.34,56.82,41.979,40.598,,59.115,89.135,44.649,68.698,4.575,62.925,19.547,35.067,100.0,9.904,28.972,43.075,77.604,26.252,,8.542,32.738,60.597,49.482,45.762,82.944,15.803,100.0,49.396,46.048,54.24,18.4,23.958,25.606,34.743,47.424,15.704,20.719,50.51,49.375,42.931,28.153,13.659,7.276,60.434,84.616,73.682,40.536,34.8,77.868,21.34,78.278,19.076,14.074,21.133,15.84,48.289,37.832,21.345
1979,50.487,15.442,23.192,33.5,91.257,80.51,82.516,65.839,73.871,34.538,85.403,65.381,52.655,4.178,95.196,26.676,8.218,13.701,61.216,85.882,72.484,34.67,55.402,49.537,100.0,44.443,64.551,39.91,64.798,9.639,15.457,33.546,75.623,74.424,80.695,18.617,36.614,31.091,26.819,46.932,63.061,22.81,23.02,42.747,67.346,81.456,100.0,56.378,74.167,72.787,71.141,45.935,83.448,50.175,42.665,46.034,43.842,14.211,72.162,69.497,10.214,70.97,37.619,73.211,31.27,26.327,52.337,78.323,52.156,30.938,100.0,22.75,27.585,16.77,27.779,68.87,32.841,75.74,38.402,92.737,30.405,91.145,34.309,46.597,20.513,63.893,21.524,51.788,22.736,54.994,48.951,64.852,87.955,88.215,66.442,46.191,58.98,76.118,53.7,15.401,38.677,5.999,32.036,35.744,54.981,93.928,12.107,72.403,34.181,68.696,26.268,18.284,18.504,11.39,60.361,79.513,66.686,98.41,,40.502,100.0,39.64,18.068,21.607,65.646,58.769,52.889,18.007,89.777,23.962,35.744,51.488,85.85,12.669,25.975,42.569,8.841,41.158,24.778,57.039,13.233,21.518,50.013,64.435,70.081,5.816,100.0,83.328,45.654,27.715,50.159,63.96,36.997,62.263,12.817,57.712,66.178,56.86,42.381,41.141,,59.059,89.21,45.358,69.305,4.656,64.405,19.752,35.417,100.0,10.235,29.394,43.586,79.475,26.507,,8.531,33.109,62.803,50.56,46.901,83.016,16.137,100.0,49.381,46.377,54.632,18.592,24.308,26.242,34.502,47.299,16.089,20.935,51.449,49.972,43.355,28.98,14.141,7.356,61.081,85.009,73.692,40.794,35.333,78.533,21.992,79.228,19.175,14.368,21.153,16.183,48.349,38.818,21.853
1980,50.472,15.995,24.298,33.762,92.064,80.71,82.887,66.05,74.33,34.618,85.552,65.391,52.777,4.339,95.381,27.339,8.805,14.851,62.1,86.101,73.102,35.543,56.498,49.374,100.0,45.451,65.468,40.102,64.949,10.132,16.479,33.874,75.663,74.477,81.243,19.358,36.829,31.921,27.072,47.857,63.738,23.215,23.518,43.099,68.106,81.769,100.0,58.614,75.167,72.844,72.096,46.759,83.723,51.29,43.542,46.961,43.858,14.39,72.789,69.711,10.41,71.727,37.769,73.282,31.186,26.445,54.682,78.481,52.497,31.163,100.0,23.617,28.414,17.804,27.872,69.343,32.912,76.121,38.724,93.753,30.488,91.478,34.87,47.285,20.541,64.191,22.104,51.784,23.098,55.333,49.693,65.521,88.26,88.583,66.64,46.739,60.029,76.175,54.142,15.583,38.627,9.898,32.284,35.882,56.72,94.781,12.377,73.672,35.167,70.094,26.54,18.274,18.607,11.45,61.158,80.042,67.095,98.519,,41.21,100.0,40.387,18.524,22.25,66.339,58.298,53.469,18.484,89.785,23.973,36.813,52.083,86.784,13.158,27.371,42.351,9.05,42.044,25.066,57.426,13.443,21.97,50.292,64.745,70.545,6.091,100.0,83.428,47.562,28.066,50.447,64.574,37.456,62.542,13.047,58.086,67.835,56.9,42.785,41.688,,59.003,89.363,46.07,69.751,4.721,65.86,19.959,35.769,100.0,10.576,29.819,44.099,81.231,26.763,,8.519,33.482,64.96,51.638,48.045,83.087,16.478,100.0,49.366,46.708,55.259,18.787,24.663,26.791,34.289,47.078,16.483,21.154,52.284,50.569,43.78,29.822,14.555,7.534,61.693,85.394,73.738,40.782,35.87,79.185,22.741,80.147,19.247,14.74,21.173,16.534,48.425,39.815,22.371
1981,50.456,16.562,25.437,34.024,92.8,80.683,83.313,66.259,75.043,34.698,85.7,65.364,52.897,4.503,95.535,28.01,9.428,15.801,62.603,86.317,73.843,36.282,57.584,49.183,100.0,46.459,66.37,39.828,65.099,10.646,17.552,34.202,75.712,74.466,81.778,20.118,37.044,32.761,27.327,48.781,64.408,23.649,24.995,43.45,68.853,82.078,100.0,60.809,75.481,72.989,73.028,47.793,83.915,52.401,44.42,47.888,43.874,14.572,73.279,69.924,10.61,72.528,37.919,73.352,31.101,26.417,57.0,78.588,52.836,31.388,100.0,24.503,29.256,18.883,27.965,69.746,32.978,76.497,39.047,93.491,30.396,91.794,35.435,47.887,20.568,64.372,22.815,51.78,23.417,55.634,50.434,66.183,88.533,88.94,66.837,47.286,61.464,76.273,54.582,15.681,38.577,12.742,32.532,35.754,58.407,95.67,12.65,74.899,36.163,71.451,26.812,18.187,18.676,11.51,61.946,80.444,67.44,98.655,,41.92,100.0,41.136,18.988,22.905,66.87,58.826,54.007,18.97,89.794,23.982,37.892,52.676,87.117,14.051,28.81,42.134,9.263,42.807,25.355,57.812,13.656,22.671,50.57,65.104,70.787,6.376,100.0,83.511,49.471,28.38,50.786,65.182,38.394,63.409,13.242,58.459,71.772,57.049,43.221,42.235,,58.948,89.514,46.781,70.193,4.786,67.281,20.166,36.122,100.0,10.927,30.248,44.612,82.864,27.021,,8.508,33.857,65.035,52.31,48.941,83.1,16.824,100.0,49.352,47.038,57.358,18.982,25.02,27.049,34.078,46.858,16.883,21.373,52.468,51.164,45.189,30.675,14.976,7.834,62.3,85.769,73.89,40.77,36.409,79.82,24.039,81.034,19.309,15.12,21.193,16.889,48.591,39.854,22.895
1982,50.441,17.147,26.612,34.287,93.474,80.466,83.759,66.467,75.743,34.779,85.67,65.1,53.018,4.674,95.637,28.692,10.091,16.212,63.104,86.531,74.571,36.607,58.664,48.992,100.0,47.472,67.262,39.554,65.249,11.184,19.489,34.532,75.874,74.406,82.226,20.902,37.26,33.613,27.583,49.707,65.073,24.095,26.535,43.803,69.414,82.383,100.0,62.964,75.452,73.107,73.942,49.524,84.025,53.05,45.303,48.818,43.89,14.755,73.515,70.136,10.813,73.373,38.07,73.425,31.017,26.35,58.372,78.539,53.176,31.614,100.0,25.414,30.113,20.013,28.058,69.94,33.028,76.869,39.37,93.219,30.305,92.09,36.004,48.237,20.595,64.553,23.606,51.776,23.647,55.794,51.175,66.839,88.8,89.287,66.886,47.813,62.882,76.383,55.022,15.78,38.527,13.031,32.782,35.626,60.061,96.414,12.93,76.089,37.173,72.773,27.087,18.043,18.66,11.57,62.73,80.501,67.722,98.889,,42.634,100.0,41.891,19.461,23.574,67.396,59.614,54.43,19.466,89.803,23.993,38.984,53.268,87.444,15.035,30.295,41.917,9.481,43.574,25.611,58.197,13.871,23.389,50.849,65.511,70.918,6.616,100.0,83.552,51.385,28.619,51.126,65.61,39.343,64.422,13.428,58.831,75.406,57.198,43.738,42.785,,58.892,89.663,47.495,70.631,4.853,68.673,20.376,36.476,100.0,11.288,30.68,45.127,84.384,27.28,,8.497,34.826,65.11,52.777,49.102,83.1,17.176,100.0,49.337,47.268,59.435,19.179,25.391,27.308,33.866,46.637,17.291,21.594,52.653,51.76,46.997,31.544,15.409,8.147,62.904,86.138,74.042,40.758,36.953,80.382,25.389,81.891,19.372,15.508,21.2,17.251,48.756,39.805,23.429
1983,50.426,17.747,27.821,34.552,94.089,80.247,84.194,66.675,76.429,34.86,85.641,64.836,53.139,4.85,95.737,29.384,10.796,16.631,63.603,86.742,75.285,36.933,59.736,48.801,100.0,48.486,68.142,39.28,65.399,11.745,21.723,34.864,76.035,74.346,82.359,21.545,37.476,34.476,27.84,50.633,65.733,24.548,28.133,44.156,69.925,82.684,100.0,63.822,75.423,73.103,74.504,51.257,84.134,53.323,46.189,49.658,43.906,14.94,73.749,70.347,11.02,74.202,38.221,73.5,30.933,26.283,59.73,78.489,53.516,31.842,100.0,26.072,31.008,21.194,28.151,70.134,33.078,77.237,39.695,92.937,30.215,92.376,36.577,48.587,21.36,64.734,24.415,51.773,23.879,55.955,51.916,67.488,89.062,89.608,66.866,48.016,64.278,76.493,55.461,15.879,38.477,13.325,33.032,35.498,61.693,97.034,13.214,77.24,38.194,74.055,27.364,17.901,18.644,11.63,63.506,80.557,68.003,99.084,,43.347,100.0,42.649,19.943,24.257,67.919,60.396,54.853,19.972,89.811,24.042,40.088,53.86,87.763,16.074,31.822,41.701,9.704,44.345,25.861,58.532,14.09,24.122,51.127,65.916,71.049,6.864,100.0,83.592,53.294,28.859,51.465,66.031,40.3,65.421,13.616,59.202,78.711,57.346,44.257,43.512,,58.836,89.811,48.21,71.066,4.92,70.033,20.901,36.832,100.0,11.659,31.115,45.642,85.792,27.541,,8.708,35.887,65.184,53.244,49.263,83.1,17.533,100.0,49.322,47.476,61.478,19.377,25.778,27.569,33.655,46.417,17.708,21.817,52.837,52.356,48.812,32.425,15.851,8.47,63.504,86.498,74.194,40.746,37.5,80.907,26.788,82.717,19.435,15.905,21.2,17.619,48.922,39.755,24.069
1984,50.411,18.365,29.065,34.817,94.649,80.026,84.621,66.883,77.103,34.94,85.611,64.57,53.299,5.033,95.835,30.086,11.544,17.06,64.099,86.95,75.987,37.261,60.8,48.61,100.0,49.504,69.01,39.007,65.548,12.332,24.139,35.198,76.195,74.286,82.492,22.203,37.693,35.35,28.1,51.56,66.387,25.006,29.792,44.542,70.433,82.982,100.0,64.252,75.394,72.943,74.715,52.99,84.243,53.596,47.079,50.438,43.922,15.182,73.982,70.558,11.232,75.015,38.372,73.575,30.849,26.216,61.076,78.44,53.855,32.209,100.0,26.346,32.007,22.426,29.028,70.327,33.128,77.602,40.021,92.643,30.124,92.653,37.155,48.937,22.297,64.915,25.244,51.769,24.113,56.115,52.657,68.132,89.319,89.719,66.846,48.22,65.652,76.603,55.9,15.979,38.427,13.626,33.284,35.37,63.301,97.551,13.504,78.353,39.834,75.3,27.643,17.759,18.629,11.691,64.277,80.613,68.283,99.244,,44.063,100.0,43.412,20.434,24.954,68.437,61.175,55.276,20.488,89.82,24.212,41.204,54.452,88.076,17.172,33.391,42.012,9.931,45.119,26.113,58.683,14.312,24.872,51.406,66.319,71.18,7.121,100.0,83.633,55.197,29.101,51.805,66.449,41.266,66.409,13.806,59.573,81.684,57.495,44.777,44.247,,58.743,89.956,48.926,71.497,4.988,71.36,21.903,37.191,100.0,12.041,31.555,46.16,87.095,27.804,,9.261,36.963,65.259,53.711,49.424,83.1,17.897,100.0,49.307,47.684,63.484,19.578,26.169,27.832,33.445,46.196,18.132,22.042,53.021,53.011,50.634,33.32,16.305,8.805,64.1,86.85,74.344,40.734,38.05,81.422,28.237,83.514,19.498,16.31,21.2,17.993,49.088,39.705,24.736
1985,50.395,18.997,30.338,35.083,95.159,79.804,85.038,67.09,77.762,35.021,85.582,64.305,53.498,5.221,95.93,30.796,12.334,17.496,64.59,87.155,76.674,37.589,61.833,48.419,100.0,50.519,69.862,38.736,65.697,12.941,26.724,35.532,76.354,74.227,82.624,22.874,37.91,36.232,28.513,52.221,67.034,25.469,31.5,45.445,70.933,83.274,100.0,64.678,75.365,72.711,74.925,54.71,84.351,53.868,47.968,51.215,43.938,15.757,74.213,70.767,11.453,75.808,38.523,73.65,30.766,26.149,62.402,78.39,54.194,32.896,100.0,26.621,33.019,23.704,29.94,70.518,33.177,77.961,40.347,92.339,30.033,92.92,37.735,49.287,23.261,65.095,26.089,51.765,24.348,56.275,53.395,68.767,89.57,89.828,66.826,48.424,66.996,76.712,56.01,16.079,38.377,13.931,33.541,35.243,64.876,97.903,13.804,79.422,42.373,75.45,27.923,17.619,18.613,11.752,65.038,80.669,68.56,99.377,,44.779,100.0,44.176,20.933,25.491,68.95,61.945,55.696,21.013,89.828,24.381,42.325,55.04,88.381,18.326,34.994,42.325,10.163,45.893,26.366,58.834,14.536,25.635,51.684,66.719,71.31,7.386,100.0,83.673,57.079,29.344,52.143,66.864,42.235,67.38,13.998,59.942,84.317,57.644,45.298,44.983,,58.635,90.1,49.641,71.923,5.057,72.647,22.937,37.549,100.0,12.433,31.997,46.677,88.291,28.067,,9.844,38.049,65.334,54.176,49.584,83.1,18.266,100.0,49.292,47.891,65.439,19.779,26.562,28.095,33.235,45.976,18.563,22.268,53.205,53.839,52.448,34.251,16.767,9.152,64.681,87.194,74.494,40.722,38.602,81.925,29.728,84.28,19.561,16.722,21.2,18.373,49.372,39.655,25.414
1986,50.38,19.647,31.643,35.35,95.325,79.624,85.445,67.296,78.408,35.102,85.552,64.037,53.697,5.417,96.023,31.517,12.832,17.941,64.999,87.357,77.347,37.919,62.857,48.228,100.0,51.535,70.703,38.464,65.846,13.577,29.483,35.868,76.502,74.167,82.755,23.559,38.127,37.124,28.93,52.642,67.566,25.938,33.885,46.353,71.43,83.563,100.0,65.102,75.336,72.617,75.134,56.422,84.458,54.14,48.86,51.993,43.954,16.351,74.444,70.975,11.679,76.567,38.675,73.725,30.682,26.083,63.711,78.34,54.532,33.591,100.0,26.898,34.049,25.034,30.871,70.709,33.227,78.317,40.674,92.023,29.943,94.248,38.319,49.637,24.255,65.274,26.953,51.761,24.585,56.427,54.133,69.396,89.816,89.936,66.806,48.628,68.315,76.835,56.121,16.18,38.327,14.242,33.828,35.116,66.679,97.917,14.118,80.454,44.956,75.505,28.205,17.479,18.597,11.905,65.793,80.725,68.782,99.486,,45.498,100.0,44.944,21.442,25.57,69.459,62.711,56.117,21.548,89.907,24.552,43.456,55.628,88.679,19.541,36.634,42.639,10.4,46.671,26.621,58.985,14.763,26.414,51.963,67.117,71.44,7.66,100.0,83.78,58.944,29.588,52.482,67.277,43.212,68.188,14.193,60.31,86.637,57.792,45.82,45.722,,58.527,90.4,50.357,72.346,5.127,73.9,24.005,37.909,100.0,12.837,32.325,47.195,89.392,28.333,,10.461,39.149,65.408,54.641,49.746,83.1,18.641,100.0,49.277,48.099,67.345,19.983,26.96,28.361,33.026,45.757,19.003,22.496,53.389,54.667,53.93,35.496,17.241,9.511,65.258,87.558,74.644,40.71,39.158,82.418,31.266,85.017,19.625,17.143,21.2,18.808,49.905,39.606,26.105
1987,50.365,20.314,32.978,35.619,95.178,79.482,85.843,67.501,79.04,35.183,85.522,63.769,53.895,5.62,96.115,32.246,13.072,18.395,65.346,87.557,78.007,38.25,63.87,48.037,100.0,52.549,71.529,38.194,65.994,14.24,32.401,36.206,76.522,74.107,82.885,24.259,38.346,37.941,29.35,53.064,68.051,26.413,36.355,47.264,71.921,83.848,100.0,65.524,75.307,72.836,75.341,58.118,84.565,54.412,49.722,52.769,43.877,16.962,74.673,71.183,11.909,77.291,39.327,73.8,30.598,26.016,65.0,78.29,54.87,34.293,100.0,27.178,35.094,26.413,31.817,70.9,33.277,78.668,41.002,91.695,29.853,96.86,38.907,49.987,25.277,65.453,27.835,51.757,24.823,56.553,54.717,70.017,90.057,90.044,66.786,48.832,69.606,76.962,56.231,16.281,38.277,14.559,34.116,34.989,68.563,97.932,14.439,81.446,47.567,75.56,28.488,17.34,18.582,12.394,66.54,80.78,68.947,99.576,,46.219,100.0,45.714,21.959,25.648,69.963,63.47,56.536,22.069,90.028,24.724,44.594,56.215,88.971,20.815,38.305,42.953,10.641,47.45,26.877,59.135,14.993,27.209,52.241,67.513,71.57,7.944,100.0,84.025,60.783,29.833,52.82,67.687,44.195,68.541,14.39,60.676,88.66,57.94,46.342,46.463,,58.419,91.056,51.073,72.765,5.198,74.589,25.107,38.271,100.0,13.111,32.555,47.714,90.4,28.627,,11.111,40.26,65.483,55.105,49.907,83.1,19.022,100.0,49.262,48.307,69.197,20.187,27.362,28.628,32.818,45.537,19.451,22.609,53.573,55.491,55.261,36.762,17.725,9.882,65.83,87.926,74.793,40.697,39.717,82.9,32.846,85.726,19.688,17.573,21.2,19.323,50.439,39.556,26.809
1988,50.35,20.998,34.343,35.888,95.027,79.339,86.233,67.706,79.659,35.264,85.493,63.5,54.094,5.83,96.204,32.985,13.316,18.859,65.692,87.754,78.654,38.583,64.872,47.846,100.0,53.563,72.342,37.923,66.143,14.929,35.467,36.545,76.542,74.046,83.014,24.974,38.608,38.511,29.775,53.485,68.532,26.893,38.902,48.177,72.408,84.129,100.0,65.945,75.278,72.999,75.548,59.798,84.671,54.684,50.511,53.546,43.744,17.592,74.9,71.39,12.143,78.0,40.085,73.875,30.515,25.95,66.412,78.24,55.208,35.004,100.0,27.459,36.155,27.841,32.78,71.09,33.327,79.016,41.332,91.354,29.763,98.309,39.481,50.338,26.329,65.632,28.736,51.754,25.063,56.678,55.257,70.072,90.294,90.15,66.766,49.036,70.868,77.088,56.341,16.383,38.227,14.883,34.405,34.862,70.389,97.946,14.766,82.4,50.195,75.614,28.774,17.201,18.566,12.901,67.28,80.836,69.112,99.651,,46.943,100.0,46.488,22.487,25.727,70.462,64.224,56.955,22.482,90.147,24.896,45.739,56.8,89.257,22.152,39.57,43.269,10.934,48.232,27.136,59.286,15.209,28.019,52.519,67.906,71.699,8.238,100.0,84.268,62.594,30.08,53.159,68.095,45.183,68.892,14.589,61.043,90.413,58.088,46.867,47.207,,58.31,91.671,51.79,73.181,5.27,75.267,26.244,38.613,100.0,13.298,32.787,48.234,90.4,28.969,,11.797,41.382,65.557,55.568,50.068,83.1,19.41,100.0,49.247,48.515,70.99,20.394,27.768,28.897,32.61,45.317,19.907,22.641,53.757,56.314,56.587,38.047,18.221,10.267,66.399,88.285,74.942,40.685,40.28,83.372,34.468,86.407,19.752,18.011,21.2,19.849,50.972,39.506,27.524
1989,50.335,21.088,35.731,36.158,94.872,79.196,86.613,67.69,80.263,35.345,85.463,63.231,54.057,6.047,96.292,33.73,13.563,19.33,66.035,87.949,79.284,38.915,65.585,47.655,100.0,54.571,73.139,37.654,66.29,15.645,38.648,36.744,76.562,73.986,83.143,25.701,38.976,39.082,30.202,53.905,69.008,27.378,41.504,49.089,72.888,84.405,100.0,66.361,75.249,72.976,75.753,61.45,84.777,54.955,51.298,54.318,43.611,18.239,75.126,71.415,12.38,78.691,40.845,73.95,30.432,25.884,67.792,78.19,55.277,35.719,100.0,27.741,37.226,29.312,33.755,71.279,33.377,79.359,41.661,91.002,29.673,99.094,39.969,50.687,27.405,65.81,29.651,51.75,25.305,56.804,55.794,69.889,90.524,90.255,66.746,49.24,72.095,77.213,56.357,16.485,38.065,15.211,34.695,34.735,72.148,97.96,15.098,82.763,52.814,75.669,29.061,17.064,18.551,13.425,67.642,80.891,69.2,99.712,,47.666,100.0,46.856,23.021,25.806,70.956,64.714,57.373,22.899,90.265,25.069,46.886,57.078,89.535,23.545,39.447,43.584,11.243,49.012,27.395,59.434,15.289,28.842,52.797,68.296,71.828,8.541,100.0,84.506,64.366,30.327,53.497,68.499,46.172,69.24,14.791,61.225,91.915,58.236,47.391,47.949,,58.094,92.247,52.504,73.398,5.342,75.93,27.41,38.755,100.0,13.486,33.019,48.754,90.4,29.312,,12.517,42.511,65.632,56.03,50.229,83.1,19.803,100.0,49.25,48.723,72.716,20.602,28.176,29.167,32.231,45.16,20.37,22.672,53.941,57.131,57.899,39.346,18.565,10.665,66.718,88.633,75.089,40.897,40.843,83.833,36.123,87.059,19.891,18.435,21.2,20.385,51.505,39.456,28.25
1990,50.319,21.177,37.144,36.428,94.712,79.051,86.984,67.421,80.948,35.426,85.433,62.96,53.749,6.271,96.377,34.485,13.815,19.811,66.377,88.14,79.838,39.249,65.981,47.465,100.0,55.577,73.922,37.37,66.438,16.388,41.933,36.825,76.582,73.926,83.271,26.442,39.345,39.657,30.633,54.324,69.481,27.869,44.12,50.003,73.364,84.678,100.0,66.776,75.22,73.118,75.957,63.079,84.843,55.226,52.085,55.09,43.478,18.905,75.351,71.231,12.621,79.367,41.611,74.056,30.594,25.818,69.143,78.14,55.038,36.441,100.0,28.026,38.312,30.83,34.745,71.467,33.427,79.698,41.992,90.796,29.583,99.517,40.46,51.037,28.51,65.838,30.584,51.746,25.547,56.929,56.33,69.706,90.75,90.359,66.726,49.444,73.291,77.339,56.266,16.748,37.777,15.546,34.987,34.609,73.844,97.974,15.437,83.12,55.422,75.723,29.349,16.928,18.535,13.967,67.583,80.947,69.25,99.763,,48.391,100.0,46.762,23.566,25.84,71.419,65.054,57.789,23.322,90.381,25.243,48.037,57.033,89.731,25.0,39.323,43.9,11.56,49.794,27.656,59.577,15.368,29.68,53.075,68.684,71.956,8.854,100.0,84.742,66.102,30.576,53.903,68.901,46.986,69.593,14.994,61.27,92.942,58.384,47.915,48.694,67.709,57.852,92.786,53.217,73.394,5.416,76.583,28.61,38.896,100.0,13.677,33.252,49.274,90.4,29.658,50.393,13.276,43.648,65.706,56.491,50.39,83.1,20.202,100.0,49.27,48.931,74.343,20.811,28.589,29.424,31.658,45.075,20.842,22.704,54.124,57.946,59.203,40.661,18.884,11.076,66.757,88.973,75.3,41.365,41.409,84.284,37.814,87.685,20.257,18.715,21.2,20.931,52.037,39.407,28.988
1991,50.304,21.266,38.58,36.7,94.53,78.906,87.328,67.15,81.886,35.465,85.403,62.689,53.441,6.455,96.461,35.247,14.07,20.257,66.717,88.329,80.067,39.578,66.374,47.271,100.0,56.579,74.69,37.006,66.585,17.161,45.292,36.906,76.62,73.869,83.398,27.312,39.716,40.235,31.067,54.743,69.949,28.366,45.044,50.917,73.676,84.947,100.0,67.188,75.158,73.269,76.114,64.482,84.871,55.497,52.871,55.709,43.345,19.59,75.528,71.046,12.867,79.843,42.381,74.229,31.154,25.752,70.462,78.112,54.799,37.17,100.0,28.312,39.41,32.39,35.748,71.635,33.503,80.033,42.323,91.061,29.493,99.832,40.953,51.357,29.641,65.713,31.613,51.745,25.778,57.073,56.865,69.522,90.932,90.463,66.706,49.656,74.455,77.473,56.175,17.043,37.49,15.887,35.272,34.474,74.972,97.988,15.782,83.472,58.0,75.777,29.572,16.821,18.52,14.527,67.523,81.13,69.201,99.805,,49.117,100.0,46.669,24.119,25.776,71.816,65.392,58.234,23.751,90.497,25.418,49.165,56.987,89.697,25.487,39.199,43.777,11.885,50.576,27.919,59.719,15.449,30.176,53.352,69.329,72.265,9.18,100.0,84.95,67.796,30.826,54.757,69.3,46.901,69.966,14.816,61.315,93.106,58.531,48.469,49.439,68.219,57.61,93.291,53.93,73.389,5.491,77.223,29.84,39.038,100.0,13.87,33.485,49.794,90.4,30.007,50.756,14.074,44.793,65.78,56.78,50.517,83.204,20.607,100.0,49.307,49.139,75.537,21.023,29.005,29.593,31.09,44.99,21.215,22.736,54.308,58.756,59.976,41.991,19.208,11.454,66.796,89.304,75.701,41.836,41.949,84.664,39.334,88.285,20.629,18.998,21.2,21.489,52.554,38.989,29.738
1992,49.998,21.355,40.039,37.249,94.324,78.76,87.542,66.878,82.789,35.085,85.285,62.417,53.132,6.637,96.542,35.827,14.33,20.61,67.056,88.398,80.293,39.887,66.766,47.059,100.0,57.541,75.444,36.643,67.078,17.962,46.443,36.987,76.887,73.815,83.564,28.2,40.088,40.817,31.506,55.162,70.415,28.435,45.973,51.832,73.827,85.444,100.0,67.598,75.03,73.36,76.161,64.569,84.898,55.767,53.657,56.226,43.212,20.294,75.61,70.86,13.116,80.128,43.156,74.401,31.872,25.686,71.749,78.172,54.559,37.905,100.0,28.601,40.52,33.271,36.766,71.757,33.744,80.301,42.655,91.32,29.404,99.979,41.448,51.588,30.8,65.587,32.703,51.754,25.984,57.293,57.653,69.337,91.112,90.565,66.742,49.896,75.586,77.61,56.083,17.342,37.203,16.234,35.555,34.283,75.82,98.002,16.133,83.818,55.019,75.832,29.369,16.736,18.504,15.106,67.464,81.528,68.852,99.839,,49.844,100.0,46.575,24.681,25.713,72.209,65.728,58.764,24.186,90.611,25.593,50.218,56.942,89.662,25.98,39.075,43.653,12.218,51.814,28.336,59.862,15.529,30.677,53.63,70.223,72.665,9.582,100.0,85.103,69.447,31.077,55.609,69.697,46.815,70.337,14.629,61.359,93.267,58.679,49.13,50.186,68.726,57.367,93.763,54.227,73.385,6.288,77.851,31.103,39.18,100.0,14.065,33.72,50.315,90.4,30.359,50.981,14.912,45.764,65.854,56.719,50.543,83.361,21.018,100.0,49.362,49.347,76.694,21.235,29.425,29.763,30.527,44.904,21.54,22.768,54.491,59.562,60.518,42.751,19.536,11.79,66.835,89.627,76.097,42.308,42.306,85.012,39.603,88.86,21.006,19.285,21.258,22.058,53.038,38.514,30.499
1993,49.588,21.444,41.511,37.799,94.111,78.614,87.752,66.606,83.654,34.709,85.157,62.144,52.824,6.823,96.622,36.136,14.593,20.966,67.33,88.395,80.518,40.196,67.155,46.848,100.0,58.079,76.181,36.283,67.604,18.791,47.286,37.068,77.152,73.762,83.896,29.103,40.461,41.399,31.946,55.58,70.874,28.39,46.902,52.743,73.977,86.224,100.0,67.792,74.901,73.497,76.207,64.656,84.925,56.037,54.439,56.74,43.079,21.015,75.692,70.674,13.37,80.409,43.933,74.572,32.596,25.62,72.999,78.232,54.32,38.644,100.0,28.89,41.586,33.635,37.792,71.878,33.985,80.503,42.987,91.571,29.315,100.0,41.943,51.818,31.39,65.461,33.808,51.764,26.191,57.512,58.519,69.152,91.287,90.666,66.802,50.136,76.68,77.746,55.992,17.645,36.918,16.587,35.839,34.093,76.645,98.016,16.49,84.157,52.009,75.886,29.167,16.651,18.489,15.703,67.404,81.857,68.799,99.867,,50.569,100.0,46.481,25.251,25.649,72.598,66.063,59.291,24.624,90.723,25.769,51.267,56.896,89.627,26.479,38.952,43.53,12.558,53.109,28.823,60.004,15.61,31.182,53.907,71.1,73.061,9.999,100.0,85.254,71.044,31.329,56.456,70.089,46.73,70.704,14.445,61.404,93.424,58.826,49.789,50.844,69.227,57.124,94.203,54.074,73.381,7.313,78.186,32.127,39.321,100.0,14.262,33.955,51.417,90.839,30.711,51.204,15.626,46.717,65.928,56.659,50.569,83.516,21.434,100.0,49.435,49.555,77.81,21.408,29.848,29.934,29.972,44.819,21.867,22.8,54.674,60.362,61.055,43.156,19.867,12.133,66.874,89.94,76.488,42.78,42.663,85.352,39.872,89.409,21.387,19.574,21.347,22.636,53.521,38.042,30.94
1994,49.177,21.534,43.0,38.354,93.89,78.467,87.96,66.332,84.485,34.334,85.028,61.87,52.515,7.014,96.7,36.447,14.86,21.328,67.557,88.392,80.74,40.506,67.541,46.637,100.0,58.615,76.903,35.924,68.126,19.649,48.133,37.149,77.414,73.708,84.223,30.024,40.835,41.985,32.39,55.996,71.328,28.346,47.834,53.653,74.127,86.969,100.0,67.915,74.772,73.71,76.254,64.744,84.952,56.752,55.219,57.254,42.946,21.755,75.774,70.487,13.627,80.688,44.713,74.743,33.33,25.554,73.921,78.293,54.08,39.39,100.0,29.182,42.472,34.002,38.831,71.998,34.227,80.703,43.32,91.816,29.226,100.0,42.441,52.048,31.987,65.335,34.933,51.773,26.399,57.731,59.38,68.966,91.46,90.767,66.862,50.375,77.74,77.881,55.9,17.952,36.633,16.946,36.123,33.904,77.452,98.029,16.854,84.491,48.981,75.94,28.965,16.566,18.473,16.319,67.345,82.482,68.901,99.891,,51.295,100.0,46.387,25.536,25.586,72.985,66.396,59.794,25.069,90.835,25.946,52.317,56.851,89.592,26.984,38.829,43.407,12.907,54.402,29.316,60.146,15.691,31.691,54.183,71.962,73.453,10.433,100.0,85.404,71.688,31.582,57.301,70.521,46.645,71.069,14.262,61.449,93.578,58.939,50.449,51.488,69.724,56.881,94.614,53.922,73.376,8.49,78.429,32.179,39.464,100.0,14.462,34.192,52.704,91.261,31.067,51.428,15.749,47.673,66.002,56.598,50.596,83.671,21.857,100.0,49.525,49.764,78.888,21.44,30.275,30.105,29.421,44.734,22.199,22.832,54.857,61.078,61.59,43.563,20.203,12.485,66.912,90.245,76.875,43.255,43.021,85.686,40.142,89.934,21.774,19.868,21.436,23.225,54.004,37.572,31.335
1995,48.767,21.624,44.169,38.911,93.661,78.319,88.164,66.057,85.28,33.961,84.898,61.596,52.206,7.211,96.777,36.758,15.131,21.693,67.782,88.388,80.961,40.817,67.926,46.425,100.0,59.15,77.61,35.566,68.644,20.537,48.981,37.231,77.675,73.654,84.545,30.961,41.21,42.573,32.838,56.413,71.777,28.301,48.768,54.561,74.277,87.68,100.0,68.038,74.643,73.922,76.3,64.831,84.979,57.598,55.997,57.766,42.814,22.514,75.856,70.3,13.827,80.963,45.496,74.912,34.071,25.068,74.797,78.353,53.841,40.14,100.0,29.475,43.362,34.371,40.494,72.119,34.47,80.902,43.654,92.055,29.137,100.0,42.941,52.279,32.59,65.209,36.076,51.783,26.607,57.949,60.236,68.78,91.63,90.866,66.922,50.615,78.207,78.016,55.921,18.263,36.349,17.311,36.409,33.715,78.239,98.096,17.378,84.82,45.96,75.994,28.765,16.482,18.458,16.955,67.285,82.893,68.75,99.91,,51.692,100.0,46.294,25.796,25.638,73.368,66.727,59.587,25.519,90.946,26.124,53.365,56.805,89.557,27.495,38.705,43.284,13.263,55.688,29.813,60.288,15.773,32.205,54.437,72.809,73.787,10.883,100.0,85.553,71.669,31.836,58.141,70.951,46.56,71.431,14.081,61.493,93.729,59.018,51.109,52.131,70.216,56.637,94.998,53.769,73.372,9.837,78.67,32.232,39.606,100.0,14.664,34.429,53.988,91.664,31.425,51.651,15.873,48.631,66.076,56.537,50.622,83.824,22.286,100.0,49.633,50.104,79.928,21.473,30.705,30.276,28.877,44.794,22.534,22.864,55.04,61.474,62.123,43.97,20.543,12.846,66.951,90.542,77.257,43.731,43.38,86.014,40.413,90.437,22.166,20.164,21.526,23.76,54.486,37.104,31.732
1996,48.356,21.714,45.346,39.473,93.425,78.493,88.366,65.781,86.043,33.59,84.767,61.32,51.896,7.412,96.851,37.071,15.407,22.064,68.007,88.385,81.18,41.13,68.308,46.214,100.0,59.682,78.302,35.21,69.158,21.456,49.83,37.312,77.951,73.6,84.861,31.916,41.587,43.164,33.289,56.832,72.223,28.257,49.704,55.467,74.426,88.358,100.0,68.161,74.513,74.133,76.347,64.918,85.006,58.441,56.774,58.277,42.681,23.293,75.938,70.111,14.006,81.223,46.282,75.082,34.822,24.473,75.654,78.413,53.6,40.896,100.0,29.77,44.258,34.742,42.187,72.239,34.714,81.1,43.989,92.287,29.048,100.0,43.442,52.509,33.2,65.083,37.235,51.792,26.817,58.173,61.087,68.593,91.797,90.943,66.982,50.855,78.22,78.145,55.943,18.579,36.066,17.683,37.386,33.526,78.662,98.325,18.234,85.142,42.964,76.048,28.565,16.29,18.442,17.571,67.225,82.825,68.65,99.98,,52.022,100.0,46.2,26.058,26.008,73.67,67.058,59.38,25.975,91.181,26.303,54.412,56.76,89.655,28.013,38.582,43.161,13.629,56.969,30.316,60.475,15.855,32.725,54.587,73.64,74.062,11.35,100.0,85.7,71.649,32.092,58.978,71.377,46.475,71.306,13.901,61.538,93.876,59.097,51.77,52.774,70.705,56.393,95.356,53.616,73.367,11.374,78.91,32.284,39.749,100.0,14.869,34.667,55.268,92.052,31.785,51.875,15.997,49.592,66.15,56.476,50.649,83.914,22.722,100.0,49.758,50.473,80.93,21.506,31.139,30.449,28.338,45.018,22.873,22.897,55.224,61.87,62.653,44.379,20.888,13.216,66.99,90.835,77.636,44.208,43.741,86.336,40.684,90.917,22.563,20.464,21.616,24.249,54.967,36.638,32.132
1997,47.946,21.805,46.525,40.035,93.18,78.938,88.564,65.504,86.771,33.221,84.636,61.045,51.588,7.618,96.924,37.385,15.875,22.438,68.231,88.382,81.396,41.442,68.687,46.003,100.0,60.212,79.048,34.856,69.666,22.401,50.677,37.394,78.34,73.546,85.172,32.883,41.964,43.755,33.742,57.299,72.662,28.213,50.637,56.367,74.618,89.002,100.0,68.283,74.382,74.342,76.393,65.005,85.033,59.276,57.544,58.785,42.658,24.088,76.019,69.923,14.186,81.466,46.732,75.25,35.354,23.889,76.49,78.472,53.36,41.654,100.0,30.052,45.155,35.114,43.893,72.358,34.959,81.226,44.323,92.513,28.959,100.0,43.944,52.739,33.792,64.956,38.406,51.8,27.028,58.419,61.853,68.405,91.96,91.009,67.042,51.095,78.232,78.272,55.964,18.898,35.785,18.06,38.752,33.339,78.905,98.527,19.12,85.459,43.304,76.114,28.366,15.994,18.427,18.049,67.166,82.779,68.6,100.0,,52.35,100.0,45.797,26.321,26.379,73.929,67.385,59.172,26.434,91.492,26.482,55.451,56.714,89.784,28.535,38.459,43.038,14.002,58.237,30.823,60.838,15.937,33.247,54.737,74.453,74.476,11.834,100.0,85.781,71.629,32.348,59.807,71.798,46.39,71.066,13.724,61.583,94.02,59.176,52.428,53.414,71.187,56.285,95.659,53.463,73.363,12.466,79.147,32.337,39.891,100.0,15.076,34.905,56.537,92.422,32.147,52.098,16.123,50.55,66.223,56.416,50.675,83.942,23.081,100.0,49.901,50.841,81.89,21.538,31.576,30.622,27.806,45.241,23.215,22.927,55.406,62.262,63.179,44.787,21.237,13.594,67.029,91.147,78.008,44.685,44.1,86.65,40.955,91.374,22.965,20.766,21.705,24.743,55.449,36.176,32.534
1998,47.536,21.895,47.71,40.601,92.927,79.378,88.759,65.226,87.467,32.855,84.503,60.768,51.278,7.83,96.996,37.699,16.51,22.818,68.454,88.379,81.611,41.755,69.064,45.793,100.0,60.739,79.781,34.503,70.17,23.377,51.525,37.475,78.724,73.492,85.477,33.867,42.342,44.348,34.199,57.766,73.098,28.168,51.572,57.264,74.855,89.615,100.0,68.405,74.251,74.551,76.439,65.092,85.06,60.107,58.313,59.291,42.704,24.903,76.1,69.733,14.369,81.707,47.123,75.417,35.654,23.314,77.306,78.532,53.12,42.418,100.0,30.323,46.057,35.488,45.616,72.478,35.204,81.351,44.659,92.733,28.871,100.0,44.447,52.968,34.389,64.829,39.593,51.808,27.24,58.664,62.588,68.388,92.121,91.074,67.102,51.335,78.245,78.398,55.986,19.222,35.504,18.355,40.138,33.151,79.145,98.705,20.039,85.77,43.646,76.193,28.168,15.702,18.411,18.538,67.106,82.893,68.451,100.0,,52.678,100.0,45.394,26.586,26.755,74.186,67.712,58.965,26.948,91.793,26.663,56.488,56.669,89.912,28.742,38.337,42.916,14.384,59.496,31.335,61.199,16.02,33.773,54.886,75.25,75.027,12.336,100.0,85.861,71.609,32.585,60.632,72.216,46.305,70.825,13.549,61.627,94.161,59.255,53.086,54.054,71.524,56.205,95.888,53.311,73.359,13.244,79.383,32.39,40.034,100.0,15.285,35.144,57.8,92.776,32.511,52.322,16.249,51.509,66.297,56.355,50.701,83.97,22.949,100.0,50.061,51.21,82.814,21.571,32.016,30.795,27.28,45.465,23.561,22.955,55.589,62.653,63.703,45.197,21.59,13.982,67.067,91.45,78.377,45.164,44.461,86.959,41.228,91.811,23.371,21.073,21.796,25.244,55.93,35.716,32.939
1999,47.127,21.986,48.897,41.169,92.666,79.81,88.952,64.947,88.131,32.49,84.37,60.491,51.185,8.036,97.065,38.015,17.166,23.202,68.677,88.376,81.824,42.069,69.482,45.582,100.0,61.264,80.496,34.152,70.669,24.383,52.372,37.557,79.103,73.438,85.778,34.865,42.741,44.944,34.659,58.231,73.53,28.124,52.505,58.157,75.089,90.198,100.0,68.527,74.12,74.758,76.485,65.179,85.086,60.933,59.118,59.796,42.75,25.735,76.181,69.543,14.553,81.946,47.515,75.614,35.86,22.749,78.102,78.591,52.879,43.184,100.0,30.595,46.961,35.865,47.35,72.597,35.45,81.476,44.995,92.946,28.782,100.0,44.952,53.198,34.992,64.702,40.792,51.815,27.453,58.91,63.318,68.442,92.267,91.139,67.162,51.574,78.258,78.523,56.025,19.55,35.3,18.47,41.54,32.965,79.384,98.862,20.991,85.885,43.988,76.284,27.971,15.414,18.396,19.038,67.046,83.448,68.22,100.0,,53.007,100.0,44.992,26.853,27.134,74.441,68.053,58.757,27.646,92.085,26.843,57.518,56.623,90.038,28.92,38.214,42.793,14.522,60.742,31.851,61.559,16.103,34.304,55.036,76.03,75.569,12.857,100.0,85.941,71.589,32.783,61.451,72.631,46.22,70.582,13.375,61.672,94.298,59.334,53.743,54.693,71.747,56.126,96.105,53.158,73.354,14.064,79.616,32.442,40.177,100.0,15.496,35.384,58.357,93.115,32.878,52.545,16.376,52.467,66.371,56.294,50.728,83.998,22.817,100.0,50.238,51.578,83.7,21.604,32.46,30.969,26.76,45.689,23.91,22.984,55.771,63.043,64.223,45.607,21.947,14.379,67.106,91.743,78.742,45.644,44.823,87.262,41.5,92.228,23.817,21.382,21.886,25.752,56.411,35.258,33.347
2000,46.717,22.078,50.087,41.741,92.395,80.236,89.142,64.666,88.587,32.127,84.235,60.213,51.386,8.246,97.129,38.333,17.844,23.59,68.899,88.372,82.007,42.384,69.973,45.398,100.0,61.787,81.192,33.827,71.164,25.418,53.219,37.639,79.478,73.383,86.073,35.877,43.155,45.542,35.122,58.695,73.957,28.08,53.435,59.052,75.323,90.752,100.0,68.648,73.988,74.965,76.532,65.265,85.1,61.753,59.919,60.299,42.797,26.587,76.262,69.368,14.74,82.183,47.908,75.871,36.337,22.33,78.879,78.651,52.638,43.929,100.0,30.869,47.868,36.243,49.092,72.716,35.698,81.6,45.332,93.129,28.694,100.0,45.458,53.428,35.6,64.575,42.002,51.823,27.667,59.155,64.042,68.496,92.401,91.203,67.222,51.814,78.27,78.649,56.098,19.892,35.298,18.586,42.958,32.778,79.621,99.0,21.977,86.0,44.331,76.387,27.774,15.13,18.38,19.548,66.986,84.216,68.067,100.0,,53.335,100.0,44.589,27.121,27.706,74.722,68.58,58.548,28.356,92.368,27.025,58.544,57.133,90.152,29.098,38.091,42.67,14.61,61.977,32.373,61.919,16.186,34.84,55.185,76.795,76.02,13.397,100.0,86.021,71.569,32.982,62.198,73.042,46.135,70.338,13.204,61.716,94.387,59.412,54.399,55.331,71.969,56.047,96.311,53.004,73.35,14.926,79.848,32.495,40.32,100.0,15.813,35.626,58.912,93.44,33.247,52.769,16.504,53.424,66.444,56.233,50.754,84.026,22.686,100.0,50.433,51.947,84.55,21.637,32.907,31.386,26.501,45.913,24.263,23.012,55.905,63.432,64.741,46.018,22.309,14.786,67.145,92.028,79.057,46.126,45.186,87.559,41.774,92.586,24.374,21.673,21.977,26.267,56.891,34.802,33.758
2001,46.339,22.169,51.274,42.435,92.056,80.655,89.329,64.385,88.491,31.74,84.1,59.934,51.587,8.461,97.186,38.65,18.54,24.096,69.166,88.369,82.049,42.698,70.458,45.381,100.0,62.306,81.553,33.629,71.652,26.48,54.062,37.72,79.81,73.375,86.363,37.093,43.568,46.139,35.587,59.156,74.379,28.036,54.291,60.41,75.555,91.011,100.0,68.769,73.877,75.17,76.578,65.382,85.15,62.565,60.712,60.799,42.843,27.455,76.343,69.242,14.927,82.368,48.3,76.127,37.175,22.33,79.633,78.751,52.398,44.601,100.0,31.144,48.775,36.622,50.832,72.913,35.919,81.849,45.668,93.233,28.606,100.0,45.964,53.642,37.251,64.67,42.783,51.833,27.918,59.399,64.758,68.55,92.532,91.267,67.282,52.053,78.283,79.99,56.171,20.239,35.296,18.703,43.473,32.598,79.94,99.908,22.993,86.118,44.673,76.502,27.473,14.962,18.365,20.067,66.919,84.843,67.95,100.0,,53.662,100.0,44.189,27.391,28.859,75.045,69.101,58.339,29.075,92.641,27.208,59.559,58.222,90.235,29.277,38.616,42.559,14.698,62.922,32.898,62.276,16.26,35.669,55.335,77.83,76.378,13.947,100.0,86.1,71.549,33.18,62.497,73.448,46.05,70.093,13.182,61.761,94.333,59.491,55.044,55.966,72.189,55.967,96.506,52.852,73.346,15.829,80.077,32.548,40.464,100.0,16.201,35.867,59.464,93.75,33.617,52.992,16.632,54.377,66.517,56.163,50.78,84.071,22.555,100.0,50.646,52.314,85.362,21.67,33.356,32.548,26.503,46.137,24.619,23.041,55.718,63.818,65.34,46.429,22.674,15.201,67.183,92.303,79.234,46.606,45.548,87.85,42.048,92.814,24.937,21.953,22.068,26.787,57.368,35.002,34.17
2002,45.972,22.261,52.461,43.501,91.641,81.067,89.51,64.236,88.394,31.098,84.222,59.655,51.787,8.682,97.241,39.036,19.258,24.756,69.524,88.373,82.092,43.014,70.939,45.364,100.0,62.783,81.88,33.431,72.046,27.57,54.57,37.802,79.888,73.401,86.606,38.425,43.983,46.738,36.055,59.617,74.797,27.992,55.146,61.753,75.785,90.894,100.0,68.694,73.809,75.374,76.624,65.689,85.25,63.371,61.501,61.118,42.889,28.341,76.533,69.116,15.118,82.503,48.692,76.38,38.022,22.33,80.368,79.047,52.441,45.275,100.0,31.42,49.683,37.004,52.573,73.303,35.913,82.095,46.005,93.334,28.518,100.0,46.61,53.81,38.935,65.081,43.568,51.851,28.244,59.649,65.468,68.604,92.662,91.33,67.382,52.251,78.296,81.647,56.244,20.591,35.295,18.82,43.492,32.455,80.299,100.0,24.044,86.24,45.017,76.629,26.329,14.906,18.349,20.597,66.828,85.299,67.85,100.0,,53.99,100.0,43.789,27.663,30.042,75.365,69.618,58.13,29.806,92.905,27.391,60.568,59.304,90.316,29.457,39.48,42.447,14.786,63.856,33.766,62.632,16.255,36.508,55.484,79.113,76.733,14.24,100.0,86.161,71.529,33.38,62.794,73.85,45.965,69.847,13.164,61.787,94.278,59.57,55.666,56.6,72.409,55.888,96.692,52.78,73.341,16.777,80.304,32.601,40.607,100.0,16.597,36.109,60.014,93.925,33.99,53.215,16.761,55.555,66.591,56.013,50.857,84.133,22.425,100.0,50.876,52.682,86.007,21.702,33.809,33.734,26.505,46.362,24.979,23.069,55.53,64.202,65.974,46.841,23.044,15.626,67.283,92.569,79.409,47.088,45.914,87.876,42.328,93.036,25.511,22.235,21.941,27.315,57.898,35.475,34.585
2003,45.606,22.353,53.645,44.573,91.207,81.472,89.686,64.137,88.297,30.464,84.343,59.375,51.988,8.908,97.296,39.536,19.996,25.429,69.879,88.383,82.134,43.33,71.415,45.347,100.0,63.248,82.203,33.234,72.421,28.688,55.029,37.884,79.967,73.427,86.665,39.776,44.399,47.338,36.526,60.076,75.211,27.947,55.997,63.08,75.947,90.775,100.0,68.553,73.74,75.577,76.67,65.994,85.36,64.605,62.284,61.316,42.935,29.244,76.778,68.989,15.31,82.638,49.085,76.632,38.714,22.33,81.083,79.339,52.83,45.951,100.0,31.698,50.555,37.387,54.307,73.689,35.907,82.338,46.318,93.435,28.307,100.0,47.267,53.979,40.645,65.489,44.356,51.869,28.572,59.925,66.172,68.658,92.789,91.393,67.501,52.437,78.308,83.196,56.317,20.948,35.293,18.937,43.512,32.312,80.652,100.0,25.126,86.366,45.361,76.768,25.216,14.85,18.334,21.137,66.737,85.743,67.8,100.0,,54.317,100.0,43.389,27.936,31.252,75.682,70.13,57.921,30.547,93.16,27.575,61.568,60.378,90.398,29.637,40.351,42.335,14.875,64.78,34.709,62.987,16.251,37.356,55.633,80.341,77.084,14.538,100.0,86.221,71.509,33.58,63.091,74.249,45.88,69.6,13.146,61.676,94.224,59.648,56.287,56.977,72.627,56.242,96.868,52.912,73.373,16.904,80.53,32.654,40.898,100.0,17.001,36.352,60.561,93.975,34.756,53.437,16.891,56.766,66.664,55.863,51.082,84.196,22.296,100.0,51.123,53.049,86.608,21.735,34.265,34.941,26.507,46.587,25.343,23.098,55.343,64.585,66.602,47.656,23.611,16.061,67.427,92.828,79.583,47.571,46.283,87.902,42.615,93.251,26.092,22.521,21.698,27.849,58.446,35.951,34.479
2004,45.24,22.5,54.827,45.651,90.751,81.871,89.86,64.038,88.198,29.837,84.463,59.094,52.189,9.139,97.35,40.039,20.757,26.114,70.233,88.399,82.176,43.648,71.887,45.33,100.0,63.711,82.521,33.037,72.794,29.835,55.488,37.966,80.045,73.452,86.725,41.144,44.817,47.94,37.0,60.533,75.62,27.903,56.846,64.388,76.041,90.655,100.0,68.41,73.671,75.779,76.716,66.299,85.566,66.003,63.061,61.514,42.981,30.164,77.022,68.862,15.504,82.772,49.479,76.883,39.247,22.33,81.778,79.629,53.218,46.63,100.0,31.977,51.288,37.772,56.033,74.073,35.901,82.58,46.616,93.534,28.064,100.0,47.927,54.147,41.679,65.896,45.149,51.887,28.903,60.202,66.869,68.712,92.914,91.456,67.62,52.625,78.321,84.64,56.39,21.31,35.292,19.055,43.532,32.17,81.002,100.0,26.242,86.494,45.706,76.919,24.133,14.795,18.319,21.689,66.646,86.177,67.9,100.0,,54.644,100.0,42.99,28.211,32.49,75.997,70.637,57.711,31.3,93.407,27.76,62.127,61.443,90.478,29.818,41.229,42.223,14.964,65.694,35.666,63.341,16.247,38.212,55.782,81.514,77.399,14.841,100.0,86.281,71.827,33.781,63.387,74.644,45.795,70.383,13.127,61.564,94.168,59.727,56.907,57.305,72.845,56.831,97.09,53.043,73.418,16.908,80.754,32.707,41.306,100.0,17.413,36.596,61.107,94.155,35.531,53.661,17.023,57.972,66.737,55.713,51.308,84.258,22.166,100.0,51.388,53.417,87.188,21.768,34.724,36.169,26.508,46.812,25.71,23.127,55.155,64.95,67.225,48.678,24.223,16.507,67.597,93.078,79.757,48.054,46.656,87.928,42.909,93.461,26.683,22.809,21.457,28.39,58.993,36.43,34.294
2005,44.875,22.703,56.0,46.731,90.285,82.262,90.031,63.938,88.1,29.218,84.582,58.813,52.389,9.375,97.403,40.543,21.537,26.809,70.584,88.422,82.218,43.965,72.354,45.313,100.0,64.17,82.834,32.841,73.163,30.965,55.944,38.069,80.122,73.478,86.783,42.522,45.234,48.541,37.481,60.988,76.024,27.875,57.689,65.672,76.134,90.534,100.0,68.268,73.602,75.98,76.761,66.601,85.856,67.37,63.83,61.711,43.027,31.099,77.263,68.735,15.7,82.905,49.871,77.13,39.781,22.33,82.452,79.915,53.605,47.308,100.0,32.257,52.02,38.157,57.74,74.452,35.895,82.858,46.913,93.631,27.822,100.0,48.585,54.315,42.638,66.365,45.942,51.905,29.235,60.477,67.558,68.766,93.037,91.518,67.738,52.811,79.485,85.978,56.463,21.675,35.29,19.174,43.551,32.028,81.345,100.0,27.186,86.627,46.051,77.08,23.085,14.739,18.303,22.249,66.635,86.598,68.0,100.0,,55.174,100.0,42.775,28.814,33.75,76.308,71.138,57.532,32.06,93.645,27.946,62.465,62.494,90.558,29.999,42.111,42.112,15.054,66.594,36.632,63.965,16.242,39.074,55.935,82.63,77.675,15.149,100.0,86.341,72.4,33.982,63.682,75.034,45.71,71.152,13.109,61.452,94.112,59.805,57.522,57.633,73.061,57.417,97.396,53.174,73.463,16.912,80.979,32.76,41.714,100.0,17.832,36.919,61.648,94.453,36.311,53.883,17.154,59.165,66.682,55.563,51.533,84.319,22.038,100.0,51.67,53.782,87.745,21.801,35.185,37.411,26.51,47.052,26.041,23.155,54.967,65.237,67.84,49.699,24.845,16.96,67.79,93.319,79.928,48.537,47.032,87.954,43.21,93.664,27.281,23.099,21.218,28.936,59.536,36.911,34.11
2006,44.511,22.907,56.764,47.815,89.807,82.648,90.2,63.839,88.0,28.606,84.7,58.532,52.589,9.617,97.454,41.049,22.339,27.517,70.932,88.452,82.26,44.282,72.816,45.296,100.0,64.628,83.143,32.646,73.529,31.712,56.4,38.193,80.213,73.504,86.842,43.868,45.652,49.143,37.971,61.441,76.423,27.863,58.529,66.935,76.227,90.411,100.0,68.125,73.533,76.179,76.807,66.903,86.098,68.71,64.593,61.907,43.073,32.051,77.502,68.607,15.899,83.037,50.264,77.377,40.147,22.324,83.107,80.199,53.992,47.988,100.0,32.539,52.751,38.545,59.431,74.827,35.889,83.172,47.21,93.727,27.582,100.0,49.245,54.483,43.604,66.895,46.738,51.922,29.569,60.738,68.239,68.819,93.159,91.58,67.856,52.998,80.97,87.118,56.536,22.045,35.289,19.293,44.03,31.886,81.528,100.0,27.748,86.762,46.396,77.253,22.068,14.684,18.288,22.82,66.706,87.009,67.967,100.0,,55.746,100.0,42.744,29.425,34.794,76.616,71.635,57.383,32.832,93.784,28.132,62.803,63.535,90.638,30.182,42.998,42.0,15.144,67.483,37.61,64.638,16.238,39.943,56.132,83.636,77.95,15.462,100.0,86.4,72.967,34.184,63.976,75.421,45.625,71.91,13.091,61.341,94.056,59.884,58.137,57.96,73.276,58.002,97.671,53.305,73.508,16.917,81.204,32.813,42.124,100.0,18.259,37.303,62.187,94.736,37.1,54.105,17.287,60.348,66.615,55.412,51.758,84.43,21.91,100.0,51.969,54.146,88.281,21.834,35.649,38.673,26.512,47.308,26.374,23.184,54.779,65.524,68.45,50.721,25.478,17.425,67.969,93.553,80.099,49.021,47.412,87.98,43.517,93.861,27.888,23.392,20.981,29.49,60.077,37.395,33.926
2007,44.147,23.113,57.524,48.902,89.308,83.023,90.366,63.739,87.9,28.002,84.822,58.249,52.79,9.864,97.505,41.558,22.996,28.237,71.278,88.488,82.302,44.601,73.273,45.279,100.0,65.082,83.448,32.451,73.892,32.469,57.928,38.339,80.396,73.53,86.9,45.199,46.071,49.746,38.47,61.893,76.816,27.867,59.363,68.174,76.32,90.287,100.0,67.982,73.463,76.378,76.853,67.203,86.293,70.02,65.348,62.104,43.078,33.017,77.74,68.479,16.116,83.168,50.657,77.621,40.341,22.317,83.742,80.479,54.379,48.669,100.0,32.822,53.481,38.934,61.1,75.199,35.883,83.482,47.508,93.822,27.343,100.0,49.905,54.651,44.574,67.421,47.535,51.94,29.906,60.94,68.864,68.873,93.278,91.641,67.974,53.184,82.371,88.146,56.609,22.42,35.287,19.413,44.866,31.744,81.631,100.0,28.316,86.901,46.742,77.437,21.084,14.629,18.272,23.304,66.777,87.409,67.9,100.0,,56.317,100.0,42.713,30.043,35.2,76.92,72.126,57.264,33.612,93.857,28.319,63.139,64.564,90.716,30.364,43.89,41.889,15.235,68.36,38.598,65.306,16.234,40.819,56.328,84.539,78.234,15.781,100.0,86.34,73.527,34.387,64.268,75.803,45.54,72.655,13.073,61.229,93.999,59.962,58.749,58.286,73.491,58.585,97.917,53.436,73.553,16.921,81.427,32.866,42.535,100.0,18.694,37.689,62.774,95.007,34.404,54.328,17.42,61.52,66.547,55.261,51.983,84.588,21.829,100.0,52.285,54.511,88.797,21.868,36.116,39.95,26.514,47.581,26.709,23.227,54.59,65.809,69.053,51.743,26.121,17.899,68.147,93.779,80.269,49.505,47.794,88.006,43.831,94.053,28.504,23.687,20.75,30.051,60.616,37.881,33.743
2008,43.783,23.32,58.282,49.991,89.004,83.387,90.53,63.64,87.799,27.405,84.943,57.966,52.99,10.118,97.555,42.069,23.534,28.968,71.622,88.53,82.343,44.92,73.726,45.262,100.0,65.535,83.749,32.256,74.252,33.236,59.444,38.506,80.578,73.556,86.959,46.539,46.491,50.35,38.976,62.346,77.204,27.886,60.194,69.39,76.413,90.161,100.0,67.839,73.394,76.575,76.899,67.502,86.487,71.3,66.097,62.3,43.058,34.0,77.976,68.351,16.51,83.299,51.146,77.868,40.536,22.311,84.359,80.757,54.765,49.351,100.0,33.106,54.211,39.325,62.745,75.568,35.877,83.787,47.807,93.916,27.105,100.0,50.566,54.819,45.551,67.943,48.335,51.958,30.246,61.141,69.458,68.927,93.395,91.702,68.092,53.371,83.692,89.103,56.682,22.8,35.285,19.571,45.706,31.603,81.733,100.0,28.893,87.042,47.088,77.632,20.131,14.574,18.257,23.796,66.848,87.8,67.834,100.0,,56.886,100.0,42.682,30.67,35.61,77.222,72.613,57.175,34.403,93.929,28.507,63.475,65.581,90.795,30.832,44.788,41.777,15.326,69.225,39.597,65.969,16.229,41.702,56.525,85.402,78.526,16.105,100.0,86.28,74.08,34.59,64.56,76.052,45.455,73.389,13.055,61.116,93.942,60.04,59.359,58.612,73.704,59.166,98.139,53.567,73.598,16.925,81.649,32.919,42.947,100.0,19.138,38.077,63.678,95.264,36.011,54.55,17.555,62.68,66.479,55.111,52.209,84.746,22.045,100.0,52.619,54.875,89.294,21.901,36.587,41.242,26.516,47.868,27.048,23.281,54.402,66.093,69.651,52.765,26.776,18.384,68.325,93.998,80.438,49.989,48.18,88.031,44.152,94.239,29.128,23.985,20.524,30.619,61.154,38.371,33.56
2009,43.421,23.528,59.034,51.076,88.912,83.742,90.691,63.54,87.697,26.818,85.063,57.683,53.19,10.376,97.603,42.58,24.079,29.709,71.963,88.579,82.385,45.239,74.172,45.245,100.0,65.984,84.044,32.063,74.608,34.01,60.937,38.694,80.758,73.581,87.017,47.88,46.91,50.954,39.491,62.8,77.587,27.921,61.016,70.575,76.505,90.034,100.0,67.695,73.324,76.771,76.944,67.799,86.654,72.542,66.826,62.495,43.039,34.585,78.21,68.223,16.91,83.429,51.658,78.117,40.731,22.305,84.955,81.031,55.15,50.031,100.0,33.391,54.937,39.716,64.358,75.932,35.871,84.087,48.104,94.008,26.869,100.0,51.225,54.987,46.528,68.46,49.134,51.976,30.587,61.342,70.045,68.98,93.511,91.763,68.209,53.557,84.928,89.989,56.755,23.183,35.284,19.93,46.547,31.463,81.835,100.0,29.475,87.187,47.445,77.837,19.213,14.519,18.242,24.293,66.842,88.178,67.814,100.0,,57.452,100.0,42.651,31.301,36.021,77.52,73.093,57.117,35.2,94.001,28.695,63.808,66.58,90.872,31.328,45.686,41.666,15.429,70.075,40.601,66.624,16.225,42.588,56.721,86.288,78.815,16.434,100.0,86.22,74.624,34.793,64.851,76.241,45.371,74.109,13.037,61.004,93.884,60.195,59.964,58.937,73.923,59.742,98.336,53.698,73.642,16.93,81.867,32.993,43.359,100.0,19.589,38.466,64.57,95.508,37.645,54.772,17.701,63.823,66.412,54.96,52.433,84.902,22.262,100.0,52.969,55.237,89.77,21.934,37.058,42.543,26.518,48.172,27.389,23.335,54.213,66.376,70.241,53.782,27.439,18.878,68.502,94.209,80.606,50.472,48.569,88.057,44.479,94.419,29.762,24.286,20.3,31.194,61.687,38.861,33.378
2010,43.059,23.737,59.783,52.163,88.819,84.087,90.849,63.44,87.594,26.238,85.182,57.399,53.406,10.642,97.651,43.093,24.633,30.462,72.302,88.634,82.427,45.558,74.672,45.228,100.0,66.43,84.335,31.87,74.961,34.793,62.412,38.904,80.937,73.607,87.074,49.226,47.33,51.559,40.013,63.256,77.964,27.973,61.821,71.736,76.597,89.905,100.0,67.551,73.255,76.966,76.999,68.094,86.795,73.753,67.54,62.69,43.019,35.175,78.442,68.094,17.319,83.77,52.171,78.369,40.926,22.298,85.533,81.302,55.535,50.713,100.0,33.678,55.662,40.111,65.94,76.292,35.865,84.383,48.403,94.099,26.634,100.0,51.885,55.155,47.509,68.911,49.914,51.994,30.93,61.542,70.626,69.103,93.574,91.826,68.327,53.743,86.088,90.812,56.827,23.571,35.306,20.294,47.39,31.322,81.936,100.0,30.064,87.334,47.813,78.052,18.45,14.464,18.226,24.798,66.757,88.547,67.841,100.0,,58.018,100.0,42.62,31.938,36.434,77.815,73.568,57.089,35.999,94.072,28.885,64.14,67.567,90.949,31.83,46.588,41.555,15.544,70.912,41.616,67.102,16.221,43.48,56.917,87.134,79.102,16.768,100.0,86.16,75.161,34.997,65.14,76.43,45.332,74.817,13.019,60.892,93.825,60.377,60.567,59.261,74.149,60.317,98.501,53.829,73.687,16.934,82.084,33.089,43.773,100.0,20.048,38.856,65.452,95.74,39.31,54.993,17.86,64.952,66.344,54.685,52.658,85.056,22.48,100.0,53.336,55.6,90.228,21.985,37.533,43.856,26.52,48.491,27.732,23.389,54.025,66.657,70.825,54.796,28.114,19.383,68.596,94.414,80.772,50.956,48.961,88.083,44.814,94.594,30.417,24.462,20.078,31.776,62.218,39.355,33.196
2011,42.94,23.948,60.528,53.247,88.726,84.423,90.99,63.34,87.502,25.703,85.3,57.115,53.637,10.915,97.698,43.608,25.196,31.225,72.638,88.695,82.476,45.878,75.188,45.228,100.0,66.874,84.631,31.7,75.31,35.585,63.865,39.135,81.096,73.631,87.132,50.511,47.751,52.164,40.544,63.712,78.335,28.04,62.322,72.868,76.689,89.775,100.0,67.406,73.185,77.16,77.064,68.389,86.957,74.827,68.236,62.851,43.0,35.771,78.673,67.965,17.735,84.313,52.683,78.622,41.088,22.305,86.092,81.57,55.919,51.394,100.0,33.966,56.384,40.508,67.488,76.649,35.859,84.755,48.701,94.188,26.4,100.0,52.543,55.322,48.492,69.358,50.595,52.012,31.276,61.742,71.2,69.268,93.587,91.892,68.444,53.93,87.172,91.069,56.9,23.969,35.352,20.663,48.235,31.182,81.923,100.0,30.66,87.484,48.193,78.277,18.45,14.41,18.211,25.31,66.741,88.906,67.869,100.0,,58.581,100.0,42.589,32.58,36.849,78.111,74.038,57.092,36.799,94.141,29.075,64.472,67.963,91.028,32.336,47.493,41.444,15.672,71.609,42.637,67.565,16.216,44.366,57.113,87.879,79.455,17.108,100.0,86.1,76.183,35.202,65.437,76.617,45.522,75.511,13.0,60.78,93.773,60.557,61.167,59.584,74.381,60.889,98.602,53.96,73.732,16.938,82.302,33.207,44.188,100.0,20.508,39.248,66.325,95.961,41.0,55.215,18.032,66.064,66.276,54.42,52.883,85.297,22.7,100.0,53.72,54.58,90.668,22.054,38.032,44.698,26.521,48.825,28.079,23.443,53.836,66.938,71.402,55.807,28.798,19.898,68.689,94.612,80.944,51.15,49.356,88.108,45.154,94.761,31.08,24.561,19.857,32.364,62.746,39.851,33.015
2012,42.957,24.16,61.268,54.33,88.631,84.749,91.121,63.24,87.42,25.526,85.402,57.147,53.883,11.194,97.744,44.125,25.767,31.993,72.975,88.762,82.532,46.199,75.697,45.246,100.0,67.315,84.923,31.553,75.656,36.371,64.768,39.388,81.137,73.653,87.189,51.765,48.172,52.769,41.082,64.169,78.701,28.123,62.821,73.946,76.781,89.654,100.0,67.261,73.197,77.17,77.138,68.685,87.142,75.802,68.915,62.988,42.946,,78.902,67.974,18.16,84.841,53.196,78.878,41.225,22.324,86.634,81.837,56.303,52.073,100.0,34.255,57.105,40.908,69.0,77.004,35.869,85.2,49.0,94.277,26.4,100.0,53.202,55.506,49.477,69.678,51.276,52.046,31.634,61.942,71.755,69.432,93.6,91.96,68.684,54.132,88.185,91.148,56.973,24.376,35.423,21.037,49.082,31.062,81.851,100.0,31.264,87.636,48.583,78.512,18.45,14.367,18.196,25.704,66.864,89.249,67.897,100.0,,59.142,100.0,42.558,33.227,37.267,78.405,74.498,57.125,37.599,94.211,29.266,64.804,68.03,91.108,32.846,48.4,41.332,15.812,72.275,43.693,68.024,16.212,45.246,57.309,88.588,79.874,17.458,100.0,86.161,77.564,35.408,65.741,76.804,45.712,76.194,12.982,60.654,93.726,60.738,61.763,59.907,74.619,61.459,98.697,53.974,73.791,16.943,82.52,33.346,44.603,100.0,20.97,39.642,67.187,96.171,41.558,55.356,18.217,67.16,66.208,54.28,53.108,85.62,22.849,100.0,54.12,53.555,91.09,22.142,38.546,45.445,26.545,49.175,28.428,23.435,53.671,67.218,71.974,56.815,29.493,20.424,68.782,94.739,81.119,51.05,49.754,88.123,45.502,94.919,31.752,24.661,19.624,32.958,63.272,40.354,32.834
2013,42.99,24.373,62.002,55.387,88.537,85.066,91.249,63.164,87.348,25.35,85.502,57.336,54.145,11.482,97.789,44.642,26.346,32.762,73.313,88.835,82.596,46.519,76.199,45.282,100.0,67.699,85.209,31.429,75.997,37.149,65.572,39.663,81.178,73.674,87.246,53.013,48.593,53.373,41.627,64.627,79.061,28.223,63.317,74.97,76.827,89.544,100.0,67.137,73.29,77.18,77.222,68.982,87.292,76.749,69.576,63.125,42.893,,79.133,68.122,18.575,85.125,53.706,79.135,41.363,22.355,87.156,82.102,56.685,52.748,100.0,34.545,57.82,41.31,69.544,77.355,35.896,85.551,49.311,94.364,26.4,100.0,53.858,55.706,50.46,69.953,51.955,52.096,32.003,62.141,72.295,69.595,93.633,92.031,68.979,54.35,89.125,91.226,57.046,24.794,35.517,21.415,49.927,30.964,81.779,100.0,31.872,87.79,48.985,78.756,18.461,14.334,18.198,26.101,66.986,89.574,67.925,100.0,,59.7,100.0,42.527,33.878,37.685,78.699,74.946,57.189,38.398,94.279,29.457,65.137,68.097,91.19,33.36,49.306,41.222,15.966,72.93,44.756,68.479,16.208,46.118,57.505,89.187,80.286,17.815,100.0,86.221,78.882,35.613,66.052,76.989,45.903,76.862,12.978,60.529,93.686,60.918,62.352,60.197,74.863,61.583,98.785,53.937,73.863,16.947,82.74,33.507,45.019,100.0,21.433,40.036,68.036,96.37,42.117,55.469,18.415,68.208,66.14,54.14,53.332,85.936,22.999,100.0,54.537,52.529,91.483,22.248,39.061,46.193,26.589,49.541,28.779,23.382,53.53,67.495,72.531,57.814,30.196,20.958,68.875,94.843,81.299,50.95,50.154,88.133,45.856,95.07,32.429,24.761,19.385,33.559,63.793,40.865,32.654
2014,43.041,24.587,62.731,56.423,88.441,85.375,91.377,63.112,87.288,25.175,85.602,57.526,54.422,11.776,97.833,45.166,26.934,33.535,73.651,88.915,82.668,46.84,76.693,45.335,100.0,68.047,85.492,31.328,76.332,37.918,66.368,39.959,81.218,73.696,87.303,54.259,49.014,53.976,42.18,65.085,79.415,28.338,63.81,75.941,76.861,89.443,100.0,67.031,73.384,77.19,77.314,69.28,87.41,77.67,70.221,63.261,42.839,,79.366,68.269,18.998,85.175,54.216,79.394,41.501,22.399,87.651,82.365,57.067,53.419,100.0,34.836,58.528,41.715,70.083,77.702,35.938,85.813,49.634,94.449,26.414,100.0,54.514,55.923,51.444,70.227,52.635,52.162,32.384,62.34,72.83,69.758,93.667,92.104,69.272,54.584,90.0,91.304,57.118,25.221,35.635,21.799,50.773,30.885,81.707,100.0,32.487,87.947,49.397,79.009,18.482,14.313,18.218,26.502,67.108,89.884,67.952,100.0,,60.256,100.0,42.496,34.534,38.106,78.993,75.384,57.284,39.196,94.347,29.65,65.471,68.163,91.273,33.878,50.203,41.111,16.132,73.577,45.826,68.931,16.219,46.982,57.7,89.69,80.692,18.182,100.0,86.281,80.145,35.819,66.371,77.173,46.093,77.517,12.988,60.403,93.651,61.098,62.936,60.474,75.113,61.633,98.868,53.9,73.95,16.967,82.96,33.689,45.436,100.0,21.896,40.432,68.874,96.559,42.679,55.583,18.626,69.213,66.089,54.0,53.557,86.247,23.149,100.0,54.969,51.5,91.851,22.372,39.579,46.943,26.655,49.921,29.133,23.328,53.413,67.772,73.077,58.786,30.904,21.504,68.968,94.945,81.483,50.85,50.558,88.144,46.216,95.213,33.115,24.861,19.149,34.165,64.312,41.382,32.504
2015,43.108,24.803,63.446,57.434,88.345,85.674,91.503,63.085,87.238,25.0,85.701,57.715,54.714,12.078,97.876,45.695,27.53,34.308,73.99,88.999,82.746,47.173,77.181,45.406,100.0,68.393,85.77,31.249,76.663,38.678,67.155,40.277,81.259,73.718,87.36,55.5,49.444,54.578,42.74,65.543,79.764,28.47,64.3,76.862,76.896,89.352,100.0,66.946,73.477,77.2,77.417,69.579,87.526,78.566,70.848,63.398,42.785,,79.602,68.416,19.428,85.225,54.726,79.655,41.638,22.456,88.118,82.626,57.448,54.086,100.0,35.141,59.228,42.123,70.616,78.046,35.997,86.071,49.971,94.534,26.441,100.0,55.165,56.155,52.427,70.5,53.313,52.245,32.777,62.538,73.358,69.921,93.7,92.179,69.565,54.833,90.256,91.381,57.191,25.658,35.777,22.188,51.619,30.827,81.634,100.0,33.108,88.106,49.82,79.27,18.515,14.303,18.256,26.908,67.23,90.179,67.98,100.0,,60.809,100.0,42.49,35.193,38.529,79.285,75.811,57.408,39.991,94.414,29.858,65.806,68.23,91.357,34.4,51.089,41.0,16.313,74.213,46.9,69.379,16.247,47.838,57.895,90.173,81.091,18.557,100.0,86.341,81.35,36.026,66.696,77.357,46.284,78.159,13.012,60.278,93.624,61.277,63.514,60.75,75.368,61.683,98.945,53.887,74.05,17.004,83.18,33.894,45.862,100.0,22.36,40.829,69.7,96.739,43.245,55.696,18.852,70.174,66.056,53.889,53.781,86.553,23.3,100.0,55.4,52.168,92.195,22.515,40.1,47.694,26.742,50.317,29.49,23.275,53.319,68.056,73.611,59.73,31.617,22.06,69.061,95.045,81.671,50.75,50.964,88.154,46.583,95.35,33.809,24.961,18.914,34.777,64.828,41.907,32.385
2016,43.192,25.02,64.149,58.421,88.248,85.965,91.627,63.082,87.198,24.846,85.8,57.905,55.021,12.388,97.919,46.229,28.134,35.083,74.329,89.09,82.832,47.518,77.661,45.495,100.0,68.738,86.042,31.193,76.99,39.428,67.933,40.618,81.3,73.739,87.422,56.736,49.881,55.179,43.307,66.001,80.108,28.619,64.784,77.735,76.93,89.272,100.0,66.881,73.57,77.224,77.528,69.88,87.642,79.436,71.459,63.534,42.732,,79.84,68.563,19.866,85.275,55.235,79.917,41.777,22.526,88.559,82.886,57.837,54.749,100.0,35.46,59.918,42.533,71.138,78.387,36.072,86.326,50.319,94.617,26.482,100.0,55.813,56.403,53.396,70.779,53.989,52.343,33.182,62.737,73.88,70.094,93.735,92.256,69.855,55.098,90.506,91.457,57.264,26.105,35.944,22.582,52.45,30.79,81.562,100.0,33.736,88.266,50.254,79.54,18.558,14.303,18.311,27.317,67.366,90.46,68.021,100.0,,61.36,100.0,42.511,35.856,38.954,79.577,76.228,57.563,40.783,94.48,30.082,66.141,68.297,91.443,34.926,51.962,40.91,16.506,74.84,47.961,69.821,16.29,48.683,58.09,90.635,81.485,18.942,100.0,86.4,82.5,36.234,67.027,77.539,46.475,78.775,13.05,60.178,93.602,61.471,64.086,61.026,75.628,61.734,99.015,53.9,74.164,17.056,83.401,34.121,46.296,100.0,22.823,41.228,70.501,96.91,43.816,55.81,19.092,71.092,66.04,53.806,54.02,86.852,23.459,100.0,55.831,52.835,92.517,22.677,40.628,48.448,26.851,50.728,29.85,23.222,53.25,68.346,74.134,60.645,32.333,22.624,69.154,95.144,81.862,50.65,51.373,88.165,46.957,95.48,34.51,25.062,18.681,35.394,65.341,42.438,32.296
2017,43.293,25.25,64.839,59.383,88.15,86.248,91.749,63.103,87.17,24.713,85.904,58.094,55.343,12.706,97.961,46.768,28.743,35.858,74.669,89.186,82.925,47.876,78.134,45.601,100.0,69.08,86.309,31.159,77.312,40.167,68.7,40.98,81.35,73.761,87.49,57.96,50.326,55.777,43.88,66.459,80.446,28.784,65.261,78.56,76.977,89.203,100.0,66.836,73.675,77.261,77.648,70.181,87.757,80.277,72.052,63.67,42.705,,80.08,68.717,20.31,85.325,55.742,80.18,41.914,22.608,88.976,83.143,58.231,55.407,100.0,35.793,60.599,42.945,71.646,78.724,36.164,86.574,50.68,94.699,26.538,100.0,56.457,56.667,54.346,71.062,54.659,52.458,33.6,62.947,74.394,70.278,93.773,92.336,70.144,55.378,90.747,91.535,57.336,26.562,36.135,22.98,53.262,30.773,81.503,100.0,34.368,88.429,50.697,79.817,18.612,14.315,18.384,27.73,67.516,90.727,68.075,100.0,,61.908,100.0,42.557,36.522,39.38,79.867,76.634,57.748,41.572,94.546,30.322,66.477,68.363,91.53,35.455,52.824,40.841,16.714,75.447,49.005,70.256,16.35,49.519,58.299,91.077,81.871,19.336,100.0,86.466,83.56,36.442,67.365,77.72,46.682,79.365,13.102,60.105,93.587,61.678,64.652,61.3,75.894,61.784,99.078,53.936,74.292,17.125,83.622,34.37,46.74,100.0,23.286,41.636,71.275,97.072,44.391,55.942,19.346,71.968,66.041,53.751,54.273,87.146,23.625,100.0,56.261,53.5,92.817,22.858,41.162,49.2,26.982,51.153,30.212,23.169,53.205,68.642,74.644,61.53,33.053,23.196,69.246,95.24,82.058,50.55,51.784,88.183,47.337,95.603,35.213,25.163,18.452,36.016,65.85,42.976,32.237
2018,43.411,25.495,65.514,60.319,88.062,86.522,91.87,63.149,87.153,24.599,86.012,58.297,55.68,13.032,98.001,47.312,29.358,36.632,75.008,89.287,83.025,48.245,78.595,45.724,100.0,69.425,86.569,31.147,77.629,40.895,69.446,41.364,81.411,73.797,87.564,59.152,50.779,56.374,44.46,66.916,80.778,28.965,65.732,79.34,77.037,89.145,100.0,66.81,73.792,77.312,77.777,70.483,87.874,81.074,72.629,63.821,42.704,,80.321,68.88,20.763,85.382,56.248,80.444,42.064,22.703,89.37,83.398,58.632,56.06,100.0,36.14,61.27,43.36,72.143,79.058,36.272,86.816,51.054,94.78,26.606,100.0,57.096,56.947,55.278,71.351,55.325,52.588,34.03,63.17,74.898,70.473,93.813,92.418,70.438,55.674,90.979,91.616,57.428,27.03,36.351,23.388,54.057,30.776,81.459,100.0,35.004,88.593,51.151,80.102,18.678,14.338,18.476,28.153,67.679,90.981,68.142,100.0,,62.453,100.0,42.629,37.191,39.808,80.156,77.031,57.963,42.356,94.612,30.579,66.813,68.445,91.618,35.988,53.672,40.793,16.937,76.036,50.032,70.683,16.425,50.344,58.522,91.49,82.248,19.74,100.0,86.538,84.539,36.666,67.709,77.907,46.907,79.93,13.169,60.058,93.578,61.899,65.211,61.585,76.164,61.834,99.135,53.998,74.433,17.211,83.844,34.642,47.192,100.0,23.749,42.055,72.023,97.226,44.971,56.092,19.615,72.803,66.06,53.726,54.541,87.431,23.799,100.0,56.691,54.162,93.098,23.059,41.702,49.949,27.134,51.593,30.578,23.131,53.184,68.945,75.143,62.387,33.776,23.774,69.352,95.334,82.256,50.478,52.198,88.208,47.723,95.721,35.919,25.274,18.243,36.642,66.355,43.521,32.209
2019,,,,,,,,,,,,,,,,,,,,,,,,,,,,,,,,,,,,,,,,,,,,,,,,,,,,,,,,,,,,,,,,,,,,,,,,,,,,,,,,,,,,,,,,,,,,,,,,,,,,,,,,,,,,,,,,,,,,,,,,,,,,,,,,,,,,,,,,,,,,,,,,,,,,,,,,,,,,,,,,,,,,,,,,,,,,,,,,,,,,,,,,,,,,,,,,,,,,,,,,,,,,,,,,,,,,,,,
