<svg height="511pt" viewBox="0 -71 511.99859 511" width="511pt" xmlns="http://www.w3.org/2000/svg">
<path d="m4.433594 203.871094c45.058594 90.800781 130.589844 157.6875 233.546875 164.792968 4.113281.269532 7.714843-2.835937 8-6.96875.285156-4.128906-2.835938-7.710937-6.96875-8-61.578125-4.246093-118.609375-31.320312-163.316407-75.695312 52.777344 38.605469 116.816407 57.617188 180.304688 57.617188 66.132812 0 129.542969-20.484376 180.300781-57.613282-44.707031 44.371094-101.738281 71.445313-163.316406 75.691406-4.132813.285157-7.253906 3.867188-6.96875 8 .273437 3.960938 3.570313 6.988282 7.476563 6.988282.175781 0 .351562-.007813.523437-.019532 103.027344-7.109374 188.507813-74.03125 233.546875-164.792968 6.074219-12.242188 5.75-26.363282 0-37.949219-50.632812-102.035156-147.027344-165.421875-251.5625-165.421875-104.539062 0-200.929688 63.386719-251.566406 165.421875-5.921875 11.9375-5.898438 26.054687 0 37.949219zm492.023437-24.378906c.039063.207031.085938.414062.125.621093.003907.035157.011719.066407.015625.097657.527344 3.101562.527344 6.277343 0 9.378906-.003906.027344-.011718.054687-.015625.082031-.035156.210937-.085937.421875-.125.628906-30.242187 51.203125-78.535156 90.03125-135.695312 111.488281 28.066406-25.1875 46.644531-60.070312 51.128906-98.519531.480469-4.113281-2.464844-7.839843-6.582031-8.320312-4.117188-.472657-7.835938 2.464843-8.316406 6.582031-5.871094 50.320312-38.4375 93.886719-85.074219 113.890625-36.171875 6.785156-74.382813 7.011719-111.832031 0-114.597657-49.140625-114.417969-211.984375 0-261.046875 36.996093-6.929688 75.414062-6.859375 111.828124 0 46.640626 20 79.203126 63.566406 85.074219 113.890625.480469 4.113281 4.210938 7.054687 8.320313 6.582031 4.113281-.480468 7.0625-4.207031 6.582031-8.320312-4.488281-38.453125-23.066406-73.335938-51.128906-98.519532 57.160156 21.453126 105.453125 60.28125 135.695312 111.484376zm-240.457031-163.992188c66.921875 0 130.371094 27.625 179.292969 75.558594-50.871094-36.871094-113.953125-56.882813-179.292969-56.882813-65.984375 0-128.933594 20.382813-179.296875 56.882813 48.925781-47.933594 112.375-75.558594 179.296875-75.558594zm-240.457031 163.996094c30.210937-51.160156 78.449219-89.960938 135.539062-111.429688-69.4375 62.296875-69.3125 171.476563.003907 233.664063-57.09375-21.46875-105.332032-60.273438-135.542969-111.429688-.695313-3.53125-.742188-7.027343 0-10.804687zm0 0"/>
<path d="m256 61.332031c-68.132812 0-123.566406 55.429688-123.566406 123.566407 0 68.132812 55.433594 123.5625 123.566406 123.5625s123.566406-55.429688 123.566406-123.5625c0-68.136719-55.433594-123.566407-123.566406-123.566407zm0 232.128907c-59.863281 0-108.5625-48.699219-108.5625-108.5625 0-59.863282 48.699219-108.5625 108.5625-108.5625s108.5625 48.699218 108.5625 108.5625c0 59.863281-48.699219 108.5625-108.5625 108.5625zm0 0"/>
<path d="m262.878906 96.363281h-13.757812c-11.722656 0-21.261719 9.539063-21.261719 21.261719v75.679688c0 11.722656 9.539063 21.261718 21.261719 21.261718h13.757812c11.722656 0 21.261719-9.539062 21.261719-21.261718v-75.679688c0-11.722656-9.539063-21.261719-21.261719-21.261719zm6.261719 96.941407c0 3.453124-2.808594 6.261718-6.261719 6.261718h-13.757812c-3.453125 0-6.261719-2.808594-6.261719-6.261718v-75.679688c0-3.449219 2.808594-6.257812 6.261719-6.257812h13.757812c3.453125 0 6.261719 2.808593 6.261719 6.257812zm0 0"/>
<path d="m256 218.832031c-15.519531 0-28.140625 12.625-28.140625 28.140625s12.621094 28.140625 28.140625 28.140625c15.515625 0 28.140625-12.625 28.140625-28.140625s-12.625-28.140625-28.140625-28.140625zm0 41.28125c-7.246094 0-13.140625-5.894531-13.140625-13.140625s5.894531-13.136718 13.140625-13.136718c7.242188 0 13.140625 5.894531 13.140625 13.136718 0 7.246094-5.894531 13.140625-13.140625 13.140625zm0 0"/>
</svg>
