{
  "resourceType": "Group",
  "id": "1",
  "meta": {
    "profile": [
      "https://fhir.eds.aphp.fr/StructureDefinition/GroupEDS"
    ]
  },
  "actual": true,
  "type": "person | encounter",
  "quantity": 25,
  "name": "John's cohort",
  "code": {
    "coding": [
      {
        "code": "cohort",
        "system": "http://terminology.hl7.org/CodeSystem/cohort-code"
      }
    ]
  },
  "characteristic": [
    {
      "code": {
        "text": "gender"
      },
      "exclude": false,
      "valueCodeableConcept": {
        "text": "mixed"
      }
    },
    {
      "code": {
        "text": "owner"
      },
      "exclude": false,
      "valueCodeableConcept": {
        "text": "John Smith"
      }
    }
  ],
  "member": [
    {
      "entity": {
        "reference": "Patient/1"
      }
    },
    {
      "entity": {
        "reference": "Patient/2",
        "period": {
          "start": "2018-02-20T07:42:00+01:00",
          "end": "2018-12-31T11:10:00+01:00"
        },
        "inactive": true
      }
    }
  ]
}