{
	"OVERWRITE": [
		{
			"superType": "fr.aphp.wind.uima.type.PatientFirstName",
			"supraTypes": [
				 "fr.aphp.wind.uima.type.PatientFamilyName"
				, "fr.aphp.wind.uima.type.PatientNbIpp"
				, "fr.aphp.wind.uima.type.PatientBirthDate"
				, "fr.aphp.wind.uima.type.PatientDeathDate"
				, "fr.aphp.wind.uima.type.PatientZipCodeLive"
				, "fr.aphp.wind.uima.type.PatientCityLive"
				, "fr.aphp.wind.uima.type.PatientStreetNameLive"
				, "fr.aphp.wind.uima.type.PatientPhoneNumber"
				, "fr.aphp.wind.uima.type.PatientNbNda"
				, "fr.aphp.wind.uima.type.GeneralDate"
				, "fr.aphp.wind.uima.type.GeneralLastName"
				, "fr.aphp.wind.uima.type.GeneralLastNameRegex"
				, "fr.aphp.wind.uima.type.GeneralFirstNameRegex"
				, "fr.aphp.wind.uima.type.GeneralCity"
				, "fr.aphp.wind.uima.type.GeneralZipCode"
				, "fr.aphp.wind.uima.type.GeneralFirstName"
				, "fr.aphp.wind.uima.type.PhysicianLastName"
				, "fr.aphp.wind.uima.type.PhysicianFirstName"
			]
		}
		,{
			"superType": "fr.aphp.wind.uima.type.PatientLastName",
			"supraTypes": [
				 "fr.aphp.wind.uima.type.PatientFamilyName"
				, "fr.aphp.wind.uima.type.PatientNbIpp"
				, "fr.aphp.wind.uima.type.PatientBirthDate"
				, "fr.aphp.wind.uima.type.PatientDeathDate"
				, "fr.aphp.wind.uima.type.PatientZipCodeLive"
				, "fr.aphp.wind.uima.type.PatientCityLive"
				, "fr.aphp.wind.uima.type.PatientStreetNameLive"
				, "fr.aphp.wind.uima.type.PatientPhoneNumber"
				, "fr.aphp.wind.uima.type.PatientNbNda"
				, "fr.aphp.wind.uima.type.GeneralDate"
				, "fr.aphp.wind.uima.type.GeneralLastName"
				, "fr.aphp.wind.uima.type.GeneralLastNameRegex"
				, "fr.aphp.wind.uima.type.GeneralFirstNameRegex"
				, "fr.aphp.wind.uima.type.GeneralCity"
				, "fr.aphp.wind.uima.type.GeneralZipCode"
				, "fr.aphp.wind.uima.type.GeneralFirstName"
				, "fr.aphp.wind.uima.type.PhysicianLastName"
				, "fr.aphp.wind.uima.type.PhysicianFirstName"
			]
		}
		,{
			"superType": "de.unihd.dbs.uima.types.heideltime.Timex3",
			"supraTypes": [
				 "fr.aphp.wind.uima.type.GeneralLastName"
				, "fr.aphp.wind.uima.type.GeneralLastNameRegex"
				, "fr.aphp.wind.uima.type.GeneralFirstNameRegex"
				, "fr.aphp.wind.uima.type.GeneralCity"
				, "fr.aphp.wind.uima.type.GeneralZipCode"
				, "fr.aphp.wind.uima.type.GeneralFirstName"
				, "fr.aphp.wind.uima.type.PhysicianLastName"
				, "fr.aphp.wind.uima.type.PhysicianFirstName"
			]
		}
		,{
			"superType": "fr.aphp.wind.uima.type.PatientNbNda",
			"supraTypes": [
				 "fr.aphp.wind.uima.type.PatientNbIpp"
				 ,"fr.aphp.wind.uima.type.GeneralDate"
				 ,"fr.aphp.wind.uima.type.GeneralNbNda"
				 ,"fr.aphp.wind.uima.type.GeneralNbIpp"
			]
		}
		,{
			"superType": "fr.aphp.wind.uima.type.GeneralStreet",
			"supraTypes": [
				 "fr.aphp.wind.uima.type.GeneralLastNameRegex"
				, "fr.aphp.wind.uima.type.GeneralFirstNameRegex"
				, "fr.aphp.wind.uima.type.GeneralCity"
				, "fr.aphp.wind.uima.type.GeneralDate"
				, "fr.aphp.wind.uima.type.GeneralLastName"
				, "fr.aphp.wind.uima.type.GeneralZipCode"
				, "fr.aphp.wind.uima.type.GeneralFirstName"
				, "fr.aphp.wind.uima.type.PhysicianLastName"
				, "fr.aphp.wind.uima.type.PhysicianFirstName"
			]
		}
		,{
			"superType": "fr.aphp.wind.uima.type.PatientStreetNameLive",
			"supraTypes": [
				 "fr.aphp.wind.uima.type.GeneralStreet"
				, "fr.aphp.wind.uima.type.GeneralCity"
				, "fr.aphp.wind.uima.type.GeneralDate"
				, "fr.aphp.wind.uima.type.GeneralLastName"
				, "fr.aphp.wind.uima.type.GeneralLastNameRegex"
				, "fr.aphp.wind.uima.type.GeneralFirstNameRegex"
				, "fr.aphp.wind.uima.type.GeneralCity"
				, "fr.aphp.wind.uima.type.GeneralZipCode"
				, "fr.aphp.wind.uima.type.GeneralFirstName"
				, "fr.aphp.wind.uima.type.PhysicianLastName"
				, "fr.aphp.wind.uima.type.PhysicianFirstName"
			]
		}
		,{
			"superType": "fr.aphp.wind.uima.type.PatientPhoneNumber",
			"supraTypes": [
				 "fr.aphp.wind.uima.type.PatientNbNda"
				 , "fr.aphp.wind.uima.type.GeneralNbNda"
				 , "fr.aphp.wind.uima.type.PatientNbIpp"
				 , "fr.aphp.wind.uima.type.GeneralPhoneNumber"
				 , "fr.aphp.wind.uima.type.GeneralDate"
				 , "fr.aphp.wind.uima.type.GeneralDateRegex"
			]
		}
		,{
			"superType": "fr.aphp.wind.uima.type.PatientBirthDate",
			"supraTypes": [
				"fr.aphp.wind.uima.type.GeneralDate"
				, "fr.aphp.wind.uima.type.GeneralDateRegex"
			]
		}
		,{
			"superType": "fr.aphp.wind.uima.type.GeneralCity",
			"supraTypes": [
				"fr.aphp.wind.uima.type.GeneralFirstName"
				, "fr.aphp.wind.uima.type.GeneralLastName"
				, "fr.aphp.wind.uima.type.PhysicianLastName"
				, "fr.aphp.wind.uima.type.PhysicianFirstName"
				, "fr.aphp.wind.uima.type.AphpHospital"
			]
		}
		,{
			"superType": "fr.aphp.wind.uima.type.GeneralDateRegex",
			"supraTypes": [
				"fr.aphp.wind.uima.type.GeneralDate"
			]
		}
		,{
			"superType": "fr.aphp.wind.uima.type.GeneralService",
			"supraTypes": [
				  "fr.aphp.wind.uima.type.GeneralLastNameRegex"
				, "fr.aphp.wind.uima.type.GeneralFirstNameRegex"
				, "fr.aphp.wind.uima.type.GeneralLastName"
				, "fr.aphp.wind.uima.type.GeneralFirstName"
				, "fr.aphp.wind.uima.type.PhysicianLastName"
				, "fr.aphp.wind.uima.type.PhysicianFirstName"
			]
		}
		,{
			"superType": "fr.aphp.wind.uima.type.GeneralUcum",
			"supraTypes": [
				  "fr.aphp.wind.uima.type.GeneralLastNameRegex"
				, "fr.aphp.wind.uima.type.GeneralFirstNameRegex"
				, "fr.aphp.wind.uima.type.GeneralLastName"
				, "fr.aphp.wind.uima.type.GeneralFirstName"
				, "fr.aphp.wind.uima.type.PhysicianLastName"
				, "fr.aphp.wind.uima.type.PhysicianFirstName"
			]
		}
		,{
			"superType": "fr.aphp.wind.uima.type.PatientCityLive",
			"supraTypes": [
				"fr.aphp.wind.uima.type.GeneralFirstName"
				, "fr.aphp.wind.uima.type.GeneralCity"
				, "fr.aphp.wind.uima.type.GeneralLastName"
				, "fr.aphp.wind.uima.type.GeneralFirstName"
			]
		}
		,{
			"superType": "fr.aphp.wind.uima.type.PatientDeathDate",
			"supraTypes": [
				"fr.aphp.wind.uima.type.GeneralDate"
			]
		}
		,{
			"superType": "fr.aphp.wind.uima.type.PatientZipCodeLive",
			"supraTypes": [
				"fr.aphp.wind.uima.type.GeneralZipCode"
			]
		}
		,{
			"superType": "fr.aphp.wind.uima.type.GeneralPhoneNumber",
			"supraTypes": [
				"fr.aphp.wind.uima.type.GeneralNbNda"
				, "fr.aphp.wind.uima.type.GeneralDate"
				, "fr.aphp.wind.uima.type.GeneralDateRegex"
			]
		}
		,{
			"superType": "fr.aphp.wind.uima.type.NoteHeader",
			"supraTypes": [
				"fr.aphp.wind.uima.type.PatientFirstName"
				, "fr.aphp.wind.uima.type.PatientLastName"
				, "fr.aphp.wind.uima.type.PatientFamilyName"
				, "fr.aphp.wind.uima.type.PatientNbIpp"
				, "fr.aphp.wind.uima.type.PatientBirthDate"
				, "fr.aphp.wind.uima.type.PatientDeathDate"
				, "fr.aphp.wind.uima.type.GeneralStreet"
				, "fr.aphp.wind.uima.type.PatientZipCodeLive"
				, "fr.aphp.wind.uima.type.PatientCityLive"
				, "fr.aphp.wind.uima.type.PatientStreetNameLive"
				, "fr.aphp.wind.uima.type.PatientPhoneNumber"
				, "fr.aphp.wind.uima.type.PatientNbNda"
				, "fr.aphp.wind.uima.type.GeneralDate"
				, "fr.aphp.wind.uima.type.GeneralLastName"
				, "fr.aphp.wind.uima.type.GeneralLastNameRegex"
				, "fr.aphp.wind.uima.type.GeneralFirstNameRegex"
				, "fr.aphp.wind.uima.type.GeneralDateRegex"
				, "fr.aphp.wind.uima.type.GeneralCity"
				, "fr.aphp.wind.uima.type.GeneralPhoneNumber"
				, "fr.aphp.wind.uima.type.GeneralZipCode"
				, "fr.aphp.wind.uima.type.GeneralFirstName"
				, "fr.aphp.wind.uima.type.PhysicianLastName"
				, "fr.aphp.wind.uima.type.PhysicianFirstName"
				, "fr.aphp.wind.uima.type.AphpHospital"
				, "fr.aphp.wind.uima.type.GeneralEMail"
			]
		}
		,{
			"superType": "fr.aphp.wind.uima.type.NoteFooter",
			"supraTypes": [
				  "fr.aphp.wind.uima.type.PatientFirstName"
				, "fr.aphp.wind.uima.type.PatientLastName"
				, "fr.aphp.wind.uima.type.PatientFamilyName"
				, "fr.aphp.wind.uima.type.PatientNbIpp"
				, "fr.aphp.wind.uima.type.PatientBirthDate"
				, "fr.aphp.wind.uima.type.PatientDeathDate"
				, "fr.aphp.wind.uima.type.GeneralStreet"
				, "fr.aphp.wind.uima.type.PatientZipCodeLive"
				, "fr.aphp.wind.uima.type.PatientCityLive"
				, "fr.aphp.wind.uima.type.PatientStreetNameLive"
				, "fr.aphp.wind.uima.type.PatientPhoneNumber"
				, "fr.aphp.wind.uima.type.PatientNbNda"
				, "fr.aphp.wind.uima.type.GeneralDate"
				, "fr.aphp.wind.uima.type.GeneralLastName"
				, "fr.aphp.wind.uima.type.GeneralLastNameRegex"
				, "fr.aphp.wind.uima.type.GeneralFirstNameRegex"
				, "fr.aphp.wind.uima.type.GeneralDateRegex"
				, "fr.aphp.wind.uima.type.GeneralCity"
				, "fr.aphp.wind.uima.type.GeneralZipCode"
				, "fr.aphp.wind.uima.type.GeneralFirstName"
				, "fr.aphp.wind.uima.type.PhysicianLastName"
				, "fr.aphp.wind.uima.type.PhysicianFirstName"
				, "fr.aphp.wind.uima.type.AphpHospital"
				, "fr.aphp.wind.uima.type.GeneralEMail"
			]
		}
		,{
			"superType": "fr.aphp.wind.uima.type.PhysicianFirstName",
			"supraTypes": [
				  "fr.aphp.wind.uima.type.GeneralFirstName"
				  , "fr.aphp.wind.uima.type.GeneralFirstNameRegex"
				  , "fr.aphp.wind.uima.type.GeneralLastName"
				  , "fr.aphp.wind.uima.type.PhysicianLastName"
				  , "fr.aphp.wind.uima.type.GeneralLastNameRegex"
			]
		}
		,{
			"superType": "fr.aphp.wind.uima.type.GeneralLastNameRegex",
			"supraTypes": [
				 "fr.aphp.wind.uima.type.GeneralCity"
				  , "fr.aphp.wind.uima.type.GeneralFirstName"
			]
		}
		,{
			"superType": "fr.aphp.wind.uima.type.GeneralFirstName",
			"supraTypes": [
				 "fr.aphp.wind.uima.type.GeneralLastName"
				,  "fr.aphp.wind.uima.type.PhysicianLastName"
				, "fr.aphp.wind.uima.type.GeneralFirstNameRegex"
				, "fr.aphp.wind.uima.type.GeneralLastNameRegex"
			]
		}
		,{
			"superType": "fr.aphp.wind.uima.type.GeneralFirstNameRegex",
			"supraTypes": [
				"fr.aphp.wind.uima.type.GeneralLastNameRegex"
				, "fr.aphp.wind.uima.type.GeneralCity"
			]
		}
		,{
			"superType": "fr.aphp.wind.uima.type.PhysicianLastName",
			"supraTypes": [
				 "fr.aphp.wind.uima.type.GeneralLastName"
				, "fr.aphp.wind.uima.type.GeneralFirstNameRegex"
				 , "fr.aphp.wind.uima.type.GeneralLastNameRegex"
			]
		}
		,{
			"superType": "fr.aphp.wind.uima.type.GeneralLastName",
			"supraTypes": [
				  "fr.aphp.wind.uima.type.GeneralLastNameRegex"
			]
		}
		,{
			"superType": "fr.aphp.wind.uima.type.AphpHospital",
			"supraTypes": [
				 "fr.aphp.wind.uima.type.GeneralDate"
				, "fr.aphp.wind.uima.type.GeneralFirstName"
				, "fr.aphp.wind.uima.type.GeneralLastName"
				, "fr.aphp.wind.uima.type.GeneralLastNameRegex"
				, "fr.aphp.wind.uima.type.GeneralFirstNameRegex"
				, "fr.aphp.wind.uima.type.PhysicianLastName"
				, "fr.aphp.wind.uima.type.PhysicianFirstName"
				, "fr.aphp.wind.uima.type.GeneralCity"
				, "fr.aphp.wind.uima.type.GeneralZipCode"
			]
		}
		,{
			"superType": "fr.aphp.wind.uima.type.GeneralCountry",
			"supraTypes": [
				 "fr.aphp.wind.uima.type.GeneralCity"
				, "fr.aphp.wind.uima.type.GeneralFirstName"
				, "fr.aphp.wind.uima.type.GeneralLastName"
				, "fr.aphp.wind.uima.type.GeneralLastNameRegex"
				, "fr.aphp.wind.uima.type.GeneralFirstNameRegex"
				, "fr.aphp.wind.uima.type.PhysicianLastName"
				, "fr.aphp.wind.uima.type.PhysicianFirstName"
				, "fr.aphp.wind.uima.type.GeneralCity"
			]
		}
	]
	, "CREATE": [
		{
			"oldType": "fr.aphp.wind.uima.type.PatientFirstName",
			"newTypes": [
				"fr.aphp.wind.uima.type.GeneralFirstName"
			]
		}
		,{
			"oldType": "fr.aphp.wind.uima.type.PatientLastName",
			"newTypes": [
				"fr.aphp.wind.uima.type.GeneralLastName"
			]
		} 
		,{
			"oldType": "fr.aphp.wind.uima.type.PatientNbIpp",
			"newTypes": [
				"fr.aphp.wind.uima.type.GeneralNbIpp"
			]
		} 
		,{
			"oldType": "fr.aphp.wind.uima.type.PatientBirthDate",
			"newTypes": [
				"fr.aphp.wind.uima.type.GeneralDate"
			]
		} 
		,{
			"oldType": "fr.aphp.wind.uima.type.PatientDeathDate",
			"newTypes": [
				"fr.aphp.wind.uima.type.GeneralDate"
			]
		} 
		,{
			"oldType": "fr.aphp.wind.uima.type.GeneralDateRegex",
			"newTypes": [
				"fr.aphp.wind.uima.type.GeneralDate"
			]
		} 
		,{
			"oldType": "fr.aphp.wind.uima.type.PatientZipCodeLive",
			"newTypes": [
				"fr.aphp.wind.uima.type.GeneralZipCode"
			]
		} 
		,{
			"oldType": "fr.aphp.wind.uima.type.PatientZipCodeLive",
			"newTypes": [
				"fr.aphp.wind.uima.type.GeneralZipCode"
			]
		} 
		,{
			"oldType": "fr.aphp.wind.uima.type.PatientCityLive",
			"newTypes": [
				"fr.aphp.wind.uima.type.GeneralCity"
			]
		} 
		,{
			"oldType": "fr.aphp.wind.uima.type.PatientStreetNameLive",
			"newTypes": [
				"fr.aphp.wind.uima.type.GeneralStreet"
			]
		} 
		,{
			"oldType": "fr.aphp.wind.uima.type.PatientPhoneNumber",
			"newTypes": [
				"fr.aphp.wind.uima.type.GeneralPhoneNumber"
			]
		} 
		,{
			"oldType": "fr.aphp.wind.uima.type.PatientNbNda",
			"newTypes": [
				"fr.aphp.wind.uima.type.GeneralNbNda"
			]
		} 
		,{
			"oldType": "fr.aphp.wind.uima.type.PatientNbNda",
			"newTypes": [
				"fr.aphp.wind.uima.type.GeneralNbNda"
			]
		} 
		,{
			"oldType": "fr.aphp.wind.uima.type.PhysicianLastName",
			"newTypes": [
				"fr.aphp.wind.uima.type.GeneralLastName"
			]
		} 
		,{
			"oldType": "fr.aphp.wind.uima.type.PhysicianFirstName",
			"newTypes": [
				"fr.aphp.wind.uima.type.GeneralFirstName"
			]
		} 
		,{
			"oldType": "fr.aphp.wind.uima.type.GeneralLastNameRegex",
			"newTypes": [
				"fr.aphp.wind.uima.type.GeneralLastName"

			]
		} 
		,{
			"oldType": "fr.aphp.wind.uima.type.GeneralFirstNameRegex",
			"newTypes": [
				"fr.aphp.wind.uima.type.GeneralFirstName"
			]
		} 
		,{
			"oldType": "fr.aphp.wind.uima.type.PatientEMail",
			"newTypes": [
				"fr.aphp.wind.uima.type.GeneralEMail"
			]
		} 
		,{
			"oldType": "fr.aphp.wind.uima.type.PatientNbSecu",
			"newTypes": [
				"fr.aphp.wind.uima.type.GeneralNbSecu"
			]
		} 
		,{
			"oldType": "fr.aphp.wind.uima.type.GeneralFirstName",
			"newTypes": [
				"fr.aphp.wind.uima.type.GeneralName"
			]
		} 
		,{
			"oldType": "fr.aphp.wind.uima.type.GeneralLastName",
			"newTypes": [
				"fr.aphp.wind.uima.type.GeneralName"
			]
		} 
	]
			
	, "DEDUPLICATE": [
		{
			"deduplicate": [
				  "fr.aphp.wind.uima.type.GeneralDate"
				, "fr.aphp.wind.uima.type.GeneralLastName"
				, "fr.aphp.wind.uima.type.GeneralLastNameRegex"
				, "fr.aphp.wind.uima.type.GeneralFirstName"
				, "fr.aphp.wind.uima.type.GeneralFirstNameRegex"
				, "fr.aphp.wind.uima.type.GeneralCity"
				, "fr.aphp.wind.uima.type.GeneralZipCode"
				, "fr.aphp.wind.uima.type.GeneralEMail"
				, "fr.aphp.wind.uima.type.GeneralNbNda"
				, "fr.aphp.wind.uima.type.GeneralNbIpp"
				, "fr.aphp.wind.uima.type.GeneralNbSecu"
				, "fr.aphp.wind.uima.type.GeneralName"
				, "fr.aphp.wind.uima.type.GeneralStreet"
				, "fr.aphp.wind.uima.type.GeneralPhoneNumber"
				, "fr.aphp.wind.uima.type.PatientLastName"
				, "fr.aphp.wind.uima.type.PatientFirstName"
				, "fr.aphp.wind.uima.type.PatientFamilyName"
				, "fr.aphp.wind.uima.type.PatientNbIpp"
				, "fr.aphp.wind.uima.type.PatientBirthDate"
				, "fr.aphp.wind.uima.type.PatientDeathDate"
				, "fr.aphp.wind.uima.type.PatientZipCodeLive"
				, "fr.aphp.wind.uima.type.PatientCityLive"
				, "fr.aphp.wind.uima.type.PatientStreetNameLive"
				, "fr.aphp.wind.uima.type.PatientPhoneNumber"
				, "fr.aphp.wind.uima.type.PatientNbNda"
				, "fr.aphp.wind.uima.type.GeneralDate"
				, "fr.aphp.wind.uima.type.GeneralLastName"
				, "fr.aphp.wind.uima.type.GeneralLastNameRegex"
				, "fr.aphp.wind.uima.type.GeneralFirstNameRegex"
				, "fr.aphp.wind.uima.type.GeneralDateRegex"
				, "fr.aphp.wind.uima.type.GeneralCity"
				, "fr.aphp.wind.uima.type.GeneralPhoneNumber"
				, "fr.aphp.wind.uima.type.GeneralZipCode"
				, "fr.aphp.wind.uima.type.GeneralFirstName"
				, "fr.aphp.wind.uima.type.PhysicianLastName"
				, "fr.aphp.wind.uima.type.PhysicianFirstName"
				, "fr.aphp.wind.uima.type.AphpHospital"
				, "fr.aphp.wind.uima.type.GeneralEMail"
			]
		}
	]
}
