{"resources": [
  {
    "name": "xxxy",
    "schema": {
      "fields": [
        {
          "name": "id"
        }
      ]
    }
  },
  {
    "name": "yyy",
    "schema": {
      "fields": [
        {
          "name": "parent"
        },
        {
          "name": "id"
        }
      ],
      "foreignKeys": [
        {
          "fields": "parent",
            "reference": {
            "resource": "xxx",
            "fields": "id"
          }
        }
      ]
    }
  }
]}
