location_id,address_1,address_2,city,state,zip,county,country,location_source_value,latitude,longitude
1,,,,MO,,26950,FRANCE,26-950,49.7190785,-88.847836
2,,,,PA,,39230,FRANCE,39-230,57.454968,23.738874
3,,,,PA,,39280,FRANCE,39-280,-37.2325695,-2.03115
4,,,,CO,,6290,FRANCE,06-290,74.654955,-173.717807
5,,,,WI,,52590,FRANCE,52-590,80.5237725,163.31396
6,,,,NY,,33400,FRANCE,33-400,82.188689,-36.289444
7,,,,PA,,39270,FRANCE,39-270,51.92459,11.511405
8,,,,MN,,24680,FRANCE,24-680,74.371663,71.500044
9,,,,MI,,23810,FRANCE,23-810,75.1151,28.235197
10,,,,AL,,1570,FRANCE,01-570,-14.7047395,-155.946474
11,,,,IN,,15140,FRANCE,15-140,-44.67936,-137.822662
12,,,,TN,,44230,FRANCE,44-230,-73.32237,-145.803431
13,,,,RI,,41030,FRANCE,41-030,73.5516415,173.143186
14,,,,IL,,14982,FRANCE,14-982,85.7555995,-107.311717
15,,,,ID,,13270,FRANCE,13-270,-5.8581055,129.337895
16,,,,CO,,6140,FRANCE,06-140,-34.873754,-65.819451
17,,,,NC,,34400,FRANCE,34-400,83.0496585,126.554828
18,,,,WA,,50160,FRANCE,50-160,-62.2651105,167.592943
19,,,,UT,,46170,FRANCE,46-170,-78.5073175,167.98566
20,,,,MA,,22020,FRANCE,22-020,-51.7638735,-174.381595
21,,,,MS,,25350,FRANCE,25-350,58.631489,79.227192
22,,,,NM,,32000,FRANCE,32-000,82.771365,-94.520419
23,,,,IL,,14580,FRANCE,14-580,-54.4491125,16.643038
24,,,,NC,,34350,FRANCE,34-350,76.418852,-115.337231
25,,,,AZ,,3090,FRANCE,03-090,50.0041555,91.312381
26,,,,54,,54000,FRANCE,54-000,74.2954085,80.288138
27,,,,OR,,38010,FRANCE,38-010,-44.5105005,-174.149262
28,,,,ME,,20130,FRANCE,20-130,7.7019085,127.311088
29,,,,OH,,36870,FRANCE,36-870,62.602416,-179.524455
30,,,,CA,,5090,FRANCE,05-090,38.283835,110.061395
31,,,,FL,,10150,FRANCE,10-150,-23.051054,115.228703
32,,,,KY,,18170,FRANCE,18-170,65.742667,110.513619
33,,,,NC,,34640,FRANCE,34-640,-48.6071235,-170.29781
34,,,,NY,,33700,FRANCE,33-700,-2.318349,86.752888
35,,,,TX,,45390,FRANCE,45-390,28.111472,77.698955
36,,,,HI,,12020,FRANCE,12-020,76.5707355,-108.067184
37,,,,PA,,39620,FRANCE,39-620,42.553613,-109.910614
38,,,,MT,,27260,FRANCE,27-260,-14.8235635,142.083911
39,,,,NY,,33020,FRANCE,33-020,29.593359,172.425535
40,,,,TX,,45930,FRANCE,45-930,-17.2702025,129.822414
41,,,,TX,,45734,FRANCE,45-734,-78.014806,49.306343
42,,,,WV,,51250,FRANCE,51-250,44.368746,51.992222
43,,,,WI,,52580,FRANCE,52-580,-10.9367245,87.426888
44,,,,VA,,49563,FRANCE,49-563,-0.6184245,156.234474
45,,,,OR,,38230,FRANCE,38-230,13.283526,44.382626
46,,,,CA,,5200,FRANCE,05-200,76.8643195,-174.858221
47,,,,WA,,50310,FRANCE,50-310,-37.7889395,-160.563192
48,,,,CA,,5640,FRANCE,05-640,-23.7887655,97.832182
49,,,,OK,,37670,FRANCE,37-670,86.6611195,134.306703
50,,,,MD,,21120,FRANCE,21-120,67.0080325,-109.972889
51,,,,WI,,52040,FRANCE,52-040,-64.72677,-100.28568
52,,,,FL,,10280,FRANCE,10-280,-19.3430025,-117.994069
53,,,,TX,,45100,FRANCE,45-100,9.11423,42.305398
54,,,,NJ,,31290,FRANCE,31-290,-51.934937,43.233665
55,,,,CA,,5210,FRANCE,05-210,35.731988,3.607123
56,,,,TX,,45970,FRANCE,45-970,-13.7425825,-109.059273
57,,,,IL,,14141,FRANCE,14-141,-34.4724305,20.679645
58,,,,MI,,23620,FRANCE,23-620,22.127534,111.868141
59,,,,PA,,39010,FRANCE,39-010,-56.570523,-165.880927
60,,,,CA,,5660,FRANCE,05-660,-83.852632,58.363767
61,,,,FL,,10570,FRANCE,10-570,40.460518,6.166033
62,,,,NY,,33590,FRANCE,33-590,2.9856065,-79.276733
63,,,,MO,,26470,FRANCE,26-470,-87.8674105,78.130256
64,,,,OH,,36770,FRANCE,36-770,45.095647,-57.789964
65,,,,NY,,33510,FRANCE,33-510,-29.0715125,-59.382837
67,,,,WI,,52310,FRANCE,52-310,69.6106235,-60.657548
68,,,,GA,,11090,FRANCE,11-090,12.645814,23.293988
69,,,,FL,,10120,FRANCE,10-120,-78.523975,-54.684694
70,,,,IL,,14890,FRANCE,14-890,-75.842116,-136.151362
71,,,,54,,54320,FRANCE,54-320,-6.8818305,30.657342
72,,,,TN,,44180,FRANCE,44-180,-9.544753,54.442941
73,,,,CA,,5510,FRANCE,05-510,40.838255,31.342966
74,,,,CA,,5580,FRANCE,05-580,57.974753,-152.747662
75,,,,WI,,52430,FRANCE,52-430,1.876708,-146.568381
76,,,,IN,,15880,FRANCE,15-880,16.770602,-82.759738
77,,,,GA,,11470,FRANCE,11-470,49.267216,-135.355369
78,,,,CA,,5400,FRANCE,05-400,-16.735558,-122.449384
79,,,,NH,,30050,FRANCE,30-050,24.826823,87.190047
80,,,,CO,,6500,FRANCE,06-500,40.011249,55.718867
81,,,,MT,,27310,FRANCE,27-310,-75.369994,-91.796012
82,,,,CT,,7010,FRANCE,07-010,26.4936415,155.296967
83,,,,NJ,,31300,FRANCE,31-300,68.6187,159.068832
84,,,,FL,,10500,FRANCE,10-500,-44.660802,-17.403113
85,,,,CA,,5470,FRANCE,05-470,-21.0198665,169.516734
86,,,,MN,,24260,FRANCE,24-260,12.5891215,-29.77683
87,,,,AZ,,3060,FRANCE,03-060,-86.8283015,146.948518
88,,,,AZ,,3010,FRANCE,03-010,21.8321325,-139.3983
89,,,,FL,,10490,FRANCE,10-490,48.922629,-159.611021
90,,,,AR,,4150,FRANCE,04-150,-36.3496015,87.038847
91,,,,MI,,23600,FRANCE,23-600,-74.92034,125.50541
92,,,,CA,,5120,FRANCE,05-120,-54.7264835,169.101988
93,,,,MS,,25170,FRANCE,25-170,62.24604,138.43941
94,,,,TX,,45090,FRANCE,45-090,63.3885255,-99.577832
95,,,,LA,,19220,FRANCE,19-220,-16.4208325,-14.85301
96,,,,MI,,23790,FRANCE,23-790,-65.039004,-62.379596
97,,,,PA,,39260,FRANCE,39-260,-41.4459305,-172.481982
98,,,,NC,,34750,FRANCE,34-750,-51.937842,-86.355857
99,,,,MT,,27060,FRANCE,27-060,22.29301,13.306167
100,,,,WA,,50380,FRANCE,50-380,-73.4070265,-22.837898
101,,,,WA,,50220,FRANCE,50-220,-1.5715125,98.299986
102,,,,OH,,36630,FRANCE,36-630,-67.9646045,-85.789247
103,,,,AL,,1440,FRANCE,01-440,-51.490649,155.493297
104,,,,VA,,49420,FRANCE,49-420,80.4840005,-6.391156
105,,,,OK,,37480,FRANCE,37-480,66.498264,-2.139898
106,,,,VA,,49770,FRANCE,49-770,57.030508,-80.187011
107,,,,DE,,8010,FRANCE,08-010,21.8303175,-117.804893
109,,,,FL,,10100,FRANCE,10-100,5.4765,-56.520365
111,,,,AK,,2020,FRANCE,02-020,3.379701,-150.022314
112,,,,CO,,6410,FRANCE,06-410,64.630841,-129.967459
113,,,,OH,,36480,FRANCE,36-480,-62.0346895,-110.528476
114,,,,SC,,42090,FRANCE,42-090,-83.264787,-179.91881
115,,,,OH,,36170,FRANCE,36-170,-2.7852445,174.759649
116,,,,WA,,50260,FRANCE,50-260,16.3304205,-54.540789
117,,,,IA,,16960,FRANCE,16-960,-10.4073805,-88.130008
118,,,,MA,,22160,FRANCE,22-160,31.6688255,167.631619
119,,,,LA,,19270,FRANCE,19-270,-38.065536,-122.668665
120,,,,NY,,33200,FRANCE,33-200,-25.635752,-70.584184
121,,,,NJ,,31270,FRANCE,31-270,-89.9225355,-0.895256
122,,,,AL,,1270,FRANCE,01-270,-12.421249,-112.300682
123,,,,PA,,39560,FRANCE,39-560,-19.8697625,-161.691885
124,,,,SC,,42380,FRANCE,42-380,2.4979625,-112.012058
125,,,,OR,,38250,FRANCE,38-250,-38.262771,-135.182113
126,,,,MA,,22060,FRANCE,22-060,-41.5686875,54.531586
127,,,,FL,,10470,FRANCE,10-470,75.84094,85.37659
128,,,,CA,,5380,FRANCE,05-380,43.321962,-73.278633
129,,,,MI,,23450,FRANCE,23-450,48.4476345,-130.528021
130,,,,IN,,15250,FRANCE,15-250,-84.550309,-50.406751
131,,,,NC,,34950,FRANCE,34-950,26.8104245,-147.221319
132,,,,AR,,4030,FRANCE,04-030,36.847576,116.430054
133,,,,NC,,34660,FRANCE,34-660,58.1961705,-155.61365
134,,,,54,,54340,FRANCE,54-340,64.6950325,-96.196252
135,,,,NY,,33331,FRANCE,33-331,-53.67498,-165.087969
136,,,,WV,,51160,FRANCE,51-160,12.0643435,46.143079
137,,,,NJ,,31200,FRANCE,31-200,32.3732415,94.073847
138,,,,AR,,4110,FRANCE,04-110,38.1129645,80.213626
139,,,,IA,,16760,FRANCE,16-760,-1.472772,19.011233
141,,,,NH,,30080,FRANCE,30-080,-53.925521,-128.972415
142,,,,WV,,51240,FRANCE,51-240,-37.626264,152.768205
143,,,,TX,,45130,FRANCE,45-130,-15.561725,-152.905393
144,,,,AR,,4430,FRANCE,04-430,-50.5720495,6.634808
145,,,,MA,,22070,FRANCE,22-070,57.7266545,-18.934542
146,,,,KS,,17860,FRANCE,17-860,77.9096485,-1.289151
147,,,,FL,,10000,FRANCE,10-000,-56.2939225,6.505073
148,,,,54,,54640,FRANCE,54-640,-36.4323515,-109.965905
149,,,,NM,,32020,FRANCE,32-020,13.4290565,-45.199442
150,,,,CA,,5430,FRANCE,05-430,-14.614395,-88.848658
151,,,,IA,,16160,FRANCE,16-160,75.6891575,50.70518
152,,,,CA,,5160,FRANCE,05-160,-29.172716,-86.142031
153,,,,54,,54999,FRANCE,54-999,64.4470665,-49.508021
154,,,,SC,,42450,FRANCE,42-450,38.171984,-167.934679
155,,,,MD,,21100,FRANCE,21-100,-0.151936,13.987035
156,,,,MN,,24790,FRANCE,24-790,44.0169525,-93.642322
157,,,,OH,,36080,FRANCE,36-080,41.941529,-54.572328
158,,,,NY,,33610,FRANCE,33-610,-56.9611265,-94.345072
159,,,,MA,,22090,FRANCE,22-090,39.6976465,171.95479
160,,,,CT,,7040,FRANCE,07-040,12.912109,32.481911
161,,,,OH,,36490,FRANCE,36-490,-85.643613,97.651135
162,,,,TX,,45870,FRANCE,45-870,55.2612945,-128.268855
163,,,,MI,,23800,FRANCE,23-800,-2.0167435,-109.424346
164,,,,CA,,5110,FRANCE,05-110,89.4440835,172.147509
165,,,,CA,,5600,FRANCE,05-600,50.821931,-126.699242
166,,,,GA,,11530,FRANCE,11-530,88.03766,178.444675
167,,,,CT,,7000,FRANCE,07-000,42.04718,-127.026065
168,,,,MA,,22170,FRANCE,22-170,0.3911235,99.761985
169,,,,NC,,34910,FRANCE,34-910,-58.5134395,127.015398
170,,,,FL,,10050,FRANCE,10-050,47.0832285,123.811936
172,,,,WI,,52290,FRANCE,52-290,67.363596,7.849156
173,,,,OH,,36310,FRANCE,36-310,-37.749214,118.133049
174,,,,SD,,43450,FRANCE,43-450,73.3791435,172.12861
175,,,,MO,,26991,FRANCE,26-991,39.7993945,-5.234409
176,,,,FL,,10540,FRANCE,10-540,36.132046,-76.216371
177,,,,TN,,44320,FRANCE,44-320,-86.2104675,-17.028708
178,,,,UT,,46240,FRANCE,46-240,34.83608,89.807487
179,,,,TN,,44290,FRANCE,44-290,-43.9686395,17.459654
180,,,,MA,,22150,FRANCE,22-150,11.501764,107.433458
181,,,,MO,,26580,FRANCE,26-580,-33.748635,133.170257
182,,,,NY,,33760,FRANCE,33-760,30.593156,-6.347055
183,,,,CA,,5490,FRANCE,05-490,-29.79392,159.002482
184,,,,MO,,26680,FRANCE,26-680,9.734224,-61.632691
186,,,,PA,,39250,FRANCE,39-250,-58.6550135,-116.626226
187,,,,NC,,34250,FRANCE,34-250,-58.31111,-113.455792
188,,,,FL,,10160,FRANCE,10-160,57.1550745,-89.939665
189,,,,IL,,14989,FRANCE,14-989,2.5614065,156.966281
190,,,,IN,,15480,FRANCE,15-480,-9.421628,-7.548783
191,,,,VA,,49622,FRANCE,49-622,12.392458,-156.399839
192,,,,WA,,50330,FRANCE,50-330,-27.6249325,-41.942869
193,,,,PA,,39100,FRANCE,39-100,-77.8297315,-64.501421
194,,,,IN,,15780,FRANCE,15-780,77.297527,142.177653
195,,,,WI,,52100,FRANCE,52-100,12.6694105,123.64598
196,,,,NJ,,31160,FRANCE,31-160,81.3106155,-156.956555
197,,,,DC,,9000,FRANCE,09-000,-41.6390785,-48.097282
198,,,,TX,,45670,FRANCE,45-670,78.9521975,-51.474045
199,,,,TN,,44740,FRANCE,44-740,-89.3948635,-11.670603
200,,,,AL,,1360,FRANCE,01-360,-19.2261675,88.293603
201,,,,WI,,52020,FRANCE,52-020,-30.9894645,-168.683308
202,,,,GA,,11940,FRANCE,11-940,-52.933164,-29.395687
203,,,,NY,,33420,FRANCE,33-420,50.305188,26.071873
204,,,,IN,,15280,FRANCE,15-280,40.854447,-2.56153
205,,,,WV,,51180,FRANCE,51-180,-31.794263,168.343617
206,,,,KY,,18830,FRANCE,18-830,68.332541,-45.388317
207,,,,NY,,33750,FRANCE,33-750,38.292017,102.691157
208,,,,MA,,22130,FRANCE,22-130,-57.2321655,-101.677167
209,,,,TX,,45530,FRANCE,45-530,-23.077688,135.733175
210,,,,TX,,45860,FRANCE,45-860,70.5270055,89.725256
211,,,,SD,,43490,FRANCE,43-490,26.5478565,-50.71709
212,,,,IN,,15810,FRANCE,15-810,50.225002,149.714944
213,,,,NJ,,31310,FRANCE,31-310,32.458847,-60.55568
214,,,,OK,,37540,FRANCE,37-540,31.1841305,42.534054
215,,,,VT,,47030,FRANCE,47-030,-80.0564165,143.070636
216,,,,VA,,49130,FRANCE,49-130,22.2479105,119.888956
217,,,,SC,,42050,FRANCE,42-050,-23.600116,-41.363203
218,,,,KS,,17450,FRANCE,17-450,-48.259243,-4.622784
220,,,,CA,,5080,FRANCE,05-080,20.33786,-26.207192
221,,,,SC,,42200,FRANCE,42-200,69.480037,-95.525155
222,,,,NJ,,31150,FRANCE,31-150,-24.248829,-65.577444
223,,,,TX,,45948,FRANCE,45-948,5.6761205,173.313622
224,,,,WI,,52170,FRANCE,52-170,-86.5508365,-85.091473
225,,,,IL,,14510,FRANCE,14-510,-8.1321575,172.010785
226,,,,NJ,,31320,FRANCE,31-320,37.785934,30.700663
227,,,,NC,,34590,FRANCE,34-590,42.5073445,42.403343
228,,,,FL,,10250,FRANCE,10-250,44.2534495,145.42864
229,,,,FL,,10350,FRANCE,10-350,88.1224405,155.240679
230,,,,PA,,39080,FRANCE,39-080,21.4121745,45.143133
231,,,,MI,,23240,FRANCE,23-240,38.717893,-2.427357
232,,,,TX,,45885,FRANCE,45-885,15.481086,-74.844543
233,,,,GA,,11921,FRANCE,11-921,-30.777147,-70.349274
234,,,,NH,,30060,FRANCE,30-060,-11.001167,18.762216
235,,,,AZ,,3120,FRANCE,03-120,-0.8009265,77.95683
236,,,,IA,,16100,FRANCE,16-100,5.962379,-67.222597
237,,,,CA,,5460,FRANCE,05-460,85.7679445,133.701167
238,,,,AR,,4590,FRANCE,04-590,2.4191045,127.580393
239,,,,FL,,10090,FRANCE,10-090,-51.1174555,-76.275903
240,,,,TX,,45410,FRANCE,45-410,87.2018035,-43.244806
241,,,,NY,,33910,FRANCE,33-910,-56.8327255,99.6412
242,,,,ND,,35240,FRANCE,35-240,83.140799,-36.780042
243,,,,IL,,14250,FRANCE,14-250,41.244791,-139.095955
244,,,,TN,,44780,FRANCE,44-780,-45.7226385,74.899468
245,,,,KY,,18720,FRANCE,18-720,-19.9506135,119.579928
246,,,,MS,,25710,FRANCE,25-710,63.444455,-47.912444
247,,,,RI,,41010,FRANCE,41-010,-70.943984,-67.96125
248,,,,CO,,6200,FRANCE,06-200,-78.669571,27.253675
249,,,,MI,,23490,FRANCE,23-490,40.337393,-39.283356
250,,,,FL,,10590,FRANCE,10-590,-38.025328,123.979347
251,,,,NY,,33620,FRANCE,33-620,-7.357591,-139.412374
252,,,,MI,,23230,FRANCE,23-230,-43.571945,-129.703118
253,,,,FL,,10400,FRANCE,10-400,60.265145,56.268606
254,,,,LA,,19160,FRANCE,19-160,61.531297,70.730912
255,,,,FL,,10190,FRANCE,10-190,31.515501,158.217747
256,,,,IL,,14800,FRANCE,14-800,-63.4102755,113.696076
257,,,,VA,,49430,FRANCE,49-430,-51.494994,7.298418
258,,,,LA,,19020,FRANCE,19-020,70.21126,87.44394
259,,,,TX,,45758,FRANCE,45-758,42.069306,-122.540117
260,,,,CA,,5440,FRANCE,05-440,23.862877,179.799353
261,,,,MS,,25600,FRANCE,25-600,71.570956,-51.554302
262,,,,NY,,33800,FRANCE,33-800,-64.537259,23.770615
263,,,,PA,,39290,FRANCE,39-290,55.056754,149.415051
265,,,,MN,,24650,FRANCE,24-650,-17.276018,-61.292497
266,,,,IN,,15180,FRANCE,15-180,-53.952216,146.106003
268,,,,FL,,10510,FRANCE,10-510,52.422176,-101.40417
269,,,,OK,,37730,FRANCE,37-730,4.6575055,-131.071226
270,,,,VA,,49000,FRANCE,49-000,-31.721193,82.027093
271,,,,NY,,33030,FRANCE,33-030,-10.066401,177.868258
272,,,,GA,,11421,FRANCE,11-421,-13.8832025,65.837659
274,,,,IL,,14350,FRANCE,14-350,-89.750856,109.858228
275,,,,IN,,15190,FRANCE,15-190,-71.329811,63.241241
276,,,,MD,,21020,FRANCE,21-020,24.5962615,-51.51902
278,,,,OR,,38140,FRANCE,38-140,-56.8241265,-110.561404
279,,,,TN,,44460,FRANCE,44-460,2.8797685,-179.351935
280,,,,MO,,26820,FRANCE,26-820,25.261785,-64.940269
281,,,,CO,,6150,FRANCE,06-150,51.3918765,158.373144
282,,,,CA,,5340,FRANCE,05-340,-41.480798,15.017869
283,,,,OH,,36450,FRANCE,36-450,74.5621705,-47.340682
284,,,,NH,,30040,FRANCE,30-040,-0.8279015,13.681049
285,,,,MS,,25440,FRANCE,25-440,46.87124,80.278436
286,,,,PA,,39140,FRANCE,39-140,-48.399915,2.22478
287,,,,NY,,33370,FRANCE,33-370,-52.8060645,-23.360711
289,,,,IL,,14550,FRANCE,14-550,75.485067,24.134259
290,,,,SC,,42230,FRANCE,42-230,-14.1055425,-68.965416
292,,,,54,,54150,FRANCE,54-150,-74.7096085,-143.765428
293,,,,TX,,45722,FRANCE,45-722,58.5346085,-151.614309
294,,,,WV,,51010,FRANCE,51-010,55.6634815,177.294127
295,,,,IL,,14680,FRANCE,14-680,15.3775515,26.737632
296,,,,KY,,18180,FRANCE,18-180,53.823096,-28.056885
297,,,,GA,,11570,FRANCE,11-570,-68.4161485,16.132128
298,,,,GA,,11980,FRANCE,11-980,17.887844,103.829065
299,,,,MN,,24750,FRANCE,24-750,30.26412,18.192576
301,,,,TN,,44220,FRANCE,44-220,-51.8715185,-92.688807
302,,,,TX,,45810,FRANCE,45-810,-80.0412775,161.034637
306,,,,PA,,39200,FRANCE,39-200,32.530173,-54.296281
307,,,,MA,,22040,FRANCE,22-040,19.210042,170.665553
308,,,,ME,,20040,FRANCE,20-040,-25.6919835,39.609337
309,,,,IN,,15090,FRANCE,15-090,15.4463875,-35.003851
310,,,,PA,,39070,FRANCE,39-070,23.9090685,44.656508
311,,,,WI,,52390,FRANCE,52-390,73.52156,-109.737141
312,,,,WI,,52650,FRANCE,52-650,-60.4339235,31.980449
313,,,,IN,,15110,FRANCE,15-110,-19.7238015,-161.372068
314,,,,PA,,39470,FRANCE,39-470,50.4512195,9.099
315,,,,SC,,42390,FRANCE,42-390,-37.2655495,-120.396366
316,,,,IN,,15860,FRANCE,15-860,55.2589315,-34.022102
317,,,,VA,,49040,FRANCE,49-040,22.7610515,-135.925022
318,,,,TX,,45878,FRANCE,45-878,-4.5165235,-69.035509
319,,,,NC,,34280,FRANCE,34-280,20.015658,4.371126
320,,,,MI,,23750,FRANCE,23-750,-62.1791935,-177.911627
321,,,,OH,,36280,FRANCE,36-280,32.211132,67.902769
322,,,,WI,,52660,FRANCE,52-660,78.0004665,124.051763
324,,,,FL,,10340,FRANCE,10-340,-46.5386565,-137.440794
325,,,,NV,,29010,FRANCE,29-010,4.2130885,170.677699
326,,,,VT,,47110,FRANCE,47-110,-39.995717,-109.290939
327,,,,OR,,38020,FRANCE,38-020,-86.0489515,-13.142639
328,,,,NY,,33650,FRANCE,33-650,-12.32016,-60.053637
329,,,,FL,,10460,FRANCE,10-460,56.5216475,-39.285204
330,,,,OK,,37250,FRANCE,37-250,23.454255,-140.432598
331,,,,TX,,45652,FRANCE,45-652,45.013976,4.630028
332,,,,OK,,37710,FRANCE,37-710,-35.915878,72.578211
334,,,,AR,,4510,FRANCE,04-510,23.208304,52.446805
335,,,,CT,,7020,FRANCE,07-020,3.273287,-25.540603
336,,,,IA,,16040,FRANCE,16-040,-19.184279,-5.987813
337,,,,SC,,42060,FRANCE,42-060,51.3841985,-156.805223
338,,,,NY,,33230,FRANCE,33-230,49.473993,71.0859
339,,,,LA,,19510,FRANCE,19-510,84.007699,-97.790456
340,,,,NC,,34440,FRANCE,34-440,-0.7471345,-60.414653
341,,,,TX,,45610,FRANCE,45-610,83.093037,158.421098
342,,,,SC,,42330,FRANCE,42-330,-62.865719,22.99711
343,,,,VA,,49551,FRANCE,49-551,82.824543,139.531502
344,,,,KS,,17620,FRANCE,17-620,0.9104705,171.418732
345,,,,CA,,5480,FRANCE,05-480,-20.164549,5.763028
346,,,,TX,,45801,FRANCE,45-801,18.0628175,-80.442957
347,,,,AL,,1540,FRANCE,01-540,43.3256555,111.533092
348,,,,NC,,34730,FRANCE,34-730,52.808299,-28.263029
350,,,,TX,,45953,FRANCE,45-953,53.323468,125.806994
351,,,,GA,,11700,FRANCE,11-700,30.263371,48.226971
352,,,,NY,,33240,FRANCE,33-240,-50.5331185,17.300279
353,,,,IN,,15010,FRANCE,15-010,26.5697895,53.862526
354,,,,MI,,23710,FRANCE,23-710,-59.765202,49.001757
355,,,,WI,,52160,FRANCE,52-160,44.310897,-59.081619
356,,,,GA,,11600,FRANCE,11-600,87.6481715,-42.561868
357,,,,WV,,51530,FRANCE,51-530,-55.4447725,13.599711
360,,,,MO,,26150,FRANCE,26-150,-60.586664,-72.526822
361,,,,TX,,45940,FRANCE,45-940,-11.7226195,-119.203103
362,,,,TX,,45822,FRANCE,45-822,-37.7474965,-111.370813
363,,,,GA,,11290,FRANCE,11-290,31.6102595,119.482622
364,,,,CA,,5500,FRANCE,05-500,15.683943,-55.165606
365,,,,MO,,26411,FRANCE,26-411,-22.4398055,1.037329
366,,,,SC,,42010,FRANCE,42-010,-75.604108,-109.292971
367,,,,VA,,49120,FRANCE,49-120,56.8496245,119.861322
370,,,,MI,,23780,FRANCE,23-780,-24.3493205,1.848354
371,,,,MN,,24130,FRANCE,24-130,50.8306555,100.981168
372,,,,SC,,42250,FRANCE,42-250,-8.980985,-152.308418
373,,,,MS,,25370,FRANCE,25-370,-9.3332145,-30.795238
374,,,,SC,,42270,FRANCE,42-270,-16.685792,16.962691
375,,,,TN,,44100,FRANCE,44-100,-51.9276415,148.156818
376,,,,MN,,24570,FRANCE,24-570,0.026957,170.883
377,,,,NC,,34120,FRANCE,34-120,42.227975,95.203818
378,,,,OH,,36370,FRANCE,36-370,50.416269,50.199812
379,,,,GA,,11320,FRANCE,11-320,62.1048615,128.910539
380,,,,ME,,20110,FRANCE,20-110,-89.0564495,105.579936
381,,,,TX,,45681,FRANCE,45-681,-31.619098,17.051448
382,,,,NC,,34650,FRANCE,34-650,63.7974615,-148.73041
383,,,,NC,,34090,FRANCE,34-090,46.9412285,76.489379
384,,,,NY,,33000,FRANCE,33-000,-54.369423,53.732796
385,,,,UT,,46260,FRANCE,46-260,75.777288,-132.138877
386,,,,IA,,16300,FRANCE,16-300,3.24394,15.949235
387,,,,NC,,34220,FRANCE,34-220,71.192523,-59.934411
388,,,,CO,,6330,FRANCE,06-330,-87.1463835,-135.115266
389,,,,OH,,36510,FRANCE,36-510,-10.858636,-60.588381
390,,,,PA,,39770,FRANCE,39-770,-81.1357395,-70.963228
391,,,,MD,,21060,FRANCE,21-060,-68.549063,129.763401
392,,,,KY,,18550,FRANCE,18-550,49.423234,30.283956
393,,,,CA,,5590,FRANCE,05-590,-11.7734425,168.020651
394,,,,CA,,5390,FRANCE,05-390,-0.8500955,153.959832
395,,,,PA,,39710,FRANCE,39-710,-18.514227,84.605565
397,,,,TX,,45440,FRANCE,45-440,18.074389,165.501895
398,,,,MO,,26982,FRANCE,26-982,34.5903135,-25.251835
399,,,,WY,,53060,FRANCE,53-060,-3.3979665,98.306199
400,,,,PA,,39350,FRANCE,39-350,71.388427,-74.444857
401,,,,TN,,44940,FRANCE,44-940,-68.7786685,22.397815
402,,,,IA,,16840,FRANCE,16-840,-74.566689,-154.458475
403,,,,SC,,42410,FRANCE,42-410,-43.492519,115.677912
404,,,,VA,,49290,FRANCE,49-290,-24.8973275,-161.551037
405,,,,WV,,51090,FRANCE,51-090,72.4592555,-118.890423
406,,,,OK,,37300,FRANCE,37-300,40.447851,-92.691733
407,,,,MS,,25760,FRANCE,25-760,-21.593427,126.430915
408,,,,LA,,19080,FRANCE,19-080,45.2575035,-118.212901
409,,,,LA,,19570,FRANCE,19-570,2.575024,154.603611
410,,,,NC,,34410,FRANCE,34-410,75.4858865,72.830141
411,,,,GA,,11400,FRANCE,11-400,-68.186958,-88.482739
412,,,,MN,,24720,FRANCE,24-720,-58.369995,138.691486
413,,,,UT,,46050,FRANCE,46-050,-45.0530675,-157.043558
414,,,,AR,,4650,FRANCE,04-650,5.842766,-0.682241
415,,,,NV,,29020,FRANCE,29-020,-73.325219,137.064943
416,,,,MO,,26940,FRANCE,26-940,-24.532869,-146.97861
417,,,,NJ,,31190,FRANCE,31-190,45.3181545,97.90896
418,,,,OR,,38200,FRANCE,38-200,67.293396,-28.050326
419,,,,LA,,19340,FRANCE,19-340,-57.0483555,-168.781727
421,,,,PA,,39590,FRANCE,39-590,31.1876025,148.096688
422,,,,54,,54350,FRANCE,54-350,30.189078,-177.382867
423,,,,TN,,44120,FRANCE,44-120,51.3732015,-149.162298
424,,,,WV,,51110,FRANCE,51-110,-33.5605335,64.525364
425,,,,MO,,26210,FRANCE,26-210,86.1174015,-10.673108
426,,,,IL,,14970,FRANCE,14-970,-77.41663,135.72802
427,,,,MO,,26570,FRANCE,26-570,-50.9622485,167.292065
428,,,,GA,,11070,FRANCE,11-070,71.9461565,-76.833962
429,,,,OK,,37660,FRANCE,37-660,63.05396,137.494698
430,,,,IA,,16240,FRANCE,16-240,71.042226,14.995204
432,,,,VA,,49890,FRANCE,49-890,-20.262679,170.174928
433,,,,MS,,25590,FRANCE,25-590,-24.2459085,44.383921
434,,,,TN,,44520,FRANCE,44-520,-17.54541,173.371027
435,,,,GA,,11540,FRANCE,11-540,8.620619,-147.877993
436,,,,CO,,6060,FRANCE,06-060,-89.129592,61.479089
437,,,,NY,,33600,FRANCE,33-600,-45.7048435,55.312684
438,,,,LA,,19300,FRANCE,19-300,18.639973,13.422796
439,,,,NC,,34780,FRANCE,34-780,-45.461746,27.954468
440,,,,CA,,5000,FRANCE,05-000,-2.395436,-116.503289
441,,,,CA,,5060,FRANCE,05-060,62.3846395,149.078831
442,,,,FL,,10560,FRANCE,10-560,39.0639545,-22.309018
444,,,,IA,,16750,FRANCE,16-750,78.7941625,-18.343666
445,,,,NV,,29150,FRANCE,29-150,-15.3676355,64.464976
447,,,,MN,,24000,FRANCE,24-000,-71.9164155,157.590983
448,,,,IL,,14530,FRANCE,14-530,59.8947185,-91.474523
449,,,,AR,,4690,FRANCE,04-690,-32.1447785,167.926868
450,,,,CA,,5650,FRANCE,05-650,-3.2741255,-156.823469
451,,,,TX,,45221,FRANCE,45-221,5.4190855,56.34501
452,,,,FL,,10370,FRANCE,10-370,10.558877,-117.494482
453,,,,TX,,45843,FRANCE,45-843,24.3465435,129.874206
454,,,,NJ,,31000,FRANCE,31-000,26.106551,61.470137
455,,,,MO,,26380,FRANCE,26-380,-16.1586705,98.736067
456,,,,OK,,37650,FRANCE,37-650,-60.995125,-7.396838
457,,,,NY,,33520,FRANCE,33-520,7.891058,-45.817069
458,,,,AR,,4600,FRANCE,04-600,30.5290895,-97.079249
459,,,,NH,,30090,FRANCE,30-090,34.6048645,178.466854
460,,,,AK,,2170,FRANCE,02-170,-7.2266335,-151.976596
461,,,,OH,,36470,FRANCE,36-470,44.5353725,-153.170994
462,,,,NC,,34270,FRANCE,34-270,-34.740432,-97.849956
463,,,,OH,,36250,FRANCE,36-250,-1.1749405,9.234168
464,,,,NJ,,31370,FRANCE,31-370,37.664003,106.162549
465,,,,TX,,45879,FRANCE,45-879,-56.0550145,-114.252156
466,,,,TX,,45780,FRANCE,45-780,14.69466,-156.43384
469,,,,VA,,49950,FRANCE,49-950,-43.7301175,-164.265473
470,,,,MO,,26650,FRANCE,26-650,-17.793043,157.66171
471,,,,OH,,36530,FRANCE,36-530,17.1918865,-59.607012
472,,,,LA,,19150,FRANCE,19-150,-18.181372,157.714561
473,,,,TX,,45770,FRANCE,45-770,82.8958305,175.09072
476,,,,FL,,10300,FRANCE,10-300,-24.389872,-0.805217
477,,,,ND,,35460,FRANCE,35-460,23.561595,124.303189
478,,,,TX,,45310,FRANCE,45-310,24.2715155,-106.913926
479,,,,KY,,18460,FRANCE,18-460,-38.864072,20.91846
480,,,,AL,,1490,FRANCE,01-490,49.062636,-146.365052
481,,,,IN,,15020,FRANCE,15-020,-14.2462085,136.105549
482,,,,LA,,19360,FRANCE,19-360,-34.0954415,94.59726
483,,,,TN,,44040,FRANCE,44-040,-74.8477705,-30.548563
484,,,,NC,,34450,FRANCE,34-450,-5.169306,165.620781
485,,,,IN,,15400,FRANCE,15-400,-56.0762495,79.516938
486,,,,CT,,7050,FRANCE,07-050,-11.792501,-93.407567
487,,,,GA,,11780,FRANCE,11-780,-72.2971695,-107.934351
489,,,,TX,,45581,FRANCE,45-581,47.593156,-59.889832
490,,,,CT,,7070,FRANCE,07-070,-22.136816,0.150607
491,,,,AL,,1020,FRANCE,01-020,-13.4478645,-12.24365
492,,,,NY,,33720,FRANCE,33-720,-87.635591,-164.845144
493,,,,OR,,38210,FRANCE,38-210,-66.999573,150.234678
494,,,,KY,,18981,FRANCE,18-981,-52.795613,124.689858
496,,,,WI,,52130,FRANCE,52-130,-36.4736285,-177.562281
497,,,,OR,,38080,FRANCE,38-080,75.560415,16.451627
498,,,,IN,,15330,FRANCE,15-330,-10.620769,-118.26799
499,,,,WI,,52440,FRANCE,52-440,-54.304903,-139.162815
500,,,,MA,,22010,FRANCE,22-010,-41.454531,161.281903
501,,,,MN,,24300,FRANCE,24-300,75.04163,147.876783
502,,,,MT,,27410,FRANCE,27-410,70.6511145,162.436262
503,,,,MS,,25000,FRANCE,25-000,6.619059,-173.62422
504,,,,TX,,45720,FRANCE,45-720,-14.316338,75.023582
505,,,,MI,,23610,FRANCE,23-610,-85.502676,-175.772082
506,,,,SC,,42100,FRANCE,42-100,-85.161738,-46.84444
507,,,,VA,,49200,FRANCE,49-200,-55.553756,39.450037
508,,,,OH,,36300,FRANCE,36-300,-69.004362,163.072666
509,,,,MO,,26230,FRANCE,26-230,-63.477248,79.000304
510,,,,IN,,15440,FRANCE,15-440,-24.3073865,126.549712
511,,,,VA,,49090,FRANCE,49-090,9.9279765,-67.226843
513,,,,MI,,23440,FRANCE,23-440,44.120589,110.295338
514,,,,MS,,25400,FRANCE,25-400,28.5284255,35.093326
515,,,,FL,,10580,FRANCE,10-580,12.311976,-0.785889
516,,,,IL,,14500,FRANCE,14-500,-77.1246345,87.308304
517,,,,LA,,19130,FRANCE,19-130,-54.1445705,-9.143359
518,,,,VA,,49011,FRANCE,49-011,38.8411995,179.496196
519,,,,OH,,36580,FRANCE,36-580,-62.4794735,143.10007
520,,,,KY,,18989,FRANCE,18-989,83.4759595,101.899905
521,,,,FL,,10040,FRANCE,10-040,-26.3365755,-169.347788
522,,,,LA,,19070,FRANCE,19-070,37.4376205,-54.898369
523,,,,DE,,8020,FRANCE,08-020,-74.0580145,118.188931
524,,,,KY,,18290,FRANCE,18-290,18.729568,-158.119966
525,,,,NY,,33690,FRANCE,33-690,-37.660894,110.791557
526,,,,AL,,1380,FRANCE,01-380,-38.764232,-104.163081
527,,,,KY,,18680,FRANCE,18-680,55.423993,-177.550732
528,,,,VA,,49711,FRANCE,49-711,-77.2849475,-22.763624
529,,,,ID,,13360,FRANCE,13-360,56.7365605,-24.505075
530,,,,NY,,33710,FRANCE,33-710,-2.1658605,168.957956
531,,,,TX,,45060,FRANCE,45-060,39.49025,-84.537365
532,,,,ID,,13130,FRANCE,13-130,85.1150215,-81.413651
533,,,,NM,,32280,FRANCE,32-280,-45.88592,-87.635104
534,,,,AR,,4280,FRANCE,04-280,-20.162004,-115.218678
535,,,,NC,,34460,FRANCE,34-460,56.166051,-114.912281
536,,,,PA,,39800,FRANCE,39-800,-28.5250455,108.069582
537,,,,UT,,46220,FRANCE,46-220,50.689566,-61.331763
538,,,,AZ,,3100,FRANCE,03-100,24.445999,-16.552453
539,,,,MT,,27550,FRANCE,27-550,-43.657881,96.06611
540,,,,TX,,45943,FRANCE,45-943,87.6286355,96.495254
541,,,,OH,,36780,FRANCE,36-780,-17.312756,112.212272
542,,,,IL,,14470,FRANCE,14-470,-35.375712,-133.508814
543,,,,WI,,52120,FRANCE,52-120,-11.997127,-107.634779
544,,,,IL,,14610,FRANCE,14-610,-49.3893745,-109.305887
545,,,,KY,,18410,FRANCE,18-410,16.464736,-157.457557
547,,,,KS,,17020,FRANCE,17-020,-9.537318,43.490075
548,,,,IL,,14640,FRANCE,14-640,-31.9145195,119.839253
549,,,,MI,,23690,FRANCE,23-690,-13.440935,-17.753574
550,,,,IL,,14670,FRANCE,14-670,-68.0408365,56.536738
552,,,,TX,,45480,FRANCE,45-480,17.2727395,156.499433
553,,,,NC,,34620,FRANCE,34-620,76.0077225,-7.672972
556,,,,CA,,5530,FRANCE,05-530,-19.7368335,-95.769238
557,,,,NJ,,31340,FRANCE,31-340,40.579124,-169.735566
559,,,,PA,,39000,FRANCE,39-000,22.512318,20.537079
561,,,,IL,,14986,FRANCE,14-986,-65.874697,174.114324
563,,,,NC,,34320,FRANCE,34-320,-41.1103585,-74.227436
564,,,,TN,,44860,FRANCE,44-860,-89.152543,-68.293397
565,,,,MN,,24010,FRANCE,24-010,-76.091185,-127.152125
566,,,,54,,54220,FRANCE,54-220,14.449286,-42.233473
568,,,,MO,,26090,FRANCE,26-090,43.247931,133.281784
569,,,,54,,54520,FRANCE,54-520,48.953586,-18.387075
570,,,,VA,,49580,FRANCE,49-580,23.959595,-49.402169
571,,,,CO,,6210,FRANCE,06-210,40.0156725,-106.366828
572,,,,MD,,21150,FRANCE,21-150,-20.5487665,68.165751
573,,,,TX,,45431,FRANCE,45-431,-71.7324865,48.902032
574,,,,TN,,44170,FRANCE,44-170,64.424348,-100.33519
575,,,,GA,,11660,FRANCE,11-660,-2.960977,-51.901002
576,,,,NM,,32230,FRANCE,32-230,5.055337,-23.251655
577,,,,MO,,26140,FRANCE,26-140,27.0660785,48.22808
580,,,,TN,,44270,FRANCE,44-270,16.852182,100.187394
581,,,,OK,,37570,FRANCE,37-570,-64.468297,160.397205
582,,,,OK,,37060,FRANCE,37-060,29.7252005,121.416886
583,,,,OR,,38070,FRANCE,38-070,-59.535359,12.020126
584,,,,MA,,22000,FRANCE,22-000,-75.572927,-79.672247
585,,,,ND,,35370,FRANCE,35-370,-71.1364355,-169.872859
587,,,,NM,,32190,FRANCE,32-190,-35.9161725,54.844221
588,,,,MS,,25330,FRANCE,25-330,26.155848,17.554168
590,,,,WI,,52150,FRANCE,52-150,24.768292,115.633992
591,,,,FL,,10650,FRANCE,10-650,-58.0150725,-53.765568
592,,,,SC,,42400,FRANCE,42-400,-46.181629,-9.536717
594,,,,MI,,23000,FRANCE,23-000,-66.341185,-170.434492
595,,,,MD,,21040,FRANCE,21-040,56.2934895,172.068643
596,,,,PA,,39540,FRANCE,39-540,-60.2397385,18.664892
597,,,,IN,,15350,FRANCE,15-350,-69.99394,144.898068
598,,,,AK,,2110,FRANCE,02-110,35.737766,-146.404825
599,,,,MD,,21030,FRANCE,21-030,24.0363245,117.723654
600,,,,CA,,5030,FRANCE,05-030,12.996104,-28.408566
601,,,,IN,,15310,FRANCE,15-310,59.6773685,-130.108759
603,,,,MI,,23400,FRANCE,23-400,0.464123,-43.781727
604,,,,OH,,36740,FRANCE,36-740,-50.990317,80.519489
605,,,,54,,54570,FRANCE,54-570,-48.526425,-30.529626
606,,,,IN,,15430,FRANCE,15-430,45.6501005,123.453349
608,,,,PA,,39150,FRANCE,39-150,-36.399672,77.427836
609,,,,OR,,38160,FRANCE,38-160,86.053751,-59.077171
611,,,,VA,,49641,FRANCE,49-641,-52.2955215,70.762636
612,,,,OH,,36720,FRANCE,36-720,-85.032754,68.348717
613,,,,TX,,45653,FRANCE,45-653,72.3659435,-164.824371
614,,,,IL,,14991,FRANCE,14-991,61.8827215,57.224254
615,,,,TN,,44150,FRANCE,44-150,4.1418545,-28.832843
617,,,,WV,,51400,FRANCE,51-400,43.4186515,-79.678875
618,,,,PA,,39480,FRANCE,39-480,77.2803325,-77.302865
619,,,,AL,,1070,FRANCE,01-070,70.782532,-66.996875
620,,,,WI,,52500,FRANCE,52-500,-20.539943,-86.7644
622,,,,GA,,11110,FRANCE,11-110,-37.2892425,169.581256
623,,,,NY,,33730,FRANCE,33-730,-28.376606,-110.285312
624,,,,VT,,47130,FRANCE,47-130,76.686433,-112.191713
