net {tokenring 50}
pl token_1(1)
pl idle_1(1)
pl idle_2(1)
pl idle_3(1)
pl idle_4(1)
pl idle_5(1)
pl idle_6(1)
pl idle_7(1)
pl idle_8(1)
pl idle_9(1)
pl idle_10(1)
pl idle_11(1)
pl idle_12(1)
pl idle_13(1)
pl idle_14(1)
pl idle_15(1)
pl idle_16(1)
pl idle_17(1)
pl idle_18(1)
pl idle_19(1)
pl idle_20(1)
pl idle_21(1)
pl idle_22(1)
pl idle_23(1)
pl idle_24(1)
pl idle_25(1)
pl idle_26(1)
pl idle_27(1)
pl idle_28(1)
pl idle_29(1)
pl idle_30(1)
pl idle_31(1)
pl idle_32(1)
pl idle_33(1)
pl idle_34(1)
pl idle_35(1)
pl idle_36(1)
pl idle_37(1)
pl idle_38(1)
pl idle_39(1)
pl idle_40(1)
pl idle_41(1)
pl idle_42(1)
pl idle_43(1)
pl idle_44(1)
pl idle_45(1)
pl idle_46(1)
pl idle_47(1)
pl idle_48(1)
pl idle_49(1)
pl idle_50(1)
tr 1_ask idle_1 -> wait_1
tr 1_work wait_1 -> cs_1
tr 1_rel cs_1 -> idle_1
tr 1_work  token_1 -> 
tr 1_rel  -> token_1
tr 1_exit  token_1 ->  after_1
tr 2_ask idle_2 -> wait_2
tr 2_work wait_2 -> cs_2
tr 2_rel cs_2 -> idle_2
tr 2_work  token_2 -> 
tr 2_rel  -> token_2
tr 2_exit  token_2 ->  after_2
tr 3_ask idle_3 -> wait_3
tr 3_work wait_3 -> cs_3
tr 3_rel cs_3 -> idle_3
tr 3_work  token_3 -> 
tr 3_rel  -> token_3
tr 3_exit  token_3 ->  after_3
tr 4_ask idle_4 -> wait_4
tr 4_work wait_4 -> cs_4
tr 4_rel cs_4 -> idle_4
tr 4_work  token_4 -> 
tr 4_rel  -> token_4
tr 4_exit  token_4 ->  after_4
tr 5_ask idle_5 -> wait_5
tr 5_work wait_5 -> cs_5
tr 5_rel cs_5 -> idle_5
tr 5_work  token_5 -> 
tr 5_rel  -> token_5
tr 5_exit  token_5 ->  after_5
tr 6_ask idle_6 -> wait_6
tr 6_work wait_6 -> cs_6
tr 6_rel cs_6 -> idle_6
tr 6_work  token_6 -> 
tr 6_rel  -> token_6
tr 6_exit  token_6 ->  after_6
tr 7_ask idle_7 -> wait_7
tr 7_work wait_7 -> cs_7
tr 7_rel cs_7 -> idle_7
tr 7_work  token_7 -> 
tr 7_rel  -> token_7
tr 7_exit  token_7 ->  after_7
tr 8_ask idle_8 -> wait_8
tr 8_work wait_8 -> cs_8
tr 8_rel cs_8 -> idle_8
tr 8_work  token_8 -> 
tr 8_rel  -> token_8
tr 8_exit  token_8 ->  after_8
tr 9_ask idle_9 -> wait_9
tr 9_work wait_9 -> cs_9
tr 9_rel cs_9 -> idle_9
tr 9_work  token_9 -> 
tr 9_rel  -> token_9
tr 9_exit  token_9 ->  after_9
tr 10_ask idle_10 -> wait_10
tr 10_work wait_10 -> cs_10
tr 10_rel cs_10 -> idle_10
tr 10_work  token_10 -> 
tr 10_rel  -> token_10
tr 10_exit  token_10 ->  after_10
tr 11_ask idle_11 -> wait_11
tr 11_work wait_11 -> cs_11
tr 11_rel cs_11 -> idle_11
tr 11_work  token_11 -> 
tr 11_rel  -> token_11
tr 11_exit  token_11 ->  after_11
tr 12_ask idle_12 -> wait_12
tr 12_work wait_12 -> cs_12
tr 12_rel cs_12 -> idle_12
tr 12_work  token_12 -> 
tr 12_rel  -> token_12
tr 12_exit  token_12 ->  after_12
tr 13_ask idle_13 -> wait_13
tr 13_work wait_13 -> cs_13
tr 13_rel cs_13 -> idle_13
tr 13_work  token_13 -> 
tr 13_rel  -> token_13
tr 13_exit  token_13 ->  after_13
tr 14_ask idle_14 -> wait_14
tr 14_work wait_14 -> cs_14
tr 14_rel cs_14 -> idle_14
tr 14_work  token_14 -> 
tr 14_rel  -> token_14
tr 14_exit  token_14 ->  after_14
tr 15_ask idle_15 -> wait_15
tr 15_work wait_15 -> cs_15
tr 15_rel cs_15 -> idle_15
tr 15_work  token_15 -> 
tr 15_rel  -> token_15
tr 15_exit  token_15 ->  after_15
tr 16_ask idle_16 -> wait_16
tr 16_work wait_16 -> cs_16
tr 16_rel cs_16 -> idle_16
tr 16_work  token_16 -> 
tr 16_rel  -> token_16
tr 16_exit  token_16 ->  after_16
tr 17_ask idle_17 -> wait_17
tr 17_work wait_17 -> cs_17
tr 17_rel cs_17 -> idle_17
tr 17_work  token_17 -> 
tr 17_rel  -> token_17
tr 17_exit  token_17 ->  after_17
tr 18_ask idle_18 -> wait_18
tr 18_work wait_18 -> cs_18
tr 18_rel cs_18 -> idle_18
tr 18_work  token_18 -> 
tr 18_rel  -> token_18
tr 18_exit  token_18 ->  after_18
tr 19_ask idle_19 -> wait_19
tr 19_work wait_19 -> cs_19
tr 19_rel cs_19 -> idle_19
tr 19_work  token_19 -> 
tr 19_rel  -> token_19
tr 19_exit  token_19 ->  after_19
tr 20_ask idle_20 -> wait_20
tr 20_work wait_20 -> cs_20
tr 20_rel cs_20 -> idle_20
tr 20_work  token_20 -> 
tr 20_rel  -> token_20
tr 20_exit  token_20 ->  after_20
tr 21_ask idle_21 -> wait_21
tr 21_work wait_21 -> cs_21
tr 21_rel cs_21 -> idle_21
tr 21_work  token_21 -> 
tr 21_rel  -> token_21
tr 21_exit  token_21 ->  after_21
tr 22_ask idle_22 -> wait_22
tr 22_work wait_22 -> cs_22
tr 22_rel cs_22 -> idle_22
tr 22_work  token_22 -> 
tr 22_rel  -> token_22
tr 22_exit  token_22 ->  after_22
tr 23_ask idle_23 -> wait_23
tr 23_work wait_23 -> cs_23
tr 23_rel cs_23 -> idle_23
tr 23_work  token_23 -> 
tr 23_rel  -> token_23
tr 23_exit  token_23 ->  after_23
tr 24_ask idle_24 -> wait_24
tr 24_work wait_24 -> cs_24
tr 24_rel cs_24 -> idle_24
tr 24_work  token_24 -> 
tr 24_rel  -> token_24
tr 24_exit  token_24 ->  after_24
tr 25_ask idle_25 -> wait_25
tr 25_work wait_25 -> cs_25
tr 25_rel cs_25 -> idle_25
tr 25_work  token_25 -> 
tr 25_rel  -> token_25
tr 25_exit  token_25 ->  after_25
tr 26_ask idle_26 -> wait_26
tr 26_work wait_26 -> cs_26
tr 26_rel cs_26 -> idle_26
tr 26_work  token_26 -> 
tr 26_rel  -> token_26
tr 26_exit  token_26 ->  after_26
tr 27_ask idle_27 -> wait_27
tr 27_work wait_27 -> cs_27
tr 27_rel cs_27 -> idle_27
tr 27_work  token_27 -> 
tr 27_rel  -> token_27
tr 27_exit  token_27 ->  after_27
tr 28_ask idle_28 -> wait_28
tr 28_work wait_28 -> cs_28
tr 28_rel cs_28 -> idle_28
tr 28_work  token_28 -> 
tr 28_rel  -> token_28
tr 28_exit  token_28 ->  after_28
tr 29_ask idle_29 -> wait_29
tr 29_work wait_29 -> cs_29
tr 29_rel cs_29 -> idle_29
tr 29_work  token_29 -> 
tr 29_rel  -> token_29
tr 29_exit  token_29 ->  after_29
tr 30_ask idle_30 -> wait_30
tr 30_work wait_30 -> cs_30
tr 30_rel cs_30 -> idle_30
tr 30_work  token_30 -> 
tr 30_rel  -> token_30
tr 30_exit  token_30 ->  after_30
tr 31_ask idle_31 -> wait_31
tr 31_work wait_31 -> cs_31
tr 31_rel cs_31 -> idle_31
tr 31_work  token_31 -> 
tr 31_rel  -> token_31
tr 31_exit  token_31 ->  after_31
tr 32_ask idle_32 -> wait_32
tr 32_work wait_32 -> cs_32
tr 32_rel cs_32 -> idle_32
tr 32_work  token_32 -> 
tr 32_rel  -> token_32
tr 32_exit  token_32 ->  after_32
tr 33_ask idle_33 -> wait_33
tr 33_work wait_33 -> cs_33
tr 33_rel cs_33 -> idle_33
tr 33_work  token_33 -> 
tr 33_rel  -> token_33
tr 33_exit  token_33 ->  after_33
tr 34_ask idle_34 -> wait_34
tr 34_work wait_34 -> cs_34
tr 34_rel cs_34 -> idle_34
tr 34_work  token_34 -> 
tr 34_rel  -> token_34
tr 34_exit  token_34 ->  after_34
tr 35_ask idle_35 -> wait_35
tr 35_work wait_35 -> cs_35
tr 35_rel cs_35 -> idle_35
tr 35_work  token_35 -> 
tr 35_rel  -> token_35
tr 35_exit  token_35 ->  after_35
tr 36_ask idle_36 -> wait_36
tr 36_work wait_36 -> cs_36
tr 36_rel cs_36 -> idle_36
tr 36_work  token_36 -> 
tr 36_rel  -> token_36
tr 36_exit  token_36 ->  after_36
tr 37_ask idle_37 -> wait_37
tr 37_work wait_37 -> cs_37
tr 37_rel cs_37 -> idle_37
tr 37_work  token_37 -> 
tr 37_rel  -> token_37
tr 37_exit  token_37 ->  after_37
tr 38_ask idle_38 -> wait_38
tr 38_work wait_38 -> cs_38
tr 38_rel cs_38 -> idle_38
tr 38_work  token_38 -> 
tr 38_rel  -> token_38
tr 38_exit  token_38 ->  after_38
tr 39_ask idle_39 -> wait_39
tr 39_work wait_39 -> cs_39
tr 39_rel cs_39 -> idle_39
tr 39_work  token_39 -> 
tr 39_rel  -> token_39
tr 39_exit  token_39 ->  after_39
tr 40_ask idle_40 -> wait_40
tr 40_work wait_40 -> cs_40
tr 40_rel cs_40 -> idle_40
tr 40_work  token_40 -> 
tr 40_rel  -> token_40
tr 40_exit  token_40 ->  after_40
tr 41_ask idle_41 -> wait_41
tr 41_work wait_41 -> cs_41
tr 41_rel cs_41 -> idle_41
tr 41_work  token_41 -> 
tr 41_rel  -> token_41
tr 41_exit  token_41 ->  after_41
tr 42_ask idle_42 -> wait_42
tr 42_work wait_42 -> cs_42
tr 42_rel cs_42 -> idle_42
tr 42_work  token_42 -> 
tr 42_rel  -> token_42
tr 42_exit  token_42 ->  after_42
tr 43_ask idle_43 -> wait_43
tr 43_work wait_43 -> cs_43
tr 43_rel cs_43 -> idle_43
tr 43_work  token_43 -> 
tr 43_rel  -> token_43
tr 43_exit  token_43 ->  after_43
tr 44_ask idle_44 -> wait_44
tr 44_work wait_44 -> cs_44
tr 44_rel cs_44 -> idle_44
tr 44_work  token_44 -> 
tr 44_rel  -> token_44
tr 44_exit  token_44 ->  after_44
tr 45_ask idle_45 -> wait_45
tr 45_work wait_45 -> cs_45
tr 45_rel cs_45 -> idle_45
tr 45_work  token_45 -> 
tr 45_rel  -> token_45
tr 45_exit  token_45 ->  after_45
tr 46_ask idle_46 -> wait_46
tr 46_work wait_46 -> cs_46
tr 46_rel cs_46 -> idle_46
tr 46_work  token_46 -> 
tr 46_rel  -> token_46
tr 46_exit  token_46 ->  after_46
tr 47_ask idle_47 -> wait_47
tr 47_work wait_47 -> cs_47
tr 47_rel cs_47 -> idle_47
tr 47_work  token_47 -> 
tr 47_rel  -> token_47
tr 47_exit  token_47 ->  after_47
tr 48_ask idle_48 -> wait_48
tr 48_work wait_48 -> cs_48
tr 48_rel cs_48 -> idle_48
tr 48_work  token_48 -> 
tr 48_rel  -> token_48
tr 48_exit  token_48 ->  after_48
tr 49_ask idle_49 -> wait_49
tr 49_work wait_49 -> cs_49
tr 49_rel cs_49 -> idle_49
tr 49_work  token_49 -> 
tr 49_rel  -> token_49
tr 49_exit  token_49 ->  after_49
tr 50_ask idle_50 -> wait_50
tr 50_work wait_50 -> cs_50
tr 50_rel cs_50 -> idle_50
tr 50_work  token_50 -> 
tr 50_rel  -> token_50
tr 50_exit  token_50 ->  after_50
tr 2_entry after_1 -> token_2
tr 3_entry after_2 -> token_3
tr 4_entry after_3 -> token_4
tr 5_entry after_4 -> token_5
tr 6_entry after_5 -> token_6
tr 7_entry after_6 -> token_7
tr 8_entry after_7 -> token_8
tr 9_entry after_8 -> token_9
tr 10_entry after_9 -> token_10
tr 11_entry after_10 -> token_11
tr 12_entry after_11 -> token_12
tr 13_entry after_12 -> token_13
tr 14_entry after_13 -> token_14
tr 15_entry after_14 -> token_15
tr 16_entry after_15 -> token_16
tr 17_entry after_16 -> token_17
tr 18_entry after_17 -> token_18
tr 19_entry after_18 -> token_19
tr 20_entry after_19 -> token_20
tr 21_entry after_20 -> token_21
tr 22_entry after_21 -> token_22
tr 23_entry after_22 -> token_23
tr 24_entry after_23 -> token_24
tr 25_entry after_24 -> token_25
tr 26_entry after_25 -> token_26
tr 27_entry after_26 -> token_27
tr 28_entry after_27 -> token_28
tr 29_entry after_28 -> token_29
tr 30_entry after_29 -> token_30
tr 31_entry after_30 -> token_31
tr 32_entry after_31 -> token_32
tr 33_entry after_32 -> token_33
tr 34_entry after_33 -> token_34
tr 35_entry after_34 -> token_35
tr 36_entry after_35 -> token_36
tr 37_entry after_36 -> token_37
tr 38_entry after_37 -> token_38
tr 39_entry after_38 -> token_39
tr 40_entry after_39 -> token_40
tr 41_entry after_40 -> token_41
tr 42_entry after_41 -> token_42
tr 43_entry after_42 -> token_43
tr 44_entry after_43 -> token_44
tr 45_entry after_44 -> token_45
tr 46_entry after_45 -> token_46
tr 47_entry after_46 -> token_47
tr 48_entry after_47 -> token_48
tr 49_entry after_48 -> token_49
tr 50_entry after_49 -> token_50
tr 1_entry after_50 -> token_1
