## Classes partagées avec cl1.net
pl Cl1_G2_req
pl G2_Cl1_ack
pl Cl1_G2_release
## Classes propres au gestionnaire
pl G2_ressource (1)
pl G2_wait_Cl1

tr G2_req Cl1_G2_req G2_ressource -> G2_Cl1_ack G2_wait_Cl1
tr G2_lib Cl1_G2_release G2_wait_Cl1 -> G2_ressource
