## Classes propres au gestionnaire
pl G2_ressource (1)
pl G2_wait_Cl1
pl G2_Cl1_ack

tr take_G2_Cl1 G2_ressource -> G2_wait_Cl1 G2_Cl1_ack
tr Cl1_enter G2_Cl1_ack ->
tr release_G2_Cl1 G2_wait_Cl1 -> G2_ressource
