<?xml version="1.0" encoding="utf-8"?>
<svg xmlns="http://www.w3.org/2000/svg" xmlns:xlink="http://www.w3.org/1999/xlink" width="600" height="400" viewBox="0 0 2400 1600">
<defs>
  <clipPath id="clip040">
    <rect x="0" y="0" width="2400" height="1600"/>
  </clipPath>
</defs>
<path clip-path="url(#clip040)" d="M0 1600 L2400 1600 L2400 0 L0 0  Z" fill="#ffffff" fill-rule="evenodd" fill-opacity="1"/>
<defs>
  <clipPath id="clip041">
    <rect x="480" y="0" width="1681" height="1600"/>
  </clipPath>
</defs>
<path clip-path="url(#clip040)" d="M172.015 1486.45 L2352.76 1486.45 L2352.76 47.2441 L172.015 47.2441  Z" fill="#ffffff" fill-rule="evenodd" fill-opacity="1"/>
<defs>
  <clipPath id="clip042">
    <rect x="172" y="47" width="2182" height="1440"/>
  </clipPath>
</defs>
<polyline clip-path="url(#clip042)" style="stroke:#000000; stroke-linecap:round; stroke-linejoin:round; stroke-width:2; stroke-opacity:0.1; fill:none" points="213.161,1486.45 213.161,47.2441 "/>
<polyline clip-path="url(#clip042)" style="stroke:#000000; stroke-linecap:round; stroke-linejoin:round; stroke-width:2; stroke-opacity:0.1; fill:none" points="727.487,1486.45 727.487,47.2441 "/>
<polyline clip-path="url(#clip042)" style="stroke:#000000; stroke-linecap:round; stroke-linejoin:round; stroke-width:2; stroke-opacity:0.1; fill:none" points="1241.81,1486.45 1241.81,47.2441 "/>
<polyline clip-path="url(#clip042)" style="stroke:#000000; stroke-linecap:round; stroke-linejoin:round; stroke-width:2; stroke-opacity:0.1; fill:none" points="1756.14,1486.45 1756.14,47.2441 "/>
<polyline clip-path="url(#clip042)" style="stroke:#000000; stroke-linecap:round; stroke-linejoin:round; stroke-width:2; stroke-opacity:0.1; fill:none" points="2270.46,1486.45 2270.46,47.2441 "/>
<polyline clip-path="url(#clip040)" style="stroke:#000000; stroke-linecap:round; stroke-linejoin:round; stroke-width:4; stroke-opacity:1; fill:none" points="172.015,1486.45 2352.76,1486.45 "/>
<polyline clip-path="url(#clip040)" style="stroke:#000000; stroke-linecap:round; stroke-linejoin:round; stroke-width:4; stroke-opacity:1; fill:none" points="213.161,1486.45 213.161,1467.55 "/>
<polyline clip-path="url(#clip040)" style="stroke:#000000; stroke-linecap:round; stroke-linejoin:round; stroke-width:4; stroke-opacity:1; fill:none" points="727.487,1486.45 727.487,1467.55 "/>
<polyline clip-path="url(#clip040)" style="stroke:#000000; stroke-linecap:round; stroke-linejoin:round; stroke-width:4; stroke-opacity:1; fill:none" points="1241.81,1486.45 1241.81,1467.55 "/>
<polyline clip-path="url(#clip040)" style="stroke:#000000; stroke-linecap:round; stroke-linejoin:round; stroke-width:4; stroke-opacity:1; fill:none" points="1756.14,1486.45 1756.14,1467.55 "/>
<polyline clip-path="url(#clip040)" style="stroke:#000000; stroke-linecap:round; stroke-linejoin:round; stroke-width:4; stroke-opacity:1; fill:none" points="2270.46,1486.45 2270.46,1467.55 "/>
<path clip-path="url(#clip040)" d="M213.161 1517.37 Q209.55 1517.37 207.721 1520.93 Q205.916 1524.47 205.916 1531.6 Q205.916 1538.71 207.721 1542.27 Q209.55 1545.82 213.161 1545.82 Q216.795 1545.82 218.601 1542.27 Q220.429 1538.71 220.429 1531.6 Q220.429 1524.47 218.601 1520.93 Q216.795 1517.37 213.161 1517.37 M213.161 1513.66 Q218.971 1513.66 222.027 1518.27 Q225.105 1522.85 225.105 1531.6 Q225.105 1540.33 222.027 1544.94 Q218.971 1549.52 213.161 1549.52 Q207.351 1549.52 204.272 1544.94 Q201.216 1540.33 201.216 1531.6 Q201.216 1522.85 204.272 1518.27 Q207.351 1513.66 213.161 1513.66 Z" fill="#000000" fill-rule="nonzero" fill-opacity="1" /><path clip-path="url(#clip040)" d="M706.758 1544.91 L723.077 1544.91 L723.077 1548.85 L701.133 1548.85 L701.133 1544.91 Q703.795 1542.16 708.378 1537.53 Q712.984 1532.88 714.165 1531.53 Q716.41 1529.01 717.29 1527.27 Q718.193 1525.51 718.193 1523.82 Q718.193 1521.07 716.248 1519.33 Q714.327 1517.6 711.225 1517.6 Q709.026 1517.6 706.572 1518.36 Q704.142 1519.13 701.364 1520.68 L701.364 1515.95 Q704.188 1514.82 706.642 1514.24 Q709.095 1513.66 711.133 1513.66 Q716.503 1513.66 719.697 1516.35 Q722.892 1519.03 722.892 1523.52 Q722.892 1525.65 722.082 1527.57 Q721.295 1529.47 719.188 1532.07 Q718.609 1532.74 715.508 1535.95 Q712.406 1539.15 706.758 1544.91 Z" fill="#000000" fill-rule="nonzero" fill-opacity="1" /><path clip-path="url(#clip040)" d="M732.938 1514.29 L751.294 1514.29 L751.294 1518.22 L737.22 1518.22 L737.22 1526.7 Q738.239 1526.35 739.257 1526.19 Q740.276 1526 741.294 1526 Q747.081 1526 750.461 1529.17 Q753.841 1532.34 753.841 1537.76 Q753.841 1543.34 750.368 1546.44 Q746.896 1549.52 740.577 1549.52 Q738.401 1549.52 736.132 1549.15 Q733.887 1548.78 731.48 1548.04 L731.48 1543.34 Q733.563 1544.47 735.785 1545.03 Q738.007 1545.58 740.484 1545.58 Q744.489 1545.58 746.827 1543.48 Q749.165 1541.37 749.165 1537.76 Q749.165 1534.15 746.827 1532.04 Q744.489 1529.94 740.484 1529.94 Q738.609 1529.94 736.734 1530.35 Q734.882 1530.77 732.938 1531.65 L732.938 1514.29 Z" fill="#000000" fill-rule="nonzero" fill-opacity="1" /><path clip-path="url(#clip040)" d="M1216.51 1514.29 L1234.87 1514.29 L1234.87 1518.22 L1220.79 1518.22 L1220.79 1526.7 Q1221.81 1526.35 1222.83 1526.19 Q1223.85 1526 1224.87 1526 Q1230.65 1526 1234.03 1529.17 Q1237.41 1532.34 1237.41 1537.76 Q1237.41 1543.34 1233.94 1546.44 Q1230.47 1549.52 1224.15 1549.52 Q1221.97 1549.52 1219.71 1549.15 Q1217.46 1548.78 1215.05 1548.04 L1215.05 1543.34 Q1217.14 1544.47 1219.36 1545.03 Q1221.58 1545.58 1224.06 1545.58 Q1228.06 1545.58 1230.4 1543.48 Q1232.74 1541.37 1232.74 1537.76 Q1232.74 1534.15 1230.4 1532.04 Q1228.06 1529.94 1224.06 1529.94 Q1222.18 1529.94 1220.31 1530.35 Q1218.46 1530.77 1216.51 1531.65 L1216.51 1514.29 Z" fill="#000000" fill-rule="nonzero" fill-opacity="1" /><path clip-path="url(#clip040)" d="M1256.63 1517.37 Q1253.02 1517.37 1251.19 1520.93 Q1249.38 1524.47 1249.38 1531.6 Q1249.38 1538.71 1251.19 1542.27 Q1253.02 1545.82 1256.63 1545.82 Q1260.26 1545.82 1262.07 1542.27 Q1263.9 1538.71 1263.9 1531.6 Q1263.9 1524.47 1262.07 1520.93 Q1260.26 1517.37 1256.63 1517.37 M1256.63 1513.66 Q1262.44 1513.66 1265.49 1518.27 Q1268.57 1522.85 1268.57 1531.6 Q1268.57 1540.33 1265.49 1544.94 Q1262.44 1549.52 1256.63 1549.52 Q1250.82 1549.52 1247.74 1544.94 Q1244.68 1540.33 1244.68 1531.6 Q1244.68 1522.85 1247.74 1518.27 Q1250.82 1513.66 1256.63 1513.66 Z" fill="#000000" fill-rule="nonzero" fill-opacity="1" /><path clip-path="url(#clip040)" d="M1729.99 1514.29 L1752.21 1514.29 L1752.21 1516.28 L1739.67 1548.85 L1734.78 1548.85 L1746.59 1518.22 L1729.99 1518.22 L1729.99 1514.29 Z" fill="#000000" fill-rule="nonzero" fill-opacity="1" /><path clip-path="url(#clip040)" d="M1761.38 1514.29 L1779.74 1514.29 L1779.74 1518.22 L1765.66 1518.22 L1765.66 1526.7 Q1766.68 1526.35 1767.7 1526.19 Q1768.72 1526 1769.74 1526 Q1775.52 1526 1778.9 1529.17 Q1782.28 1532.34 1782.28 1537.76 Q1782.28 1543.34 1778.81 1546.44 Q1775.34 1549.52 1769.02 1549.52 Q1766.84 1549.52 1764.58 1549.15 Q1762.33 1548.78 1759.92 1548.04 L1759.92 1543.34 Q1762.01 1544.47 1764.23 1545.03 Q1766.45 1545.58 1768.93 1545.58 Q1772.93 1545.58 1775.27 1543.48 Q1777.61 1541.37 1777.61 1537.76 Q1777.61 1534.15 1775.27 1532.04 Q1772.93 1529.94 1768.93 1529.94 Q1767.05 1529.94 1765.18 1530.35 Q1763.33 1530.77 1761.38 1531.65 L1761.38 1514.29 Z" fill="#000000" fill-rule="nonzero" fill-opacity="1" /><path clip-path="url(#clip040)" d="M2230.07 1544.91 L2237.71 1544.91 L2237.71 1518.55 L2229.4 1520.21 L2229.4 1515.95 L2237.66 1514.29 L2242.34 1514.29 L2242.34 1544.91 L2249.98 1544.91 L2249.98 1548.85 L2230.07 1548.85 L2230.07 1544.91 Z" fill="#000000" fill-rule="nonzero" fill-opacity="1" /><path clip-path="url(#clip040)" d="M2269.42 1517.37 Q2265.81 1517.37 2263.98 1520.93 Q2262.18 1524.47 2262.18 1531.6 Q2262.18 1538.71 2263.98 1542.27 Q2265.81 1545.82 2269.42 1545.82 Q2273.06 1545.82 2274.86 1542.27 Q2276.69 1538.71 2276.69 1531.6 Q2276.69 1524.47 2274.86 1520.93 Q2273.06 1517.37 2269.42 1517.37 M2269.42 1513.66 Q2275.23 1513.66 2278.29 1518.27 Q2281.37 1522.85 2281.37 1531.6 Q2281.37 1540.33 2278.29 1544.94 Q2275.23 1549.52 2269.42 1549.52 Q2263.61 1549.52 2260.53 1544.94 Q2257.48 1540.33 2257.48 1531.6 Q2257.48 1522.85 2260.53 1518.27 Q2263.61 1513.66 2269.42 1513.66 Z" fill="#000000" fill-rule="nonzero" fill-opacity="1" /><path clip-path="url(#clip040)" d="M2299.58 1517.37 Q2295.97 1517.37 2294.14 1520.93 Q2292.34 1524.47 2292.34 1531.6 Q2292.34 1538.71 2294.14 1542.27 Q2295.97 1545.82 2299.58 1545.82 Q2303.22 1545.82 2305.02 1542.27 Q2306.85 1538.71 2306.85 1531.6 Q2306.85 1524.47 2305.02 1520.93 Q2303.22 1517.37 2299.58 1517.37 M2299.58 1513.66 Q2305.39 1513.66 2308.45 1518.27 Q2311.53 1522.85 2311.53 1531.6 Q2311.53 1540.33 2308.45 1544.94 Q2305.39 1549.52 2299.58 1549.52 Q2293.77 1549.52 2290.7 1544.94 Q2287.64 1540.33 2287.64 1531.6 Q2287.64 1522.85 2290.7 1518.27 Q2293.77 1513.66 2299.58 1513.66 Z" fill="#000000" fill-rule="nonzero" fill-opacity="1" /><polyline clip-path="url(#clip042)" style="stroke:#000000; stroke-linecap:round; stroke-linejoin:round; stroke-width:2; stroke-opacity:0.1; fill:none" points="172.015,1445.72 2352.76,1445.72 "/>
<polyline clip-path="url(#clip042)" style="stroke:#000000; stroke-linecap:round; stroke-linejoin:round; stroke-width:2; stroke-opacity:0.1; fill:none" points="172.015,1095.78 2352.76,1095.78 "/>
<polyline clip-path="url(#clip042)" style="stroke:#000000; stroke-linecap:round; stroke-linejoin:round; stroke-width:2; stroke-opacity:0.1; fill:none" points="172.015,745.85 2352.76,745.85 "/>
<polyline clip-path="url(#clip042)" style="stroke:#000000; stroke-linecap:round; stroke-linejoin:round; stroke-width:2; stroke-opacity:0.1; fill:none" points="172.015,395.917 2352.76,395.917 "/>
<polyline clip-path="url(#clip040)" style="stroke:#000000; stroke-linecap:round; stroke-linejoin:round; stroke-width:4; stroke-opacity:1; fill:none" points="172.015,1486.45 172.015,47.2441 "/>
<polyline clip-path="url(#clip040)" style="stroke:#000000; stroke-linecap:round; stroke-linejoin:round; stroke-width:4; stroke-opacity:1; fill:none" points="172.015,1445.72 190.912,1445.72 "/>
<polyline clip-path="url(#clip040)" style="stroke:#000000; stroke-linecap:round; stroke-linejoin:round; stroke-width:4; stroke-opacity:1; fill:none" points="172.015,1095.78 190.912,1095.78 "/>
<polyline clip-path="url(#clip040)" style="stroke:#000000; stroke-linecap:round; stroke-linejoin:round; stroke-width:4; stroke-opacity:1; fill:none" points="172.015,745.85 190.912,745.85 "/>
<polyline clip-path="url(#clip040)" style="stroke:#000000; stroke-linecap:round; stroke-linejoin:round; stroke-width:4; stroke-opacity:1; fill:none" points="172.015,395.917 190.912,395.917 "/>
<path clip-path="url(#clip040)" d="M124.07 1431.51 Q120.459 1431.51 118.631 1435.08 Q116.825 1438.62 116.825 1445.75 Q116.825 1452.86 118.631 1456.42 Q120.459 1459.96 124.07 1459.96 Q127.705 1459.96 129.51 1456.42 Q131.339 1452.86 131.339 1445.75 Q131.339 1438.62 129.51 1435.08 Q127.705 1431.51 124.07 1431.51 M124.07 1427.81 Q129.881 1427.81 132.936 1432.42 Q136.015 1437 136.015 1445.75 Q136.015 1454.48 132.936 1459.08 Q129.881 1463.67 124.07 1463.67 Q118.26 1463.67 115.182 1459.08 Q112.126 1454.48 112.126 1445.75 Q112.126 1437 115.182 1432.42 Q118.26 1427.81 124.07 1427.81 Z" fill="#000000" fill-rule="nonzero" fill-opacity="1" /><path clip-path="url(#clip040)" d="M57.7745 1109.13 L74.0939 1109.13 L74.0939 1113.06 L52.1495 1113.06 L52.1495 1109.13 Q54.8115 1106.37 59.3949 1101.74 Q64.0013 1097.09 65.1819 1095.75 Q67.4272 1093.22 68.3068 1091.49 Q69.2096 1089.73 69.2096 1088.04 Q69.2096 1085.29 67.2652 1083.55 Q65.3439 1081.81 62.2421 1081.81 Q60.043 1081.81 57.5893 1082.58 Q55.1588 1083.34 52.381 1084.89 L52.381 1080.17 Q55.2051 1079.04 57.6588 1078.46 Q60.1124 1077.88 62.1495 1077.88 Q67.5198 1077.88 70.7142 1080.56 Q73.9087 1083.25 73.9087 1087.74 Q73.9087 1089.87 73.0985 1091.79 Q72.3115 1093.69 70.205 1096.28 Q69.6263 1096.95 66.5245 1100.17 Q63.4226 1103.36 57.7745 1109.13 Z" fill="#000000" fill-rule="nonzero" fill-opacity="1" /><path clip-path="url(#clip040)" d="M93.9086 1081.58 Q90.2975 1081.58 88.4688 1085.15 Q86.6632 1088.69 86.6632 1095.82 Q86.6632 1102.92 88.4688 1106.49 Q90.2975 1110.03 93.9086 1110.03 Q97.5428 1110.03 99.3483 1106.49 Q101.177 1102.92 101.177 1095.82 Q101.177 1088.69 99.3483 1085.15 Q97.5428 1081.58 93.9086 1081.58 M93.9086 1077.88 Q99.7187 1077.88 102.774 1082.48 Q105.853 1087.07 105.853 1095.82 Q105.853 1104.54 102.774 1109.15 Q99.7187 1113.73 93.9086 1113.73 Q88.0984 1113.73 85.0197 1109.15 Q81.9642 1104.54 81.9642 1095.82 Q81.9642 1087.07 85.0197 1082.48 Q88.0984 1077.88 93.9086 1077.88 Z" fill="#000000" fill-rule="nonzero" fill-opacity="1" /><path clip-path="url(#clip040)" d="M124.07 1081.58 Q120.459 1081.58 118.631 1085.15 Q116.825 1088.69 116.825 1095.82 Q116.825 1102.92 118.631 1106.49 Q120.459 1110.03 124.07 1110.03 Q127.705 1110.03 129.51 1106.49 Q131.339 1102.92 131.339 1095.82 Q131.339 1088.69 129.51 1085.15 Q127.705 1081.58 124.07 1081.58 M124.07 1077.88 Q129.881 1077.88 132.936 1082.48 Q136.015 1087.07 136.015 1095.82 Q136.015 1104.54 132.936 1109.15 Q129.881 1113.73 124.07 1113.73 Q118.26 1113.73 115.182 1109.15 Q112.126 1104.54 112.126 1095.82 Q112.126 1087.07 115.182 1082.48 Q118.26 1077.88 124.07 1077.88 Z" fill="#000000" fill-rule="nonzero" fill-opacity="1" /><path clip-path="url(#clip040)" d="M66.5939 732.644 L54.7884 751.093 L66.5939 751.093 L66.5939 732.644 M65.367 728.57 L71.2466 728.57 L71.2466 751.093 L76.1772 751.093 L76.1772 754.982 L71.2466 754.982 L71.2466 763.13 L66.5939 763.13 L66.5939 754.982 L50.9921 754.982 L50.9921 750.468 L65.367 728.57 Z" fill="#000000" fill-rule="nonzero" fill-opacity="1" /><path clip-path="url(#clip040)" d="M93.9086 731.649 Q90.2975 731.649 88.4688 735.213 Q86.6632 738.755 86.6632 745.885 Q86.6632 752.991 88.4688 756.556 Q90.2975 760.098 93.9086 760.098 Q97.5428 760.098 99.3483 756.556 Q101.177 752.991 101.177 745.885 Q101.177 738.755 99.3483 735.213 Q97.5428 731.649 93.9086 731.649 M93.9086 727.945 Q99.7187 727.945 102.774 732.551 Q105.853 737.135 105.853 745.885 Q105.853 754.612 102.774 759.218 Q99.7187 763.801 93.9086 763.801 Q88.0984 763.801 85.0197 759.218 Q81.9642 754.612 81.9642 745.885 Q81.9642 737.135 85.0197 732.551 Q88.0984 727.945 93.9086 727.945 Z" fill="#000000" fill-rule="nonzero" fill-opacity="1" /><path clip-path="url(#clip040)" d="M124.07 731.649 Q120.459 731.649 118.631 735.213 Q116.825 738.755 116.825 745.885 Q116.825 752.991 118.631 756.556 Q120.459 760.098 124.07 760.098 Q127.705 760.098 129.51 756.556 Q131.339 752.991 131.339 745.885 Q131.339 738.755 129.51 735.213 Q127.705 731.649 124.07 731.649 M124.07 727.945 Q129.881 727.945 132.936 732.551 Q136.015 737.135 136.015 745.885 Q136.015 754.612 132.936 759.218 Q129.881 763.801 124.07 763.801 Q118.26 763.801 115.182 759.218 Q112.126 754.612 112.126 745.885 Q112.126 737.135 115.182 732.551 Q118.26 727.945 124.07 727.945 Z" fill="#000000" fill-rule="nonzero" fill-opacity="1" /><path clip-path="url(#clip040)" d="M64.3254 394.054 Q61.1773 394.054 59.3254 396.207 Q57.4967 398.359 57.4967 402.109 Q57.4967 405.836 59.3254 408.012 Q61.1773 410.165 64.3254 410.165 Q67.4735 410.165 69.3022 408.012 Q71.1541 405.836 71.1541 402.109 Q71.1541 398.359 69.3022 396.207 Q67.4735 394.054 64.3254 394.054 M73.6077 379.401 L73.6077 383.66 Q71.8485 382.827 70.0429 382.387 Q68.2606 381.947 66.5013 381.947 Q61.8717 381.947 59.418 385.072 Q56.9875 388.197 56.6402 394.517 Q58.006 392.503 60.0662 391.438 Q62.1263 390.35 64.6032 390.35 Q69.8115 390.35 72.8207 393.521 Q75.8531 396.669 75.8531 402.109 Q75.8531 407.433 72.705 410.651 Q69.5568 413.868 64.3254 413.868 Q58.33 413.868 55.1588 409.285 Q51.9875 404.679 51.9875 395.952 Q51.9875 387.757 55.8764 382.896 Q59.7652 378.012 66.3161 378.012 Q68.0754 378.012 69.8578 378.359 Q71.6633 378.707 73.6077 379.401 Z" fill="#000000" fill-rule="nonzero" fill-opacity="1" /><path clip-path="url(#clip040)" d="M93.9086 381.716 Q90.2975 381.716 88.4688 385.281 Q86.6632 388.822 86.6632 395.952 Q86.6632 403.058 88.4688 406.623 Q90.2975 410.165 93.9086 410.165 Q97.5428 410.165 99.3483 406.623 Q101.177 403.058 101.177 395.952 Q101.177 388.822 99.3483 385.281 Q97.5428 381.716 93.9086 381.716 M93.9086 378.012 Q99.7187 378.012 102.774 382.619 Q105.853 387.202 105.853 395.952 Q105.853 404.679 102.774 409.285 Q99.7187 413.868 93.9086 413.868 Q88.0984 413.868 85.0197 409.285 Q81.9642 404.679 81.9642 395.952 Q81.9642 387.202 85.0197 382.619 Q88.0984 378.012 93.9086 378.012 Z" fill="#000000" fill-rule="nonzero" fill-opacity="1" /><path clip-path="url(#clip040)" d="M124.07 381.716 Q120.459 381.716 118.631 385.281 Q116.825 388.822 116.825 395.952 Q116.825 403.058 118.631 406.623 Q120.459 410.165 124.07 410.165 Q127.705 410.165 129.51 406.623 Q131.339 403.058 131.339 395.952 Q131.339 388.822 129.51 385.281 Q127.705 381.716 124.07 381.716 M124.07 378.012 Q129.881 378.012 132.936 382.619 Q136.015 387.202 136.015 395.952 Q136.015 404.679 132.936 409.285 Q129.881 413.868 124.07 413.868 Q118.26 413.868 115.182 409.285 Q112.126 404.679 112.126 395.952 Q112.126 387.202 115.182 382.619 Q118.26 378.012 124.07 378.012 Z" fill="#000000" fill-rule="nonzero" fill-opacity="1" /><path clip-path="url(#clip042)" d="M233.734 1445.72 L254.307 1445.72 L274.88 1445.72 L295.453 1445.72 L316.026 1445.72 L336.599 1445.72 L357.172 1445.72 L377.745 1445.72 L398.318 1445.72 L418.891 1445.72 L439.464 1445.72 L460.037 1445.72 L480.61 1443.97 L501.183 1445.72 L521.756 1445.72 L542.329 1433.12 L562.902 624.773 L583.475 87.9763 L604.048 87.9763 L624.621 87.9763 L645.194 1445.72 L665.768 1445.72 L686.341 87.9763 L706.914 87.9763 L727.487 87.9763 L748.06 87.9763 L768.633 87.9763 L789.206 1445.72 L809.779 1445.72 L830.352 87.9763 L850.925 87.9763 L871.498 87.9763 L892.071 87.9763 L912.644 87.9763 L933.217 1445.72 L953.79 1445.72 L974.363 87.9763 L994.936 87.9763 L1015.51 87.9763 L1036.08 87.9763 L1056.66 87.9763 L1077.23 1445.72 L1097.8 1445.72 L1118.37 87.9763 L1138.95 87.9763 L1159.52 87.9763 L1180.09 87.9763 L1200.67 87.9763 L1221.24 1445.72 L1241.81 1445.72 L1262.39 87.9763 L1282.96 87.9763 L1303.53 87.9763 L1324.1 87.9763 L1344.68 87.9763 L1365.25 1445.72 L1385.82 1445.72 L1406.4 87.9763 L1426.97 87.9763 L1447.54 87.9763 L1468.12 87.9763 L1488.69 87.9763 L1509.26 1445.72 L1529.83 1445.72 L1550.41 1430.67 L1570.98 1429.97 L1591.55 1431.37 L1612.13 1431.72 L1632.7 1429.97 L1653.27 1445.72 L1673.85 1445.72 L1694.42 1433.47 L1714.99 1429.62 L1735.57 1428.92 L1756.14 1429.97 L1776.71 1427.87 L1797.28 1445.72 L1817.86 1445.72 L1838.43 1430.67 L1859 1429.62 L1879.58 1428.92 L1900.15 1428.92 L1920.72 1430.67 L1941.3 1445.72 L1961.87 1445.72 L1982.44 1433.82 L2003.01 1433.12 L2023.59 1431.37 L2044.16 1433.12 L2064.73 1432.42 L2085.31 1445.72 L2105.88 1445.72 L2126.45 1435.92 L2147.03 1435.92 L2167.6 1435.92 L2188.17 1436.97 L2208.74 1436.97 L2229.32 1445.72 L2249.89 1445.72 L2270.46 1441.17 L2291.04 1440.47 L2291.04 1431.02 L2270.46 1431.37 L2249.89 1445.72 L2229.32 1445.72 L2208.74 1427.87 L2188.17 1428.22 L2167.6 1427.17 L2147.03 1426.12 L2126.45 1425.77 L2105.88 1445.72 L2085.31 1445.72 L2064.73 1427.87 L2044.16 1424.72 L2023.59 1425.77 L2003.01 1423.67 L1982.44 1424.02 L1961.87 1445.72 L1941.3 1445.72 L1920.72 1419.12 L1900.15 1418.42 L1879.58 1420.87 L1859 1419.47 L1838.43 1422.62 L1817.86 1445.72 L1797.28 1445.72 L1776.71 1417.72 L1756.14 1417.72 L1735.57 1419.47 L1714.99 1420.52 L1694.42 1417.72 L1673.85 1445.72 L1653.27 1445.72 L1632.7 1416.32 L1612.13 1419.12 L1591.55 1419.12 L1570.98 1422.27 L1550.41 890.022 L1529.83 1445.72 L1509.26 1445.72 L1488.69 87.9763 L1468.12 87.9763 L1447.54 87.9763 L1426.97 87.9763 L1406.4 87.9763 L1385.82 1445.72 L1365.25 1445.72 L1344.68 87.9763 L1324.1 87.9763 L1303.53 87.9763 L1282.96 87.9763 L1262.39 87.9763 L1241.81 1445.72 L1221.24 1445.72 L1200.67 87.9763 L1180.09 87.9763 L1159.52 87.9763 L1138.95 87.9763 L1118.37 87.9763 L1097.8 1445.72 L1077.23 1445.72 L1056.66 87.9763 L1036.08 87.9763 L1015.51 87.9763 L994.936 87.9763 L974.363 87.9763 L953.79 1445.72 L933.217 1445.72 L912.644 87.9763 L892.071 87.9763 L871.498 87.9763 L850.925 87.9763 L830.352 87.9763 L809.779 1445.72 L789.206 1445.72 L768.633 87.9763 L748.06 87.9763 L727.487 87.9763 L706.914 87.9763 L686.341 87.9763 L665.768 1445.72 L645.194 1445.72 L624.621 87.9763 L604.048 87.9763 L583.475 87.9763 L562.902 87.9763 L542.329 87.9763 L521.756 1445.72 L501.183 1445.72 L480.61 1439.77 L460.037 1440.47 L439.464 1440.47 L418.891 1441.52 L398.318 1441.52 L377.745 1445.72 L357.172 1445.72 L336.599 1443.62 L316.026 1443.62 L295.453 1443.62 L274.88 1444.32 L254.307 1431.02 L233.734 1445.72  Z" fill="#009af9" fill-rule="evenodd" fill-opacity="1"/>
<polyline clip-path="url(#clip042)" style="stroke:#009af9; stroke-linecap:round; stroke-linejoin:round; stroke-width:4; stroke-opacity:1; fill:none" points="233.734,1445.72 254.307,1438.97 274.88,1445.22 295.453,1444.97 316.026,1444.97 336.599,1444.97 357.172,1445.72 377.745,1445.72 398.318,1444.22 418.891,1443.97 439.464,1443.47 460.037,1442.97 480.61,1441.97 501.183,1445.72 521.756,1445.72 542.329,1045.04 562.902,279.689 583.475,87.9763 604.048,87.9763 624.621,87.9763 645.194,1445.72 665.768,1445.72 686.341,87.9763 706.914,87.9763 727.487,87.9763 748.06,87.9763 768.633,87.9763 789.206,1445.72 809.779,1445.72 830.352,87.9763 850.925,87.9763 871.498,87.9763 892.071,87.9763 912.644,87.9763 933.217,1445.72 953.79,1445.72 974.363,87.9763 994.936,87.9763 1015.51,87.9763 1036.08,87.9763 1056.66,87.9763 1077.23,1445.72 1097.8,1445.72 1118.37,87.9763 1138.95,87.9763 1159.52,87.9763 1180.09,87.9763 1200.67,87.9763 1221.24,1445.72 1241.81,1445.72 1262.39,87.9763 1282.96,87.9763 1303.53,87.9763 1324.1,87.9763 1344.68,87.9763 1365.25,1445.72 1385.82,1445.72 1406.4,87.9763 1426.97,87.9763 1447.54,87.9763 1468.12,87.9763 1488.69,87.9763 1509.26,1445.72 1529.83,1445.72 1550.41,1236.01 1570.98,1425.72 1591.55,1424.97 1612.13,1425.47 1632.7,1423.97 1653.27,1445.72 1673.85,1445.72 1694.42,1426.97 1714.99,1425.47 1735.57,1423.72 1756.14,1423.47 1776.71,1423.47 1797.28,1445.72 1817.86,1445.72 1838.43,1426.97 1859,1424.97 1879.58,1425.72 1900.15,1424.47 1920.72,1425.47 1941.3,1445.72 1961.87,1445.72 1982.44,1429.22 2003.01,1428.47 2023.59,1429.22 2044.16,1429.22 2064.73,1430.22 2085.31,1445.72 2105.88,1445.72 2126.45,1432.47 2147.03,1431.72 2167.6,1432.47 2188.17,1432.47 2208.74,1431.97 2229.32,1445.72 2249.89,1445.72 2270.46,1435.97 2291.04,1435.47 "/>
<polyline clip-path="url(#clip042)" style="stroke:#e26f46; stroke-linecap:round; stroke-linejoin:round; stroke-width:4; stroke-opacity:1; fill:none" points="233.734,1445.72 254.307,1438.97 274.88,1445.22 295.453,1444.97 316.026,1444.97 336.599,1444.97 357.172,1445.72 377.745,1445.72 398.318,1444.22 418.891,1443.97 439.464,1443.47 460.037,1442.97 480.61,1441.97 501.183,1445.72 521.756,1445.72 542.329,1045.04 562.902,279.689 583.475,87.9763 604.048,87.9763 624.621,87.9763 645.194,1445.72 665.768,1445.72 686.341,87.9763 706.914,87.9763 727.487,87.9763 748.06,87.9763 768.633,87.9763 789.206,1445.72 809.779,1445.72 830.352,87.9763 850.925,87.9763 871.498,87.9763 892.071,87.9763 912.644,87.9763 933.217,1445.72 953.79,1445.72 974.363,87.9763 994.936,87.9763 1015.51,87.9763 1036.08,87.9763 1056.66,87.9763 1077.23,1445.72 1097.8,1445.72 1118.37,87.9763 1138.95,87.9763 1159.52,87.9763 1180.09,87.9763 1200.67,87.9763 1221.24,1445.72 1241.81,1445.72 1262.39,87.9763 1282.96,87.9763 1303.53,87.9763 1324.1,87.9763 1344.68,87.9763 1365.25,1445.72 1385.82,1445.72 1406.4,87.9763 1426.97,87.9763 1447.54,87.9763 1468.12,87.9763 1488.69,87.9763 1509.26,1445.72 1529.83,1445.72 1550.41,1236.01 1570.98,1425.72 1591.55,1424.97 1612.13,1425.47 1632.7,1423.97 1653.27,1445.72 1673.85,1445.72 1694.42,1426.97 1714.99,1425.47 1735.57,1423.72 1756.14,1423.47 1776.71,1423.47 1797.28,1445.72 1817.86,1445.72 1838.43,1426.97 1859,1424.97 1879.58,1425.72 1900.15,1424.47 1920.72,1425.47 1941.3,1445.72 1961.87,1445.72 1982.44,1429.22 2003.01,1428.47 2023.59,1429.22 2044.16,1429.22 2064.73,1430.22 2085.31,1445.72 2105.88,1445.72 2126.45,1432.47 2147.03,1431.72 2167.6,1432.47 2188.17,1432.47 2208.74,1431.97 2229.32,1445.72 2249.89,1445.72 2270.46,1435.97 2291.04,1435.47 "/>
<path clip-path="url(#clip040)" d="M2009.56 250.738 L2280.06 250.738 L2280.06 95.2176 L2009.56 95.2176  Z" fill="#ffffff" fill-rule="evenodd" fill-opacity="1"/>
<polyline clip-path="url(#clip040)" style="stroke:#000000; stroke-linecap:round; stroke-linejoin:round; stroke-width:4; stroke-opacity:1; fill:none" points="2009.56,250.738 2280.06,250.738 2280.06,95.2176 2009.56,95.2176 2009.56,250.738 "/>
<path clip-path="url(#clip040)" d="M2033.79 167.794 L2179.17 167.794 L2179.17 126.322 L2033.79 126.322 L2033.79 167.794  Z" fill="#009af9" fill-rule="evenodd" fill-opacity="1"/>
<polyline clip-path="url(#clip040)" style="stroke:#009af9; stroke-linecap:round; stroke-linejoin:round; stroke-width:4; stroke-opacity:1; fill:none" points="2033.79,126.322 2179.17,126.322 "/>
<path clip-path="url(#clip040)" d="M2217.25 166.745 Q2215.44 171.375 2213.73 172.787 Q2212.01 174.199 2209.14 174.199 L2205.74 174.199 L2205.74 170.634 L2208.24 170.634 Q2210 170.634 2210.97 169.8 Q2211.95 168.967 2213.13 165.865 L2213.89 163.921 L2203.4 138.412 L2207.92 138.412 L2216.02 158.689 L2224.12 138.412 L2228.64 138.412 L2217.25 166.745 Z" fill="#000000" fill-rule="nonzero" fill-opacity="1" /><path clip-path="url(#clip040)" d="M2235.93 160.402 L2243.57 160.402 L2243.57 134.037 L2235.26 135.703 L2235.26 131.444 L2243.52 129.778 L2248.2 129.778 L2248.2 160.402 L2255.83 160.402 L2255.83 164.338 L2235.93 164.338 L2235.93 160.402 Z" fill="#000000" fill-rule="nonzero" fill-opacity="1" /><polyline clip-path="url(#clip040)" style="stroke:#e26f46; stroke-linecap:round; stroke-linejoin:round; stroke-width:4; stroke-opacity:1; fill:none" points="2033.79,198.898 2179.17,198.898 "/>
<path clip-path="url(#clip040)" d="M2217.25 218.585 Q2215.44 223.215 2213.73 224.627 Q2212.01 226.039 2209.14 226.039 L2205.74 226.039 L2205.74 222.474 L2208.24 222.474 Q2210 222.474 2210.97 221.64 Q2211.95 220.807 2213.13 217.705 L2213.89 215.761 L2203.4 190.252 L2207.92 190.252 L2216.02 210.529 L2224.12 190.252 L2228.64 190.252 L2217.25 218.585 Z" fill="#000000" fill-rule="nonzero" fill-opacity="1" /><path clip-path="url(#clip040)" d="M2239.14 212.242 L2255.46 212.242 L2255.46 216.178 L2233.52 216.178 L2233.52 212.242 Q2236.18 209.488 2240.76 204.858 Q2245.37 200.205 2246.55 198.863 Q2248.8 196.34 2249.68 194.604 Q2250.58 192.844 2250.58 191.155 Q2250.58 188.4 2248.64 186.664 Q2246.71 184.928 2243.61 184.928 Q2241.41 184.928 2238.96 185.692 Q2236.53 186.455 2233.75 188.006 L2233.75 183.284 Q2236.57 182.15 2239.03 181.571 Q2241.48 180.993 2243.52 180.993 Q2248.89 180.993 2252.08 183.678 Q2255.28 186.363 2255.28 190.854 Q2255.28 192.983 2254.47 194.905 Q2253.68 196.803 2251.57 199.395 Q2251 200.067 2247.89 203.284 Q2244.79 206.479 2239.14 212.242 Z" fill="#000000" fill-rule="nonzero" fill-opacity="1" /></svg>
