<?xml version="1.0" encoding="UTF-8" standalone="no"?>
<!-- Created with Inkscape (http://www.inkscape.org/) -->

<svg
   xmlns:dc="http://purl.org/dc/elements/1.1/"
   xmlns:cc="http://creativecommons.org/ns#"
   xmlns:rdf="http://www.w3.org/1999/02/22-rdf-syntax-ns#"
   xmlns:svg="http://www.w3.org/2000/svg"
   xmlns="http://www.w3.org/2000/svg"
   xmlns:sodipodi="http://sodipodi.sourceforge.net/DTD/sodipodi-0.dtd"
   xmlns:inkscape="http://www.inkscape.org/namespaces/inkscape"
   width="590.72668mm"
   height="207.15164mm"
   viewBox="0 0 590.72668 207.15165"
   version="1.1"
   id="svg8"
   inkscape:version="0.92.5 (2060ec1f9f, 2020-04-08)"
   sodipodi:docname="schemaAmenite.svg"
   inkscape:export-filename="./schemaAmeniteSource.png"
   inkscape:export-xdpi="96"
   inkscape:export-ydpi="96">
  <defs
     id="defs2" />
  <sodipodi:namedview
     id="base"
     pagecolor="#ffffff"
     bordercolor="#666666"
     borderopacity="1.0"
     inkscape:pageopacity="0.0"
     inkscape:pageshadow="2"
     inkscape:zoom="0.35"
     inkscape:cx="1115.4136"
     inkscape:cy="405.51842"
     inkscape:document-units="mm"
     inkscape:current-layer="layer1"
     showgrid="false"
     inkscape:window-width="1440"
     inkscape:window-height="786"
     inkscape:window-x="1280"
     inkscape:window-y="0"
     inkscape:window-maximized="1" />
  <metadata
     id="metadata5">
    <rdf:RDF>
      <cc:Work
         rdf:about="">
        <dc:format>image/svg+xml</dc:format>
        <dc:type
           rdf:resource="http://purl.org/dc/dcmitype/StillImage" />
        <dc:title />
      </cc:Work>
    </rdf:RDF>
  </metadata>
  <g
     inkscape:label="Calque 1"
     inkscape:groupmode="layer"
     id="layer1"
     transform="translate(352.79185,2.7018219)">
    <g
       id="g2263">
      <g
         id="g2209">
        <rect
           style="fill:#000000;fill-opacity:0;stroke:#443f65;stroke-width:3;stroke-miterlimit:4;stroke-dasharray:none;stroke-opacity:1"
           id="rect815"
           width="74.991234"
           height="27.290268"
           x="28.354698"
           y="70.096031" />
        <flowRoot
           xml:space="preserve"
           id="flowRoot817"
           style="font-style:normal;font-weight:normal;font-size:40px;line-height:1.25;font-family:sans-serif;letter-spacing:0px;word-spacing:0px;fill:#000000;fill-opacity:1;stroke:none"
           transform="matrix(0.26458333,0,0,0.26458333,-19.825073,35.236387)"><flowRegion
             id="flowRegion819"><rect
               id="rect821"
               width="411.42856"
               height="162.85715"
               x="197.14285"
               y="156.8054" /></flowRegion><flowPara
             id="flowPara823"
             style="font-style:normal;font-variant:normal;font-weight:normal;font-stretch:normal;font-family:'Liberation Serif';-inkscape-font-specification:'Liberation Serif'">OpenStreetMap</flowPara></flowRoot>      </g>
      <flowRoot
         transform="matrix(0.26458333,0,0,0.26458333,-37.94182,61.061263)"
         style="font-style:normal;font-weight:normal;font-size:40px;line-height:1.25;font-family:sans-serif;letter-spacing:0px;word-spacing:0px;fill:#000000;fill-opacity:1;stroke:none"
         id="flowRoot817-3"
         xml:space="preserve"><flowRegion
           id="flowRegion819-6"><rect
             y="156.8054"
             x="197.14285"
             height="162.85715"
             width="411.42856"
             id="rect821-7" /></flowRegion><flowPara
           style="font-style:normal;font-variant:normal;font-weight:normal;font-stretch:normal;font-size:33.33333206px;font-family:'Liberation Sans';-inkscape-font-specification:'Liberation Sans';fill:#0000b2;fill-opacity:1"
           id="flowPara823-5">71 catégories (sur le Veme)</flowPara></flowRoot>      <flowRoot
         xml:space="preserve"
         id="flowRoot1059-3"
         style="font-style:normal;font-weight:normal;font-size:40px;line-height:1.25;font-family:sans-serif;text-align:center;letter-spacing:0px;word-spacing:0px;text-anchor:middle;fill:#000000;fill-opacity:1;stroke:none"
         transform="matrix(0.26458333,0,0,0.26458333,118.00062,157.01135)"><flowRegion
           style="text-align:center;text-anchor:middle"
           id="flowRegion1055-7"><rect
             style="text-align:center;text-anchor:middle"
             id="rect1053-5"
             width="645.71429"
             height="218.57143"
             x="-520"
             y="-457.48032" /></flowRegion><flowPara
           id="flowPara1057-9"
           style="font-style:italic;font-variant:normal;font-weight:normal;font-stretch:normal;font-size:40px;font-family:'Liberation Sans';-inkscape-font-specification:'Liberation Sans';text-align:center;text-anchor:middle">Aménités renseigné collaborativement</flowPara></flowRoot>      <flowRoot
         xml:space="preserve"
         id="flowRoot1197-7"
         style="font-style:normal;font-weight:normal;font-size:40px;line-height:1.25;font-family:sans-serif;text-align:center;letter-spacing:0px;word-spacing:0px;text-anchor:middle;fill:#c60000;fill-opacity:1;stroke:none"
         transform="matrix(0.26458333,0,0,0.26458333,-66.298918,74.349641)"><flowRegion
           style="text-align:center;text-anchor:middle;fill:#c60000;fill-opacity:1"
           id="flowRegion1189-3"><rect
             style="text-align:center;text-anchor:middle;fill:#c60000;fill-opacity:1"
             id="rect1187-6"
             width="436.68237"
             height="72.953575"
             x="197.14285"
             y="156.8054" /></flowRegion><flowPara
           style="font-style:normal;font-variant:normal;font-weight:normal;font-stretch:normal;font-size:33.33333206px;font-family:'Liberation Sans';-inkscape-font-specification:'Liberation Sans';text-align:center;text-anchor:middle;fill:#c60000;fill-opacity:1"
           id="flowPara1195-1">Capacité (rare)</flowPara></flowRoot>      <flowRoot
         xml:space="preserve"
         id="flowRoot1384-9"
         style="font-style:normal;font-weight:normal;font-size:40px;line-height:1.25;font-family:sans-serif;text-align:center;letter-spacing:0px;word-spacing:0px;text-anchor:middle;fill:#418424;fill-opacity:1;stroke:none"
         transform="matrix(0.26458333,0,0,0.26458333,-46.75696,87.730485)"><flowRegion
           style="text-align:center;text-anchor:middle;fill:#418424;fill-opacity:1"
           id="flowRegion1380-4"><rect
             style="text-align:center;text-anchor:middle;fill:#418424;fill-opacity:1"
             id="rect1378-7"
             width="440.72299"
             height="218.41554"
             x="197.14285"
             y="156.8054" /></flowRegion><flowPara
           id="flowPara1382-8"
           style="font-style:normal;font-variant:normal;font-weight:normal;font-stretch:normal;font-size:33.33333206px;line-height:0.5;font-family:'Liberation Sans';-inkscape-font-specification:'Liberation Sans';text-align:center;text-anchor:middle;fill:#418424;fill-opacity:1">Entrée des établissement controlée manuellement</flowPara></flowRoot>    </g>
    <g
       id="g1380"
       transform="translate(5.5128767,11.339286)">
      <g
         transform="translate(-0.06484816)"
         id="g1321">
        <path
           sodipodi:nodetypes="cc"
           inkscape:connector-curvature="0"
           id="path948"
           d="m -105.68836,70.339491 55.21688,25.660657"
           style="fill:none;stroke:#000000;stroke-width:0.26458332px;stroke-linecap:butt;stroke-linejoin:miter;stroke-opacity:1" />
        <path
           style="fill:none;stroke:#000000;stroke-width:0.26458332px;stroke-linecap:butt;stroke-linejoin:miter;stroke-opacity:1"
           d="m -105.68836,70.339491 -55.21688,25.660657"
           id="path946"
           inkscape:connector-curvature="0"
           sodipodi:nodetypes="cc" />
      </g>
      <g
         id="g1328">
        <rect
           style="fill:#000000;fill-opacity:0;stroke:#443f65;stroke-width:3;stroke-miterlimit:4;stroke-dasharray:none;stroke-opacity:1"
           id="rect815-3"
           width="74.991234"
           height="27.290268"
           x="-143.24883"
           y="41.482639" />
        <flowRoot
           xml:space="preserve"
           id="flowRoot817-5"
           style="font-style:normal;font-weight:normal;font-size:40px;line-height:1.25;font-family:sans-serif;letter-spacing:0px;word-spacing:0px;fill:#000000;fill-opacity:1;stroke:none"
           transform="matrix(0.26458333,0,0,0.26458333,-176.52511,6.622997)"><flowRegion
             id="flowRegion819-62"><rect
               id="rect821-9"
               width="411.42856"
               height="162.85715"
               x="197.14285"
               y="156.8054" /></flowRegion><flowPara
             id="flowPara823-1"
             style="font-style:normal;font-variant:normal;font-weight:normal;font-stretch:normal;font-family:'Liberation Serif';-inkscape-font-specification:'Liberation Serif'">SIRENE</flowPara></flowRoot>      </g>
      <flowRoot
         transform="matrix(0.26458333,0,0,0.26458333,-9.7125545,145.67206)"
         style="font-style:normal;font-weight:normal;font-size:40px;line-height:1.25;font-family:sans-serif;letter-spacing:0px;word-spacing:0px;fill:#000000;fill-opacity:1;stroke:none"
         id="flowRoot1021"
         xml:space="preserve"><flowRegion
           id="flowRegion1023"><rect
             y="-457.48032"
             x="-520"
             height="211.42857"
             width="685.71429"
             id="rect1025" /></flowRegion><flowPara
           style="font-style:italic;font-variant:normal;font-weight:normal;font-stretch:normal;font-size:40px;font-family:'Liberation Sans';-inkscape-font-specification:'Liberation Sans'"
           id="flowPara1027">Activitée déclarée</flowPara></flowRoot>      <g
         transform="translate(3.6293389)"
         id="g1317">
        <g
           id="g1267">
          <g
             id="g1241">
            <rect
               y="96.540161"
               x="-199.90996"
               height="27.290268"
               width="74.991234"
               id="rect906"
               style="fill:#000000;fill-opacity:0;stroke:#443f65;stroke-width:3;stroke-miterlimit:4;stroke-dasharray:9, 3;stroke-dashoffset:0;stroke-opacity:1" />
            <flowRoot
               transform="matrix(0.26458333,0,0,0.26458333,-223.068,62.755389)"
               style="font-style:normal;font-weight:normal;font-size:40px;line-height:1.25;font-family:sans-serif;letter-spacing:0px;word-spacing:0px;fill:#000000;fill-opacity:1;stroke:none"
               id="flowRoot914"
               xml:space="preserve"><flowRegion
                 id="flowRegion910"><rect
                   y="156.8054"
                   x="197.14285"
                   height="162.85715"
                   width="411.42856"
                   id="rect908" /></flowRegion><flowPara
                 style="font-style:normal;font-variant:normal;font-weight:normal;font-stretch:normal;font-family:'Liberation Serif';-inkscape-font-specification:'Liberation Serif'"
                 id="flowPara912">POI</flowPara></flowRoot>          </g>
          <flowRoot
             xml:space="preserve"
             id="flowRoot958"
             style="font-style:normal;font-weight:normal;font-size:40px;line-height:1.25;font-family:sans-serif;letter-spacing:0px;word-spacing:0px;fill:#000000;fill-opacity:1;stroke:none"
             transform="matrix(0.26458333,0,0,0.26458333,-266.55303,87.60379)"><flowRegion
               id="flowRegion954"><rect
                 id="rect952"
                 width="411.42856"
                 height="162.85715"
                 x="197.14285"
                 y="156.8054" /></flowRegion><flowPara
               id="flowPara956"
               style="font-style:normal;font-variant:normal;font-weight:normal;font-stretch:normal;font-size:33.33333206px;font-family:'Liberation Sans';-inkscape-font-specification:'Liberation Sans';fill:#0000b2;fill-opacity:1">188 types d'établissement</flowPara></flowRoot>          <flowRoot
             transform="matrix(0.26458333,0,0,0.26458333,-289.25837,100.71127)"
             style="font-style:normal;font-weight:normal;font-size:40px;line-height:1.25;font-family:sans-serif;text-align:center;letter-spacing:0px;word-spacing:0px;text-anchor:middle;fill:#c60000;fill-opacity:1;stroke:none"
             id="flowRoot1158"
             xml:space="preserve"><flowRegion
               id="flowRegion1148"
               style="text-align:center;text-anchor:middle;fill:#c60000;fill-opacity:1"><rect
                 y="156.8054"
                 x="197.14285"
                 height="218.41554"
                 width="440.72299"
                 id="rect1146"
                 style="text-align:center;text-anchor:middle;fill:#c60000;fill-opacity:1" /></flowRegion><flowPara
               style="font-style:normal;font-variant:normal;font-weight:normal;font-stretch:normal;font-size:33.33333206px;font-family:'Liberation Sans';-inkscape-font-specification:'Liberation Sans';text-align:center;text-anchor:middle;fill:#c60000;fill-opacity:1"
               id="flowPara1156">Tranche d'effectif </flowPara><flowPara
               id="flowPara1169"
               style="font-style:normal;font-variant:normal;font-weight:normal;font-stretch:normal;font-size:33.33333206px;font-family:'Liberation Sans';-inkscape-font-specification:'Liberation Sans';text-align:center;text-anchor:middle;fill:#c60000;fill-opacity:1">x</flowPara><flowPara
               id="flowPara1171"
               style="font-style:normal;font-variant:normal;font-weight:normal;font-stretch:normal;font-size:33.33333206px;font-family:'Liberation Sans';-inkscape-font-specification:'Liberation Sans';text-align:center;text-anchor:middle;fill:#c60000;fill-opacity:1">Libellé de l'activité</flowPara></flowRoot>        </g>
        <g
           id="g1283">
          <g
             id="g1234">
            <flowRoot
               xml:space="preserve"
               id="flowRoot924"
               style="font-style:normal;font-weight:normal;font-size:40px;line-height:1.25;font-family:sans-serif;letter-spacing:0px;word-spacing:0px;fill:#000000;fill-opacity:1;stroke:none"
               transform="matrix(0.26458333,0,0,0.26458333,-138.12299,61.832965)"><flowRegion
                 id="flowRegion920"><rect
                   id="rect918"
                   width="411.42856"
                   height="162.85715"
                   x="197.14285"
                   y="156.8054" /></flowRegion><flowPara
                 id="flowPara922"
                 style="font-style:normal;font-variant:normal;font-weight:normal;font-stretch:normal;font-family:'Liberation Serif';-inkscape-font-specification:'Liberation Serif'">Working Place</flowPara></flowRoot>            <rect
               style="fill:#000000;fill-opacity:0;stroke:#443f65;stroke-width:3;stroke-miterlimit:4;stroke-dasharray:9, 3;stroke-dashoffset:0;stroke-opacity:1"
               id="rect926"
               width="74.991234"
               height="27.290268"
               x="-92.467613"
               y="96.540161" />
          </g>
          <flowRoot
             transform="matrix(0.26458333,0,0,0.26458333,-158.83975,87.60379)"
             style="font-style:normal;font-weight:normal;font-size:40px;line-height:1.25;font-family:sans-serif;letter-spacing:0px;word-spacing:0px;fill:#000000;fill-opacity:1;stroke:none"
             id="flowRoot817-3-3"
             xml:space="preserve"><flowRegion
               id="flowRegion819-6-6"><rect
                 y="156.8054"
                 x="197.14285"
                 height="162.85715"
                 width="411.42856"
                 id="rect821-7-06" /></flowRegion><flowPara
               style="font-style:normal;font-variant:normal;font-weight:normal;font-stretch:normal;font-size:33.33333206px;font-family:'Liberation Sans';-inkscape-font-specification:'Liberation Sans';fill:#0000b2;fill-opacity:1"
               id="flowPara823-5-2">732 types d'établissement</flowPara></flowRoot>          <flowRoot
             xml:space="preserve"
             id="flowRoot1197"
             style="font-style:normal;font-weight:normal;font-size:40px;line-height:1.25;font-family:sans-serif;text-align:center;letter-spacing:0px;word-spacing:0px;text-anchor:middle;fill:#c60000;fill-opacity:1;stroke:none"
             transform="matrix(0.26458333,0,0,0.26458333,-182.91201,100.71127)"><flowRegion
               style="text-align:center;text-anchor:middle;fill:#c60000;fill-opacity:1"
               id="flowRegion1189"><rect
                 style="text-align:center;text-anchor:middle;fill:#c60000;fill-opacity:1"
                 id="rect1187"
                 width="436.68237"
                 height="72.953575"
                 x="197.14285"
                 y="156.8054" /></flowRegion><flowPara
               style="font-style:normal;font-variant:normal;font-weight:normal;font-stretch:normal;font-size:33.33333206px;font-family:'Liberation Sans';-inkscape-font-specification:'Liberation Sans';text-align:center;text-anchor:middle;fill:#c60000;fill-opacity:1"
               id="flowPara1195">Tranche d'effectif </flowPara></flowRoot>        </g>
      </g>
      <flowRoot
         xml:space="preserve"
         id="flowRoot1384-4"
         style="font-style:normal;font-weight:normal;font-size:40px;line-height:1.25;font-family:sans-serif;text-align:center;letter-spacing:0px;word-spacing:0px;text-anchor:middle;fill:#418424;fill-opacity:1;stroke:none"
         transform="matrix(0.26458333,0,0,0.26458333,-216.24362,140.42865)"><flowRegion
           style="text-align:center;text-anchor:middle;fill:#418424;fill-opacity:1"
           id="flowRegion1380-5"><rect
             style="text-align:center;text-anchor:middle;fill:#418424;fill-opacity:1"
             id="rect1378-0"
             width="440.72299"
             height="218.41554"
             x="197.14285"
             y="156.8054" /></flowRegion><flowPara
           id="flowPara1382-3"
           style="font-style:normal;font-variant:normal;font-weight:normal;font-stretch:normal;font-size:33.33333206px;font-family:'Liberation Sans';-inkscape-font-specification:'Liberation Sans';text-align:center;text-anchor:middle;fill:#418424;fill-opacity:1">Géocodage</flowPara></flowRoot>    </g>
    <g
       id="g1426"
       transform="translate(-1.440128e-4,11.339286)">
      <rect
         style="fill:#000000;fill-opacity:0;stroke:#443f65;stroke-width:3;stroke-miterlimit:4;stroke-dasharray:none;stroke-opacity:1"
         id="rect825"
         width="74.991234"
         height="27.290268"
         x="145.89587"
         y="59.739094" />
      <flowRoot
         xml:space="preserve"
         id="flowRoot833"
         style="font-style:normal;font-weight:normal;font-size:40px;line-height:1.25;font-family:sans-serif;letter-spacing:0px;word-spacing:0px;fill:#000000;fill-opacity:1;stroke:none"
         transform="matrix(0.26458333,0,0,0.26458333,121.63712,24.87945)"><flowRegion
           id="flowRegion829"><rect
             id="rect827"
             width="411.42856"
             height="162.85715"
             x="197.14285"
             y="156.8054" /></flowRegion><flowPara
           id="flowPara831"
           style="font-style:normal;font-variant:normal;font-weight:normal;font-stretch:normal;font-family:'Liberation Serif';-inkscape-font-specification:'Liberation Serif'">BPE</flowPara></flowRoot>      <flowRoot
         xml:space="preserve"
         id="flowRoot958-6"
         style="font-style:normal;font-weight:normal;font-size:40px;line-height:1.25;font-family:sans-serif;letter-spacing:0px;word-spacing:0px;fill:#000000;fill-opacity:1;stroke:none"
         transform="matrix(0.26458333,0,0,0.26458333,79.342427,50.911919)"><flowRegion
           id="flowRegion954-1"><rect
             id="rect952-8"
             width="411.42856"
             height="162.85715"
             x="197.14285"
             y="156.8054" /></flowRegion><flowPara
           id="flowPara956-7"
           style="font-style:normal;font-variant:normal;font-weight:normal;font-stretch:normal;font-size:33.33333206px;font-family:'Liberation Sans';-inkscape-font-specification:'Liberation Sans';fill:#0000b2;fill-opacity:1">188 types d'établissement</flowPara></flowRoot>      <flowRoot
         xml:space="preserve"
         id="flowRoot1059-3-2"
         style="font-style:normal;font-weight:normal;font-size:40px;line-height:1.25;font-family:sans-serif;text-align:center;letter-spacing:0px;word-spacing:0px;text-anchor:middle;fill:#000000;fill-opacity:1;stroke:none"
         transform="matrix(0.26458333,0,0,0.26458333,250.61503,145.67206)"><flowRegion
           style="text-align:center;text-anchor:middle"
           id="flowRegion1055-7-2"><rect
             style="text-align:center;text-anchor:middle"
             id="rect1053-5-8"
             width="528.57141"
             height="251.42857"
             x="-520"
             y="-457.48032" /></flowRegion><flowPara
           id="flowPara1057-9-9"
           style="font-style:italic;font-variant:normal;font-weight:normal;font-stretch:normal;font-size:40px;font-family:'Liberation Sans';-inkscape-font-specification:'Liberation Sans';text-align:center;text-anchor:middle">Base de données des activitées</flowPara></flowRoot>      <flowRoot
         xml:space="preserve"
         id="flowRoot1197-7-2"
         style="font-style:normal;font-weight:normal;font-size:40px;line-height:1.25;font-family:sans-serif;text-align:center;letter-spacing:0px;word-spacing:0px;text-anchor:middle;fill:#c60000;fill-opacity:1;stroke:none"
         transform="matrix(0.26458333,0,0,0.26458333,74.958885,64.175558)"><flowRegion
           style="text-align:center;text-anchor:middle;fill:#c60000;fill-opacity:1"
           id="flowRegion1189-3-9"><rect
             style="text-align:center;text-anchor:middle;fill:#c60000;fill-opacity:1"
             id="rect1187-6-3"
             width="436.68237"
             height="72.953575"
             x="197.14285"
             y="156.8054" /></flowRegion><flowPara
           style="font-style:normal;font-variant:normal;font-weight:normal;font-stretch:normal;font-size:33.33333206px;font-family:'Liberation Sans';-inkscape-font-specification:'Liberation Sans';text-align:center;text-anchor:middle;fill:#c60000;fill-opacity:1"
           id="flowPara1195-1-1">Pas de mesure de capacité</flowPara></flowRoot>      <flowRoot
         xml:space="preserve"
         id="flowRoot1384-6"
         style="font-style:normal;font-weight:normal;font-size:40px;line-height:1.25;font-family:sans-serif;text-align:center;letter-spacing:0px;word-spacing:0px;text-anchor:middle;fill:#418424;fill-opacity:1;stroke:none"
         transform="matrix(0.26458333,0,0,0.26458333,67.947772,77.720542)"><flowRegion
           style="text-align:center;text-anchor:middle;fill:#418424;fill-opacity:1"
           id="flowRegion1380-1"><rect
             style="text-align:center;text-anchor:middle;fill:#418424;fill-opacity:1"
             id="rect1378-06"
             width="440.72299"
             height="218.41554"
             x="197.14285"
             y="156.8054" /></flowRegion><flowPara
           id="flowPara1382-32"
           style="font-style:normal;font-variant:normal;font-weight:normal;font-stretch:normal;font-size:33.33333206px;font-family:'Liberation Sans';-inkscape-font-specification:'Liberation Sans';text-align:center;text-anchor:middle;fill:#418424;fill-opacity:1">Géocodage par l'INSEE</flowPara></flowRoot>    </g>
    <flowRoot
       xml:space="preserve"
       id="flowRoot956"
       style="font-style:normal;font-weight:normal;font-size:40px;line-height:1.25;font-family:sans-serif;letter-spacing:0px;word-spacing:0px;fill:#000000;fill-opacity:1;stroke:none"
       transform="matrix(0.26458333,0,0,0.26458333,-397.28768,-46.189606)"><flowRegion
         id="flowRegion952"
         style="fill:#000000;fill-opacity:1"><rect
           id="rect950"
           width="714.4743"
           height="156.79622"
           x="197.14285"
           y="156.8054"
           style="fill:#000000;fill-opacity:1" /></flowRegion><flowPara
         id="flowPara954"
         style="font-style:normal;font-variant:normal;font-weight:normal;font-stretch:normal;font-size:56.00000381px;font-family:'Liberation Sans';-inkscape-font-specification:'Liberation Sans';fill:#000000;fill-opacity:1">Composition des POI</flowPara><flowPara
         style="font-style:normal;font-variant:normal;font-weight:normal;font-stretch:normal;font-size:56.00000381px;font-family:'Liberation Sans';-inkscape-font-specification:'Liberation Sans';fill:#000000;fill-opacity:1"
         id="flowPara1550">Sources </flowPara></flowRoot>    <flowRoot
       transform="matrix(0.26458333,0,0,0.26458333,-163.33692,-35.475739)"
       style="font-style:normal;font-weight:normal;font-size:40px;line-height:1.25;font-family:sans-serif;letter-spacing:0px;word-spacing:0px;fill:#000000;fill-opacity:1;stroke:none"
       id="flowRoot958-0"
       xml:space="preserve"><flowRegion
         id="flowRegion954-6"><rect
           y="156.8054"
           x="197.14285"
           height="156.79622"
           width="714.4743"
           id="rect952-1" /></flowRegion><flowPara
         style="font-style:italic;font-variant:normal;font-weight:normal;font-stretch:normal;font-size:33.33333206px;font-family:'Liberation Sans';-inkscape-font-specification:'Liberation Sans';fill:#0000b2;fill-opacity:1"
         id="flowPara956-5">nombre d'entrées dans la nomenclature</flowPara></flowRoot>    <flowRoot
       xml:space="preserve"
       id="flowRoot1158-5"
       style="font-style:normal;font-weight:normal;font-size:40px;line-height:1.25;font-family:sans-serif;text-align:center;letter-spacing:0px;word-spacing:0px;text-anchor:middle;fill:#c60000;fill-opacity:1;stroke:none"
       transform="matrix(0.26458333,0,0,0.26458333,85.03556,-35.527415)"><flowRegion
         style="text-align:center;text-anchor:middle;fill:#c60000;fill-opacity:1"
         id="flowRegion1148-4"><rect
           style="text-align:center;text-anchor:middle;fill:#c60000;fill-opacity:1"
           id="rect1146-7"
           width="440.72299"
           height="218.41554"
           x="197.14285"
           y="156.8054" /></flowRegion><flowPara
         style="font-style:italic;font-variant:normal;font-weight:normal;font-stretch:normal;font-size:33.33333206px;font-family:'Liberation Sans';-inkscape-font-specification:'Liberation Sans';text-align:center;text-anchor:middle;fill:#c60000;fill-opacity:1"
         id="flowPara1171-6">Indice d'affluence</flowPara></flowRoot>    <flowRoot
       transform="matrix(0.26458333,0,0,0.26458333,-7.5419396,-36.345626)"
       style="font-style:normal;font-weight:normal;font-size:40px;line-height:1.25;font-family:sans-serif;text-align:center;letter-spacing:0px;word-spacing:0px;text-anchor:middle;fill:#418424;fill-opacity:1;stroke:none"
       id="flowRoot1384-4-9"
       xml:space="preserve"><flowRegion
         id="flowRegion1380-5-3"
         style="text-align:center;text-anchor:middle;fill:#418424;fill-opacity:1"><rect
           y="156.8054"
           x="197.14285"
           height="218.41554"
           width="440.72299"
           id="rect1378-0-7"
           style="text-align:center;text-anchor:middle;fill:#418424;fill-opacity:1" /></flowRegion><flowPara
         style="font-style:italic;font-variant:normal;font-weight:normal;font-stretch:normal;font-size:33.33333206px;font-family:'Liberation Sans';-inkscape-font-specification:'Liberation Sans';text-align:center;text-anchor:middle;fill:#418424;fill-opacity:1"
         id="flowPara1382-3-4">position géographique</flowPara></flowRoot>    <flowRoot
       transform="matrix(0.26458333,0,0,0.26458333,-214.3472,-35.475739)"
       style="font-style:normal;font-weight:normal;font-size:40px;line-height:1.25;font-family:sans-serif;letter-spacing:0px;word-spacing:0px;fill:#000000;fill-opacity:1;stroke:none"
       id="flowRoot964"
       xml:space="preserve"><flowRegion
         style="fill:#000000;fill-opacity:1"
         id="flowRegion960"><rect
           style="fill:#000000;fill-opacity:1"
           y="156.8054"
           x="197.14285"
           height="156.79622"
           width="714.4743"
           id="rect958" /></flowRegion><flowPara
         style="font-style:normal;font-variant:normal;font-weight:normal;font-stretch:normal;font-size:33.33333969px;font-family:'Liberation Sans';-inkscape-font-specification:'Liberation Sans';fill:#000000;fill-opacity:1"
         id="flowPara962">légende :</flowPara></flowRoot>    <g
       id="g1542"
       transform="translate(0,11.339286)">
      <flowRoot
         xml:space="preserve"
         id="flowRoot1059"
         style="font-style:normal;font-weight:normal;font-size:40px;line-height:1.25;font-family:sans-serif;text-align:center;letter-spacing:0px;word-spacing:0px;text-anchor:middle;fill:#000000;fill-opacity:1;stroke:none"
         transform="matrix(0.26458333,0,0,0.26458333,-237.39476,145.67206)"><flowRegion
           style="text-align:center;text-anchor:middle"
           id="flowRegion1055"><rect
             style="text-align:center;text-anchor:middle"
             id="rect1053"
             width="685.71429"
             height="211.42857"
             x="-520"
             y="-457.48032" /></flowRegion><flowPara
           id="flowPara1057"
           style="font-style:italic;font-variant:normal;font-weight:normal;font-stretch:normal;font-size:40px;font-family:'Liberation Sans';-inkscape-font-specification:'Liberation Sans';text-align:center;text-anchor:middle">Commerces recensées par la municipalé Parisienne</flowPara></flowRoot>      <rect
         y="57.027836"
         x="-321.46738"
         height="27.290268"
         width="74.991234"
         id="rect984"
         style="fill:#000000;fill-opacity:0;stroke:#443f65;stroke-width:3;stroke-miterlimit:4;stroke-dasharray:none;stroke-opacity:1" />
      <flowRoot
         transform="matrix(0.26458333,0,0,0.26458333,-350.29175,23.232727)"
         style="font-style:normal;font-weight:normal;font-size:40px;line-height:1.25;font-family:sans-serif;letter-spacing:0px;word-spacing:0px;fill:#000000;fill-opacity:1;stroke:none"
         id="flowRoot992"
         xml:space="preserve"><flowRegion
           id="flowRegion988"><rect
             y="156.8054"
             x="197.14285"
             height="162.85715"
             width="411.42856"
             id="rect986" /></flowRegion><flowPara
           style="font-style:normal;font-variant:normal;font-weight:normal;font-stretch:normal;font-family:'Liberation Serif';-inkscape-font-specification:'Liberation Serif'"
           id="flowPara990">APUR</flowPara></flowRoot>      <flowRoot
         transform="matrix(0.26458333,0,0,0.26458333,-387.97326,48.06703)"
         style="font-style:normal;font-weight:normal;font-size:40px;line-height:1.25;font-family:sans-serif;letter-spacing:0px;word-spacing:0px;fill:#000000;fill-opacity:1;stroke:none"
         id="flowRoot1000"
         xml:space="preserve"><flowRegion
           id="flowRegion996"><rect
             y="156.8054"
             x="197.14285"
             height="162.85715"
             width="411.42856"
             id="rect994" /></flowRegion><flowPara
           style="font-style:normal;font-variant:normal;font-weight:normal;font-stretch:normal;font-size:33.33333206px;font-family:'Liberation Sans';-inkscape-font-specification:'Liberation Sans';fill:#0000b2;fill-opacity:1"
           id="flowPara998">220 types d'établissement</flowPara></flowRoot>      <flowRoot
         xml:space="preserve"
         id="flowRoot1115"
         style="font-style:normal;font-weight:normal;font-size:40px;font-family:sans-serif;text-align:center;letter-spacing:0px;word-spacing:0px;text-anchor:middle;fill:#c60000;fill-opacity:1;stroke:none"
         transform="matrix(0.26458333,0,0,0.26458333,-400.80762,61.167662)"><flowRegion
           style="text-align:center;text-anchor:middle;fill:#c60000;fill-opacity:1"
           id="flowRegion1111"><rect
             style="text-align:center;text-anchor:middle;fill:#c60000;fill-opacity:1"
             id="rect1109"
             width="434.66205"
             height="206.29372"
             x="197.14285"
             y="156.8054" /></flowRegion><flowPara
           id="flowPara1113"
           style="font-style:normal;font-variant:normal;font-weight:normal;font-stretch:normal;font-size:33.33333206px;line-height:2px;font-family:'Liberation Sans';-inkscape-font-specification:'Liberation Sans';text-align:center;text-anchor:middle;fill:#c60000;fill-opacity:1">* Classe de surface de l'établissement</flowPara><flowPara
           id="flowPara1119"
           style="font-style:normal;font-variant:normal;font-weight:normal;font-stretch:normal;font-size:33.33333206px;line-height:2px;font-family:'Liberation Sans';-inkscape-font-specification:'Liberation Sans';text-align:center;text-anchor:middle;fill:#c60000;fill-opacity:1">x </flowPara><flowPara
           id="flowPara1121"
           style="font-style:normal;font-variant:normal;font-weight:normal;font-stretch:normal;font-size:33.33333206px;line-height:2px;font-family:'Liberation Sans';-inkscape-font-specification:'Liberation Sans';text-align:center;text-anchor:middle;fill:#c60000;fill-opacity:1">Libellé de l'activité </flowPara><flowPara
           id="flowPara1117"
           style="font-style:normal;font-variant:normal;font-weight:normal;font-stretch:normal;font-size:33.33333206px;line-height:2px;font-family:'Liberation Sans';-inkscape-font-specification:'Liberation Sans';text-align:center;text-anchor:middle;fill:#c60000;fill-opacity:1" /></flowRoot>      <flowRoot
         transform="matrix(0.26458333,0,0,0.26458333,-406.03202,113.98337)"
         style="font-style:normal;font-weight:normal;font-size:40px;line-height:1.25;font-family:sans-serif;text-align:center;letter-spacing:0px;word-spacing:0px;text-anchor:middle;fill:#c60000;fill-opacity:1;stroke:none"
         id="flowRoot1135"
         xml:space="preserve"><flowRegion
           id="flowRegion1125"
           style="text-align:center;text-anchor:middle;fill:#c60000;fill-opacity:1"><rect
             y="156.8054"
             x="197.14285"
             height="218.41554"
             width="440.72299"
             id="rect1123"
             style="text-align:center;text-anchor:middle;fill:#c60000;fill-opacity:1" /></flowRegion><flowPara
           style="font-style:normal;font-variant:normal;font-weight:normal;font-stretch:normal;font-size:33.33333206px;font-family:'Liberation Sans';-inkscape-font-specification:'Liberation Sans';text-align:center;text-anchor:middle;fill:#c60000;fill-opacity:1"
           id="flowPara1133">* Centre commercial</flowPara></flowRoot>      <flowRoot
         xml:space="preserve"
         id="flowRoot1384"
         style="font-style:normal;font-weight:normal;font-size:40px;line-height:1.25;font-family:sans-serif;text-align:center;letter-spacing:0px;word-spacing:0px;text-anchor:middle;fill:#418424;fill-opacity:1;stroke:none"
         transform="matrix(0.26458333,0,0,0.26458333,-396.79701,127.16083)"><flowRegion
           style="text-align:center;text-anchor:middle;fill:#418424;fill-opacity:1"
           id="flowRegion1380"><rect
             style="text-align:center;text-anchor:middle;fill:#418424;fill-opacity:1"
             id="rect1378"
             width="440.72299"
             height="218.41554"
             x="197.14285"
             y="156.8054" /></flowRegion><flowPara
           id="flowPara1382"
           style="font-style:normal;font-variant:normal;font-weight:normal;font-stretch:normal;font-size:33.33333206px;font-family:'Liberation Sans';-inkscape-font-specification:'Liberation Sans';text-align:center;text-anchor:middle;fill:#418424;fill-opacity:1">Entrée des établissement controlée manuellement</flowPara></flowRoot>      <path
         sodipodi:nodetypes="cc"
         inkscape:connector-curvature="0"
         id="path966"
         d="m -283.00454,164.81473 v 8.31434"
         style="fill:none;stroke:#000000;stroke-width:0.26458332px;stroke-linecap:butt;stroke-linejoin:miter;stroke-opacity:1" />
    </g>
    <path
       style="fill:none;stroke:#000000;stroke-width:0.26458332px;stroke-linecap:butt;stroke-linejoin:miter;stroke-opacity:1"
       d="M -209.86503,67.918568 V 170.7281"
       id="path1544"
       inkscape:connector-curvature="0" />
    <path
       inkscape:connector-curvature="0"
       id="path1546"
       d="M 126.80294,67.918568 V 170.7281"
       style="fill:none;stroke:#000000;stroke-width:0.26458332px;stroke-linecap:butt;stroke-linejoin:miter;stroke-opacity:1" />
    <path
       style="fill:none;stroke:#000000;stroke-width:0.26458332px;stroke-linecap:butt;stroke-linejoin:miter;stroke-opacity:1"
       d="M 9.38436,67.918568 V 170.7281"
       id="path1548"
       inkscape:connector-curvature="0" />
    <flowRoot
       xml:space="preserve"
       id="flowRoot1552"
       style="font-style:normal;font-weight:normal;font-size:40px;line-height:1.25;font-family:sans-serif;letter-spacing:0px;word-spacing:0px;fill:#000000;fill-opacity:1;stroke:none"
       transform="matrix(0.26458333,0,0,0.26458333,-352.7686,-2.7018219)"><flowRegion
         id="flowRegion1554"><rect
           id="rect1556"
           width="2411.4287"
           height="820"
           x="-122.85715"
           y="61.19743" /></flowRegion><flowPara
         id="flowPara1558"></flowPara></flowRoot>  </g>
</svg>
