<?xml version="1.0" encoding="UTF-8" standalone="no"?>
<svg
   xmlns:dc="http://purl.org/dc/elements/1.1/"
   xmlns:cc="http://creativecommons.org/ns#"
   xmlns:rdf="http://www.w3.org/1999/02/22-rdf-syntax-ns#"
   xmlns:svg="http://www.w3.org/2000/svg"
   xmlns="http://www.w3.org/2000/svg"
   xmlns:sodipodi="http://sodipodi.sourceforge.net/DTD/sodipodi-0.dtd"
   xmlns:inkscape="http://www.inkscape.org/namespaces/inkscape"
   width="921.0177mm"
   height="588.28381mm"
   viewBox="0 0 921.0177 588.28382"
   version="1.1"
   id="svg8"
   inkscape:version="1.0.1 (3bc2e813f5, 2020-09-07)"
   sodipodi:docname="planGraph.svg"
   inkscape:export-filename="./planGraph.png"
   inkscape:export-xdpi="100"
   inkscape:export-ydpi="100">
  <defs
     id="defs2">
    <rect
       x="-816.82167"
       y="407.64042"
       width="96.914695"
       height="36.786818"
       id="rect1282" />
    <rect
       x="-869.37921"
       y="-58.052048"
       width="138.21646"
       height="71.678825"
       id="rect259" />
    <rect
       x="-811.09235"
       y="-10.518392"
       width="201.81741"
       height="159.63783"
       id="rect253" />
    <rect
       x="-439.56708"
       y="495.401"
       width="84.71563"
       height="45.734982"
       id="rect205" />
    <rect
       x="19.367271"
       y="96.13163"
       width="97.891541"
       height="29.01318"
       id="rect16" />
    <rect
       x="19.367271"
       y="96.13163"
       width="90.257355"
       height="43.473942"
       id="rect57" />
    <rect
       x="19.367271"
       y="96.13163"
       width="97.891541"
       height="29.01318"
       id="rect101" />
    <rect
       x="19.367271"
       y="96.13163"
       width="90.257355"
       height="43.473942"
       id="rect115" />
    <rect
       x="19.367271"
       y="96.13163"
       width="90.257355"
       height="43.473942"
       id="rect129" />
    <rect
       x="19.367271"
       y="96.13163"
       width="118.55008"
       height="46.603199"
       id="rect143" />
    <rect
       x="19.367271"
       y="96.13163"
       width="90.257355"
       height="43.473942"
       id="rect159" />
    <rect
       x="19.367271"
       y="96.13163"
       width="90.257355"
       height="43.473942"
       id="rect173" />
    <rect
       x="19.367271"
       y="96.13163"
       width="90.257355"
       height="43.473942"
       id="rect187" />
    <rect
       x="19.367271"
       y="96.13163"
       width="90.257355"
       height="43.473942"
       id="rect201" />
    <rect
       x="-811.09235"
       y="-10.518392"
       width="201.81741"
       height="159.63783"
       id="rect1092" />
    <rect
       x="-811.09235"
       y="-10.518392"
       width="201.81741"
       height="159.63783"
       id="rect1100" />
    <rect
       x="-811.09235"
       y="-10.518392"
       width="201.81741"
       height="159.63783"
       id="rect1206" />
    <rect
       x="19.367271"
       y="96.13163"
       width="90.257355"
       height="43.473942"
       id="rect159-7" />
    <rect
       x="19.367271"
       y="96.13163"
       width="90.257355"
       height="43.473942"
       id="rect1245" />
    <rect
       x="-811.09235"
       y="-10.518392"
       width="201.81741"
       height="159.63783"
       id="rect1302" />
    <rect
       x="19.367271"
       y="96.13163"
       width="90.257355"
       height="43.473942"
       id="rect159-3" />
    <rect
       x="19.367271"
       y="96.13163"
       width="90.257355"
       height="43.473942"
       id="rect1029" />
    <rect
       x="19.367271"
       y="96.13163"
       width="90.257355"
       height="43.473942"
       id="rect1081" />
    <rect
       x="19.367271"
       y="96.13163"
       width="90.257355"
       height="43.473942"
       id="rect1097" />
    <rect
       x="19.367271"
       y="96.13163"
       width="90.257355"
       height="43.473942"
       id="rect1113" />
    <rect
       x="19.367271"
       y="96.13163"
       width="90.257355"
       height="43.473942"
       id="rect1129" />
    <rect
       x="19.367271"
       y="96.13163"
       width="90.257355"
       height="43.473942"
       id="rect1146" />
    <rect
       x="-811.09235"
       y="-10.518392"
       width="201.81741"
       height="159.63783"
       id="rect1278" />
    <rect
       x="-816.82167"
       y="407.64042"
       width="96.914695"
       height="36.786818"
       id="rect1288" />
    <rect
       x="-816.82167"
       y="407.64042"
       width="96.914695"
       height="36.786818"
       id="rect1292" />
    <rect
       x="-816.82167"
       y="407.64042"
       width="96.914695"
       height="36.786818"
       id="rect1296" />
    <rect
       x="-816.82166"
       y="407.64041"
       width="96.914696"
       height="36.786819"
       id="rect1282-2" />
    <rect
       x="-816.82166"
       y="407.64041"
       width="96.914696"
       height="36.786819"
       id="rect1307" />
    <rect
       x="-816.82166"
       y="407.64041"
       width="96.914696"
       height="36.786819"
       id="rect1288-7" />
    <rect
       x="-816.82166"
       y="407.64041"
       width="96.914696"
       height="36.786819"
       id="rect1310" />
    <rect
       x="-816.82166"
       y="407.64041"
       width="96.914696"
       height="36.786819"
       id="rect1292-0" />
    <rect
       x="-816.82166"
       y="407.64041"
       width="96.914696"
       height="36.786819"
       id="rect1313" />
    <rect
       x="-816.82166"
       y="407.64041"
       width="96.914696"
       height="36.786819"
       id="rect1296-9" />
    <rect
       x="-816.82166"
       y="407.64041"
       width="96.914696"
       height="36.786819"
       id="rect1316" />
    <rect
       x="-816.82166"
       y="407.64041"
       width="96.914696"
       height="36.786819"
       id="rect1282-26" />
    <rect
       x="-816.82166"
       y="407.64041"
       width="96.914696"
       height="36.786819"
       id="rect1307-1" />
    <rect
       x="-816.82166"
       y="407.64041"
       width="96.914696"
       height="36.786819"
       id="rect1288-8" />
    <rect
       x="-816.82166"
       y="407.64041"
       width="96.914696"
       height="36.786819"
       id="rect1310-7" />
    <rect
       x="-816.82166"
       y="407.64041"
       width="96.914696"
       height="36.786819"
       id="rect1292-9" />
    <rect
       x="-816.82166"
       y="407.64041"
       width="96.914696"
       height="36.786819"
       id="rect1313-2" />
    <rect
       x="-816.82166"
       y="407.64041"
       width="96.914696"
       height="36.786819"
       id="rect1296-0" />
    <rect
       x="-816.82166"
       y="407.64041"
       width="96.914696"
       height="36.786819"
       id="rect1316-2" />
    <rect
       x="-816.82166"
       y="407.64041"
       width="96.914696"
       height="36.786819"
       id="rect1450" />
    <rect
       x="-816.82166"
       y="407.64041"
       width="96.914696"
       height="36.786819"
       id="rect1452" />
    <rect
       x="-816.82166"
       y="407.64041"
       width="96.914696"
       height="36.786819"
       id="rect1454" />
    <rect
       x="-816.82166"
       y="407.64041"
       width="96.914696"
       height="36.786819"
       id="rect1456" />
    <rect
       x="-816.82166"
       y="407.64041"
       width="96.914696"
       height="36.786819"
       id="rect1462" />
  </defs>
  <sodipodi:namedview
     id="base"
     pagecolor="#ffffff"
     bordercolor="#666666"
     borderopacity="1.0"
     inkscape:pageopacity="0.0"
     inkscape:pageshadow="2"
     inkscape:zoom="0.175"
     inkscape:cx="1905.453"
     inkscape:cy="1362.463"
     inkscape:document-units="mm"
     inkscape:current-layer="layer1"
     inkscape:document-rotation="0"
     showgrid="false"
     inkscape:window-width="1366"
     inkscape:window-height="744"
     inkscape:window-x="1600"
     inkscape:window-y="0"
     inkscape:window-maximized="1" />
  <metadata
     id="metadata5">
    <rdf:RDF>
      <cc:Work
         rdf:about="">
        <dc:format>image/svg+xml</dc:format>
        <dc:type
           rdf:resource="http://purl.org/dc/dcmitype/StillImage" />
        <dc:title />
      </cc:Work>
    </rdf:RDF>
  </metadata>
  <g
     inkscape:label="Calque 1"
     inkscape:groupmode="layer"
     id="layer1"
     transform="translate(867.32752,315.32509)">
    <text
       xml:space="preserve"
       id="text1298"
       style="font-style:normal;font-weight:normal;font-size:10.5833px;line-height:1.25;font-family:sans-serif;letter-spacing:0px;word-spacing:0px;white-space:pre;shape-inside:url(#rect1302);fill:#000000;fill-opacity:1;stroke:none;"
       transform="translate(239.23723,250.03114)"
       inkscape:export-filename="./planGraph.png"
       inkscape:export-xdpi="100"
       inkscape:export-ydpi="100"><tspan
         x="-811.0918"
         y="-1.1538384"><tspan>cf 2ème schéma</tspan></tspan></text>
    <g
       id="g1108"
       transform="translate(-514.08102,-177.58511)"
       inkscape:export-filename="./planGraph.png"
       inkscape:export-xdpi="100"
       inkscape:export-ydpi="100">
      <rect
         style="fill:#ffffff;stroke:#000000;stroke-width:0.920188"
         id="rect10"
         width="97.638176"
         height="111.71048"
         x="2.8807349"
         y="-8.4731016" />
      <path
         style="fill:none;stroke:#000000;stroke-width:0.266591px;stroke-linecap:butt;stroke-linejoin:miter;stroke-opacity:1"
         d="M 3.0522365,28.477629 H 100.77227"
         id="path12" />
      <text
         xml:space="preserve"
         id="text14"
         style="font-style:normal;font-weight:normal;font-size:14.8167px;line-height:1.25;font-family:sans-serif;letter-spacing:0px;word-spacing:0px;white-space:pre;shape-inside:url(#rect16);fill:#000000;fill-opacity:1;stroke:none;"
         transform="translate(5.942068,-93.555931)"><tspan
           x="19.367188"
           y="109.24017"><tspan
             style="shape-inside:url(#rect16)">Trottoir</tspan></tspan></text>
      <path
         style="fill:none;stroke:#000000;stroke-width:0.266591px;stroke-linecap:butt;stroke-linejoin:miter;stroke-opacity:1"
         d="M 3.0522365,-8.1565709 H 100.77227"
         id="path26" />
      <path
         style="fill:none;stroke:#000000;stroke-width:0.264583px;stroke-linecap:butt;stroke-linejoin:miter;stroke-opacity:1"
         d="M 2.8807345,-8.4731049 V 20.331228"
         id="path28" />
      <path
         style="fill:none;stroke:#000000;stroke-width:0.264583px;stroke-linecap:butt;stroke-linejoin:miter;stroke-opacity:1"
         d="M 100.29076,-8.4731049 V 20.331228"
         id="path30" />
    </g>
    <rect
       style="fill:#ffffff;stroke:#000000;stroke-width:0.920188"
       id="rect89"
       width="97.638176"
       height="111.71048"
       x="-253.91365"
       y="-237.79984"
       inkscape:export-filename="./planGraph.png"
       inkscape:export-xdpi="100"
       inkscape:export-ydpi="100" />
    <path
       style="fill:none;stroke:#000000;stroke-width:0.266591px;stroke-linecap:butt;stroke-linejoin:miter;stroke-opacity:1"
       d="m -253.74216,-200.8491 h 97.72004"
       id="path91"
       inkscape:export-filename="./planGraph.png"
       inkscape:export-xdpi="100"
       inkscape:export-ydpi="100" />
    <path
       style="fill:none;stroke:#000000;stroke-width:0.266591px;stroke-linecap:butt;stroke-linejoin:miter;stroke-opacity:1"
       d="m -253.74216,-237.4833 h 97.72004"
       id="path95"
       inkscape:export-filename="./planGraph.png"
       inkscape:export-xdpi="100"
       inkscape:export-ydpi="100" />
    <path
       style="fill:none;stroke:#000000;stroke-width:0.264583px;stroke-linecap:butt;stroke-linejoin:miter;stroke-opacity:1"
       d="m -253.91365,-237.79984 v 28.80434"
       id="path97"
       inkscape:export-filename="./planGraph.png"
       inkscape:export-xdpi="100"
       inkscape:export-ydpi="100" />
    <path
       style="fill:none;stroke:#000000;stroke-width:0.264583px;stroke-linecap:butt;stroke-linejoin:miter;stroke-opacity:1"
       d="m -156.50362,-237.79984 v 28.80434"
       id="path99"
       inkscape:export-filename="./planGraph.png"
       inkscape:export-xdpi="100"
       inkscape:export-ydpi="100" />
    <text
       xml:space="preserve"
       id="text47"
       style="font-style:normal;font-weight:normal;font-size:13.4056px;line-height:1.25;font-family:sans-serif;text-align:center;letter-spacing:0px;word-spacing:0px;white-space:pre;shape-inside:url(#rect57);fill:#000000;fill-opacity:1;stroke:none;"
       transform="translate(-270.36257,-332.04424)"
       inkscape:transform-center-x="2.9188879"
       inkscape:transform-center-y="-1.2654843"
       x="26.70974"
       y="0"
       inkscape:export-filename="./planGraph.png"
       inkscape:export-xdpi="100"
       inkscape:export-ydpi="100"><tspan
         x="37.177603"
         y="107.99167"><tspan
           style="shape-inside:url(#rect57)">Passage </tspan></tspan><tspan
         x="43.278198"
         y="124.74868"><tspan
           style="shape-inside:url(#rect57)">piéton</tspan></tspan></text>
    <rect
       style="fill:#ffffff;stroke:#000000;stroke-width:0.920188"
       id="rect103"
       width="97.638176"
       height="111.71048"
       x="-82.964981"
       y="-87.902191"
       inkscape:export-filename="./planGraph.png"
       inkscape:export-xdpi="100"
       inkscape:export-ydpi="100" />
    <path
       style="fill:none;stroke:#000000;stroke-width:0.266591px;stroke-linecap:butt;stroke-linejoin:miter;stroke-opacity:1"
       d="m -82.793492,-50.95145 h 97.72004"
       id="path105"
       inkscape:export-filename="./planGraph.png"
       inkscape:export-xdpi="100"
       inkscape:export-ydpi="100" />
    <path
       style="fill:none;stroke:#000000;stroke-width:0.266591px;stroke-linecap:butt;stroke-linejoin:miter;stroke-opacity:1"
       d="m -82.793492,-87.585659 h 97.72004"
       id="path107"
       inkscape:export-filename="./planGraph.png"
       inkscape:export-xdpi="100"
       inkscape:export-ydpi="100" />
    <path
       style="fill:none;stroke:#000000;stroke-width:0.264583px;stroke-linecap:butt;stroke-linejoin:miter;stroke-opacity:1"
       d="M -82.964982,-87.902196 V -59.09786"
       id="path109"
       inkscape:export-filename="./planGraph.png"
       inkscape:export-xdpi="100"
       inkscape:export-ydpi="100" />
    <path
       style="fill:none;stroke:#000000;stroke-width:0.264583px;stroke-linecap:butt;stroke-linejoin:miter;stroke-opacity:1"
       d="M 14.445028,-87.902196 V -59.09786"
       id="path111"
       inkscape:export-filename="./planGraph.png"
       inkscape:export-xdpi="100"
       inkscape:export-ydpi="100" />
    <text
       xml:space="preserve"
       id="text113"
       style="font-style:normal;font-weight:normal;font-size:13.4056px;line-height:1.25;font-family:sans-serif;letter-spacing:0px;word-spacing:0px;white-space:pre;shape-inside:url(#rect115);fill:#000000;fill-opacity:1;stroke:none;"
       transform="translate(-71.516562,-172.46878)"
       inkscape:transform-center-x="2.9188879"
       inkscape:transform-center-y="-1.2654843"
       inkscape:export-filename="./planGraph.png"
       inkscape:export-xdpi="100"
       inkscape:export-ydpi="100"><tspan
         x="19.367188"
         y="107.99167"><tspan
           style="shape-inside:url(#rect115)">Autre</tspan></tspan></text>
    <rect
       style="fill:#ffffff;stroke:#000000;stroke-width:0.920188"
       id="rect117"
       width="97.638176"
       height="111.71048"
       x="-644.47388"
       y="-311.90982"
       inkscape:export-filename="./planGraph.png"
       inkscape:export-xdpi="100"
       inkscape:export-ydpi="100" />
    <path
       style="fill:none;stroke:#000000;stroke-width:0.266591px;stroke-linecap:butt;stroke-linejoin:miter;stroke-opacity:1"
       d="m -644.30235,-274.95911 h 97.72004"
       id="path119"
       inkscape:export-filename="./planGraph.png"
       inkscape:export-xdpi="100"
       inkscape:export-ydpi="100" />
    <path
       style="fill:none;stroke:#000000;stroke-width:0.266591px;stroke-linecap:butt;stroke-linejoin:miter;stroke-opacity:1"
       d="m -644.30235,-311.5933 h 97.72004"
       id="path121"
       inkscape:export-filename="./planGraph.png"
       inkscape:export-xdpi="100"
       inkscape:export-ydpi="100" />
    <path
       style="fill:none;stroke:#000000;stroke-width:0.264583px;stroke-linecap:butt;stroke-linejoin:miter;stroke-opacity:1"
       d="m -644.47385,-311.90983 v 28.80434"
       id="path123"
       inkscape:export-filename="./planGraph.png"
       inkscape:export-xdpi="100"
       inkscape:export-ydpi="100" />
    <path
       style="fill:none;stroke:#000000;stroke-width:0.264583px;stroke-linecap:butt;stroke-linejoin:miter;stroke-opacity:1"
       d="m -547.06382,-311.90983 v 28.80434"
       id="path125"
       inkscape:export-filename="./planGraph.png"
       inkscape:export-xdpi="100"
       inkscape:export-ydpi="100" />
    <text
       xml:space="preserve"
       id="text127"
       style="font-style:normal;font-weight:normal;font-size:13.4056px;line-height:1.25;font-family:sans-serif;letter-spacing:0px;word-spacing:0px;white-space:pre;shape-inside:url(#rect129);fill:#000000;fill-opacity:1;stroke:none;"
       transform="translate(-643.54764,-396.00186)"
       inkscape:transform-center-x="2.9188879"
       inkscape:transform-center-y="-1.2654843"
       inkscape:export-filename="./planGraph.png"
       inkscape:export-xdpi="100"
       inkscape:export-ydpi="100"><tspan
         x="19.367188"
         y="107.99167"><tspan
           style="shape-inside:url(#rect129)">Chaussé</tspan></tspan></text>
    <rect
       style="fill:#ffffff;stroke:#000000;stroke-width:0.920188"
       id="rect131"
       width="97.638176"
       height="111.71048"
       x="-709.60529"
       y="-143.57735"
       inkscape:export-filename="./planGraph.png"
       inkscape:export-xdpi="100"
       inkscape:export-ydpi="100" />
    <path
       style="fill:none;stroke:#000000;stroke-width:0.266591px;stroke-linecap:butt;stroke-linejoin:miter;stroke-opacity:1"
       d="m -709.43376,-106.62661 h 97.72003"
       id="path133"
       inkscape:export-filename="./planGraph.png"
       inkscape:export-xdpi="100"
       inkscape:export-ydpi="100" />
    <path
       style="fill:none;stroke:#000000;stroke-width:0.266591px;stroke-linecap:butt;stroke-linejoin:miter;stroke-opacity:1"
       d="m -709.43376,-143.26081 h 97.72003"
       id="path135"
       inkscape:export-filename="./planGraph.png"
       inkscape:export-xdpi="100"
       inkscape:export-ydpi="100" />
    <path
       style="fill:none;stroke:#000000;stroke-width:0.264583px;stroke-linecap:butt;stroke-linejoin:miter;stroke-opacity:1"
       d="m -709.60526,-143.57736 v 28.80434"
       id="path137"
       inkscape:export-filename="./planGraph.png"
       inkscape:export-xdpi="100"
       inkscape:export-ydpi="100" />
    <path
       style="fill:none;stroke:#000000;stroke-width:0.264583px;stroke-linecap:butt;stroke-linejoin:miter;stroke-opacity:1"
       d="m -612.19524,-143.57736 v 28.80434"
       id="path139"
       inkscape:export-filename="./planGraph.png"
       inkscape:export-xdpi="100"
       inkscape:export-ydpi="100" />
    <text
       xml:space="preserve"
       id="text141"
       style="font-style:normal;font-weight:normal;font-size:12.3472px;line-height:1.25;font-family:sans-serif;text-align:center;letter-spacing:0px;word-spacing:0px;white-space:pre;shape-inside:url(#rect143);fill:#000000;fill-opacity:1;stroke:none;"
       transform="translate(-739.20219,-236.1342)"
       inkscape:transform-center-x="2.9188879"
       inkscape:transform-center-y="-1.2654843"
       x="50.827385"
       y="0"
       inkscape:export-filename="./planGraph.png"
       inkscape:export-xdpi="100"
       inkscape:export-ydpi="100"><tspan
         x="46.939574"
         y="107.05524"><tspan
           style="shape-inside:url(#rect143)">Aire mixte </tspan></tspan><tspan
         x="31.119723"
         y="122.48924"><tspan
           style="shape-inside:url(#rect143)">véhicule/piéton</tspan></tspan></text>
    <rect
       style="fill:#ffffff;stroke:#000000;stroke-width:0.920188"
       id="rect147"
       width="97.638176"
       height="111.71048"
       x="-488.31973"
       y="71.831947"
       inkscape:export-filename="./planGraph.png"
       inkscape:export-xdpi="100"
       inkscape:export-ydpi="100" />
    <path
       style="fill:none;stroke:#000000;stroke-width:0.266591px;stroke-linecap:butt;stroke-linejoin:miter;stroke-opacity:1"
       d="m -488.14825,108.78265 h 97.72004"
       id="path149"
       inkscape:export-filename="./planGraph.png"
       inkscape:export-xdpi="100"
       inkscape:export-ydpi="100" />
    <path
       style="fill:none;stroke:#000000;stroke-width:0.266591px;stroke-linecap:butt;stroke-linejoin:miter;stroke-opacity:1"
       d="m -488.14825,72.148469 h 97.72004"
       id="path151"
       inkscape:export-filename="./planGraph.png"
       inkscape:export-xdpi="100"
       inkscape:export-ydpi="100" />
    <path
       style="fill:none;stroke:#000000;stroke-width:0.264583px;stroke-linecap:butt;stroke-linejoin:miter;stroke-opacity:1"
       d="M -488.31976,71.831937 V 100.63628"
       id="path153"
       inkscape:export-filename="./planGraph.png"
       inkscape:export-xdpi="100"
       inkscape:export-ydpi="100" />
    <path
       style="fill:none;stroke:#000000;stroke-width:0.264583px;stroke-linecap:butt;stroke-linejoin:miter;stroke-opacity:1"
       d="M -390.90975,71.831937 V 100.63628"
       id="path155"
       inkscape:export-filename="./planGraph.png"
       inkscape:export-xdpi="100"
       inkscape:export-ydpi="100" />
    <text
       xml:space="preserve"
       id="text157"
       style="font-style:normal;font-weight:normal;font-size:13.4056px;line-height:1.25;font-family:sans-serif;letter-spacing:0px;word-spacing:0px;white-space:pre;shape-inside:url(#rect159);fill:#000000;fill-opacity:1;stroke:none;"
       transform="translate(-485.76368,-12.528463)"
       inkscape:transform-center-x="2.9188879"
       inkscape:transform-center-y="-1.2654843"
       inkscape:export-filename="./planGraph.png"
       inkscape:export-xdpi="100"
       inkscape:export-ydpi="100"><tspan
         x="19.367188"
         y="107.99167"><tspan
           style="shape-inside:url(#rect159)">Escalier</tspan></tspan></text>
    <rect
       style="fill:#ffffff;stroke:#000000;stroke-width:0.920188"
       id="rect161"
       width="97.638176"
       height="111.71048"
       x="-44.408112"
       y="-290.52277"
       inkscape:export-filename="./planGraph.png"
       inkscape:export-xdpi="100"
       inkscape:export-ydpi="100" />
    <path
       style="fill:none;stroke:#000000;stroke-width:0.266591px;stroke-linecap:butt;stroke-linejoin:miter;stroke-opacity:1"
       d="m -44.236619,-253.57207 h 97.72004"
       id="path163"
       inkscape:export-filename="./planGraph.png"
       inkscape:export-xdpi="100"
       inkscape:export-ydpi="100" />
    <path
       style="fill:none;stroke:#000000;stroke-width:0.266591px;stroke-linecap:butt;stroke-linejoin:miter;stroke-opacity:1"
       d="m -44.236619,-290.20626 h 97.72004"
       id="path165"
       inkscape:export-filename="./planGraph.png"
       inkscape:export-xdpi="100"
       inkscape:export-ydpi="100" />
    <path
       style="fill:none;stroke:#000000;stroke-width:0.264583px;stroke-linecap:butt;stroke-linejoin:miter;stroke-opacity:1"
       d="m -44.408119,-290.52279 v 28.80434"
       id="path167"
       inkscape:export-filename="./planGraph.png"
       inkscape:export-xdpi="100"
       inkscape:export-ydpi="100" />
    <path
       style="fill:none;stroke:#000000;stroke-width:0.264583px;stroke-linecap:butt;stroke-linejoin:miter;stroke-opacity:1"
       d="m 53.001891,-290.52279 v 28.80434"
       id="path169"
       inkscape:export-filename="./planGraph.png"
       inkscape:export-xdpi="100"
       inkscape:export-ydpi="100" />
    <text
       xml:space="preserve"
       id="text171"
       style="font-style:normal;font-weight:normal;font-size:13.4056px;line-height:1.25;font-family:sans-serif;letter-spacing:0px;word-spacing:0px;white-space:pre;shape-inside:url(#rect173);fill:#000000;fill-opacity:1;stroke:none;"
       transform="translate(-49.412329,-376.18252)"
       inkscape:transform-center-x="2.9188879"
       inkscape:transform-center-y="-1.2654843"
       inkscape:export-filename="./planGraph.png"
       inkscape:export-xdpi="100"
       inkscape:export-ydpi="100"><tspan
         x="19.367188"
         y="107.99167"><tspan
           style="shape-inside:url(#rect173)">Terre plein</tspan></tspan></text>
    <rect
       style="fill:#ffffff;stroke:#000000;stroke-width:0.920188"
       id="rect175"
       width="97.638176"
       height="111.71048"
       x="-640.35577"
       y="92.472389"
       inkscape:export-filename="./schemaStructure.png"
       inkscape:export-xdpi="100"
       inkscape:export-ydpi="100" />
    <path
       style="fill:none;stroke:#000000;stroke-width:0.266591px;stroke-linecap:butt;stroke-linejoin:miter;stroke-opacity:1"
       d="m -640.1843,129.4231 h 97.72004"
       id="path177"
       inkscape:export-filename="./schemaStructure.png"
       inkscape:export-xdpi="100"
       inkscape:export-ydpi="100" />
    <path
       style="fill:none;stroke:#000000;stroke-width:0.266591px;stroke-linecap:butt;stroke-linejoin:miter;stroke-opacity:1"
       d="m -640.1843,92.78891 h 97.72004"
       id="path179"
       inkscape:export-filename="./schemaStructure.png"
       inkscape:export-xdpi="100"
       inkscape:export-ydpi="100" />
    <path
       style="fill:none;stroke:#000000;stroke-width:0.264583px;stroke-linecap:butt;stroke-linejoin:miter;stroke-opacity:1"
       d="m -640.35577,92.47239 v 28.80434"
       id="path181"
       inkscape:export-filename="./schemaStructure.png"
       inkscape:export-xdpi="100"
       inkscape:export-ydpi="100" />
    <path
       style="fill:none;stroke:#000000;stroke-width:0.264583px;stroke-linecap:butt;stroke-linejoin:miter;stroke-opacity:1"
       d="m -542.94576,92.47239 v 28.80434"
       id="path183"
       inkscape:export-filename="./schemaStructure.png"
       inkscape:export-xdpi="100"
       inkscape:export-ydpi="100" />
    <text
       xml:space="preserve"
       id="text185"
       style="font-style:normal;font-weight:normal;font-size:13.4056px;line-height:1.25;font-family:sans-serif;letter-spacing:0px;word-spacing:0px;white-space:pre;shape-inside:url(#rect187);fill:#000000;fill-opacity:1;stroke:none;"
       transform="translate(-642.24096,8.38035)"
       inkscape:transform-center-x="2.9188879"
       inkscape:transform-center-y="-1.2654843"
       inkscape:export-filename="./schemaStructure.png"
       inkscape:export-xdpi="100"
       inkscape:export-ydpi="100"><tspan
         x="19.367188"
         y="107.99167"><tspan
           style="shape-inside:url(#rect187)">Bâtiment</tspan></tspan></text>
    <rect
       style="fill:#ffffff;stroke:#000000;stroke-width:0.920188"
       id="rect189"
       width="97.638176"
       height="111.71048"
       x="-272.5899"
       y="-3.1997647"
       inkscape:export-filename="./planGraph.png"
       inkscape:export-xdpi="100"
       inkscape:export-ydpi="100" />
    <path
       style="fill:none;stroke:#000000;stroke-width:0.266591px;stroke-linecap:butt;stroke-linejoin:miter;stroke-opacity:1"
       d="m -272.41844,33.750892 h 97.72004"
       id="path191"
       inkscape:export-filename="./planGraph.png"
       inkscape:export-xdpi="100"
       inkscape:export-ydpi="100" />
    <path
       style="fill:none;stroke:#000000;stroke-width:0.266591px;stroke-linecap:butt;stroke-linejoin:miter;stroke-opacity:1"
       d="m -272.41844,-2.8832637 h 97.72004"
       id="path193"
       inkscape:export-filename="./planGraph.png"
       inkscape:export-xdpi="100"
       inkscape:export-ydpi="100" />
    <path
       style="fill:none;stroke:#000000;stroke-width:0.264583px;stroke-linecap:butt;stroke-linejoin:miter;stroke-opacity:1"
       d="M -272.58994,-3.1997797 V 25.60456"
       id="path195"
       inkscape:export-filename="./planGraph.png"
       inkscape:export-xdpi="100"
       inkscape:export-ydpi="100" />
    <path
       style="fill:none;stroke:#000000;stroke-width:0.264583px;stroke-linecap:butt;stroke-linejoin:miter;stroke-opacity:1"
       d="M -175.17993,-3.1997797 V 25.60456"
       id="path197"
       inkscape:export-filename="./planGraph.png"
       inkscape:export-xdpi="100"
       inkscape:export-ydpi="100" />
    <text
       xml:space="preserve"
       id="text199"
       style="font-style:normal;font-weight:normal;font-size:13.4056px;line-height:1.25;font-family:sans-serif;letter-spacing:0px;word-spacing:0px;white-space:pre;shape-inside:url(#rect201);fill:#000000;fill-opacity:1;stroke:none;"
       transform="translate(-283.25291,-89.06573)"
       inkscape:transform-center-x="2.9188879"
       inkscape:transform-center-y="-1.2654843"
       inkscape:export-filename="./planGraph.png"
       inkscape:export-xdpi="100"
       inkscape:export-ydpi="100"><tspan
         x="19.367188"
         y="107.99167"><tspan
           style="shape-inside:url(#rect201)">Espace vert</tspan></tspan></text>
    <text
       xml:space="preserve"
       id="text203"
       style="font-style:normal;font-weight:normal;font-size:10.5833px;line-height:1.25;font-family:sans-serif;letter-spacing:0px;word-spacing:0px;white-space:pre;shape-inside:url(#rect205);fill:#000000;fill-opacity:1;stroke:none;"
       transform="translate(177.2639,-421.5576)"
       inkscape:export-filename="./planGraph.png"
       inkscape:export-xdpi="100"
       inkscape:export-ydpi="100"><tspan
         x="-439.56641"
         y="504.76413"><tspan>cheminement </tspan></tspan><tspan
         x="-439.56641"
         y="517.99326"><tspan>intérieur</tspan></tspan></text>
    <circle
       style="fill:#ffffff;stroke:#000000;stroke-width:1.54798"
       id="path211"
       cx="-238.14799"
       cy="-9.0176048"
       r="5.2741542"
       inkscape:export-filename="./planGraph.png"
       inkscape:export-xdpi="100"
       inkscape:export-ydpi="100" />
    <path
       style="fill:none;stroke:#000000;stroke-width:0.264583px;stroke-linecap:butt;stroke-linejoin:miter;stroke-opacity:1"
       d="M -203.70603,-3.9133297 V -18.50981"
       id="path213"
       inkscape:export-filename="./planGraph.png"
       inkscape:export-xdpi="100"
       inkscape:export-ydpi="100" />
    <circle
       style="fill:#ffffff;stroke:#000000;stroke-width:1.54798"
       id="path211-3"
       cx="-593.42731"
       cy="85.550575"
       r="5.2741542"
       inkscape:export-filename="./schemaStructure.png"
       inkscape:export-xdpi="100"
       inkscape:export-ydpi="100" />
    <circle
       style="fill:#ffffff;stroke:#000000;stroke-width:1.54798"
       id="path211-3-7"
       cx="-34.962208"
       cy="-94.001656"
       r="5.2741542"
       inkscape:export-filename="./planGraph.png"
       inkscape:export-xdpi="100"
       inkscape:export-ydpi="100" />
    <circle
       style="fill:#ffffff;stroke:#000000;stroke-width:1.54798"
       id="path211-3-6"
       cx="-845.15479"
       cy="24.190491"
       r="5.2741542"
       inkscape:export-filename="./planGraph.png"
       inkscape:export-xdpi="100"
       inkscape:export-ydpi="100" />
    <text
       xml:space="preserve"
       id="text251"
       style="font-style:normal;font-weight:normal;font-size:10.5833px;line-height:1.25;font-family:sans-serif;letter-spacing:0px;word-spacing:0px;white-space:pre;shape-inside:url(#rect253);fill:#000000;fill-opacity:1;stroke:none;"
       transform="translate(-14.462203,29.501685)"
       inkscape:export-filename="./planGraph.png"
       inkscape:export-xdpi="100"
       inkscape:export-ydpi="100"><tspan
         x="-811.0918"
         y="-1.1538384"><tspan>Entrée</tspan></tspan></text>
    <text
       xml:space="preserve"
       id="text257"
       style="font-style:normal;font-weight:normal;font-size:14.8167px;line-height:1.25;font-family:sans-serif;letter-spacing:0px;word-spacing:0px;white-space:pre;shape-inside:url(#rect259);fill:#000000;fill-opacity:1;stroke:none;"
       transform="translate(14.947869,32.981272)"
       inkscape:export-filename="./planGraph.png"
       inkscape:export-xdpi="100"
       inkscape:export-ydpi="100"><tspan
         x="-869.37891"
         y="-44.943428"><tspan
           style="shape-inside:url(#rect259)">Légende</tspan></tspan></text>
    <path
       style="fill:none;stroke:#000000;stroke-width:2;stroke-linecap:butt;stroke-linejoin:miter;stroke-miterlimit:4;stroke-dasharray:none;stroke-opacity:1"
       d="m -867.32752,55.450294 h 28.22088"
       id="path263"
       inkscape:export-filename="./planGraph.png"
       inkscape:export-xdpi="100"
       inkscape:export-ydpi="100" />
    <text
       xml:space="preserve"
       id="text1090"
       style="font-style:normal;font-weight:normal;font-size:10.5833px;line-height:1.25;font-family:sans-serif;letter-spacing:0px;word-spacing:0px;white-space:pre;shape-inside:url(#rect1092);fill:#000000;fill-opacity:1;stroke:none;"
       transform="translate(-14.462203,60.761488)"
       inkscape:export-filename="./planGraph.png"
       inkscape:export-xdpi="100"
       inkscape:export-ydpi="100"><tspan
         x="-811.0918"
         y="-1.1538384"><tspan>Arrête cheminement piéton</tspan></tspan></text>
    <g
       id="g1224"
       transform="translate(0,-0.54951153)"
       inkscape:export-filename="./planGraph.png"
       inkscape:export-xdpi="100"
       inkscape:export-ydpi="100">
      <path
         style="fill:none;stroke:#000000;stroke-width:2;stroke-linecap:butt;stroke-linejoin:miter;stroke-miterlimit:4;stroke-dasharray:6, 6;stroke-dashoffset:0;stroke-opacity:1"
         d="m -867.32752,93.159012 h 28.22088"
         id="path1094" />
      <text
         xml:space="preserve"
         id="text1098"
         style="font-style:normal;font-weight:normal;font-size:10.5833px;line-height:1.25;font-family:sans-serif;letter-spacing:0px;word-spacing:0px;white-space:pre;shape-inside:url(#rect1100);fill:#000000;fill-opacity:1;stroke:none;"
         transform="translate(-14.462203,90.82987)"><tspan
           x="-811.0918"
           y="-1.1538384"><tspan>Arrête si d &gt; 3m 
</tspan></tspan><tspan
           x="-811.0918"
           y="12.075286"><tspan>et séparation = chaussée</tspan></tspan></text>
    </g>
    <path
       style="fill:none;stroke:#000000;stroke-width:2;stroke-linecap:butt;stroke-linejoin:miter;stroke-miterlimit:4;stroke-dasharray:none;stroke-opacity:1"
       d="m -457.50354,-185.92329 c 128.58606,-185.83029 270.91475,-131.61077 413.454434,-73.70566"
       id="path263-5"
       sodipodi:nodetypes="cc"
       inkscape:export-filename="./planGraph.png"
       inkscape:export-xdpi="100"
       inkscape:export-ydpi="100" />
    <path
       style="fill:none;stroke:#000000;stroke-width:2;stroke-linecap:butt;stroke-linejoin:miter;stroke-miterlimit:4;stroke-dasharray:none;stroke-opacity:1"
       d="m -413.30875,-149.10748 c 53.75887,-35.52146 107.05821,-56.31067 159.56659,-51.74162"
       id="path263-3"
       sodipodi:nodetypes="cc"
       inkscape:export-filename="./planGraph.png"
       inkscape:export-xdpi="100"
       inkscape:export-ydpi="100" />
    <path
       style="fill:none;stroke:#000000;stroke-width:2;stroke-linecap:butt;stroke-linejoin:miter;stroke-miterlimit:4;stroke-dasharray:none;stroke-opacity:1"
       d="m -155.62663,-185.65855 c 45.13843,2.43458 87.408688,-1.39281 110.930397,-46.15324"
       id="path263-56"
       sodipodi:nodetypes="cc"
       inkscape:export-filename="./planGraph.png"
       inkscape:export-xdpi="100"
       inkscape:export-ydpi="100" />
    <path
       style="fill:none;stroke:#000000;stroke-width:2;stroke-linecap:butt;stroke-linejoin:miter;stroke-miterlimit:4;stroke-dasharray:none;stroke-opacity:1"
       d="m -467.37432,-74.339897 1.62764,145.844377"
       id="path263-2"
       sodipodi:nodetypes="cc"
       inkscape:export-filename="./planGraph.png"
       inkscape:export-xdpi="100"
       inkscape:export-ydpi="100" />
    <path
       style="fill:none;stroke:#000000;stroke-width:2;stroke-linecap:butt;stroke-linejoin:miter;stroke-miterlimit:4;stroke-dasharray:none;stroke-opacity:1"
       d="m -414.08159,-113.41359 c 51.9801,4.06888 159.64736,26.349386 228.40446,14.066238 99.789884,-17.827018 154.937264,-66.394518 149.933172,1.453143"
       id="path263-9"
       sodipodi:nodetypes="csc"
       inkscape:export-filename="./planGraph.png"
       inkscape:export-xdpi="100"
       inkscape:export-ydpi="100" />
    <path
       style="fill:none;stroke:#000000;stroke-width:2;stroke-linecap:butt;stroke-linejoin:miter;stroke-miterlimit:4;stroke-dasharray:6.00001, 6.00001;stroke-dashoffset:0;stroke-opacity:1"
       d="m -511.20029,-157.25388 c -17.77683,1.42838 -25.35382,-11.59667 -26.23899,-21.15514 -1.88825,-20.38997 15.56959,-33.78308 41.45965,-8.65862"
       id="path1094-1"
       sodipodi:nodetypes="csc"
       inkscape:export-filename="./planGraph.png"
       inkscape:export-xdpi="100"
       inkscape:export-ydpi="100" />
    <path
       style="fill:none;stroke:#000000;stroke-width:2;stroke-linecap:butt;stroke-linejoin:miter;stroke-miterlimit:4;stroke-dasharray:none;stroke-opacity:1"
       d="m -413.31696,-89.931692 c 89.18813,23.728759 218.3228,-50.043388 209.61093,86.0183623"
       id="path1172"
       sodipodi:nodetypes="cc"
       inkscape:export-filename="./planGraph.png"
       inkscape:export-xdpi="100"
       inkscape:export-ydpi="100" />
    <path
       style="fill:none;stroke:#000000;stroke-width:2;stroke-linecap:butt;stroke-linejoin:miter;stroke-miterlimit:4;stroke-dasharray:none;stroke-opacity:1"
       d="m -413.56211,-74.347729 c 84.81246,14.592098 167.56132,-27.745581 176.75868,58.624848"
       id="path1174"
       sodipodi:nodetypes="cc"
       inkscape:export-filename="./planGraph.png"
       inkscape:export-xdpi="100"
       inkscape:export-ydpi="100" />
    <path
       style="fill:none;stroke:#000000;stroke-width:2;stroke-linecap:butt;stroke-linejoin:miter;stroke-miterlimit:4;stroke-dasharray:6.00001, 6.00001;stroke-dashoffset:0;stroke-opacity:1"
       d="m -610.99141,-95.789964 c 56.72131,-6.616526 36.33232,-44.585496 99.96263,-53.317516"
       id="path1176"
       sodipodi:nodetypes="cc"
       inkscape:export-filename="./planGraph.png"
       inkscape:export-xdpi="100"
       inkscape:export-ydpi="100" />
    <path
       style="fill:none;stroke:#000000;stroke-width:2;stroke-linecap:butt;stroke-linejoin:miter;stroke-miterlimit:4;stroke-dasharray:none;stroke-dashoffset:0;stroke-opacity:1"
       d="m -610.99141,-70.421911 c 56.72131,-6.616526 36.33232,-44.585499 99.96263,-53.317519"
       id="path1178"
       sodipodi:nodetypes="cc"
       inkscape:export-filename="./planGraph.png"
       inkscape:export-xdpi="100"
       inkscape:export-ydpi="100" />
    <path
       style="fill:none;stroke:#000000;stroke-width:2;stroke-linecap:butt;stroke-linejoin:miter;stroke-miterlimit:4;stroke-dasharray:8, 8;stroke-dashoffset:0;stroke-opacity:1"
       d="m -436.21972,-185.93762 c 128.58606,-185.83029 303.93708,-77.90093 391.427026,-59.62619"
       id="path1180"
       sodipodi:nodetypes="cc"
       inkscape:export-filename="./planGraph.png"
       inkscape:export-xdpi="100"
       inkscape:export-ydpi="100" />
    <path
       style="fill:none;stroke:#000000;stroke-width:2;stroke-linecap:butt;stroke-linejoin:miter;stroke-miterlimit:4;stroke-dasharray:none;stroke-opacity:1"
       d="m -498.29291,-74.119266 c 0.63353,48.676575 -93.64035,43.958894 -93.80537,154.011201"
       id="path1182"
       sodipodi:nodetypes="cc"
       inkscape:export-filename="./planGraph.png"
       inkscape:export-xdpi="100"
       inkscape:export-ydpi="100" />
    <path
       sodipodi:type="spiral"
       style="fill:none;fill-rule:evenodd;stroke:#000000;stroke-width:1;stroke-miterlimit:4;stroke-dasharray:none"
       id="path1137"
       sodipodi:cx="-853.74536"
       sodipodi:cy="138.85655"
       sodipodi:expansion="1"
       sodipodi:revolution="3"
       sodipodi:radius="14.993133"
       sodipodi:argument="-17.794338"
       sodipodi:t0="0"
       d="m -853.74536,138.85655 c 0.37063,0.65401 -0.69874,0.82227 -1.08701,0.61602 -1.0522,-0.55894 -0.83529,-2.04469 -0.14502,-2.79004 1.23473,-1.33326 3.37416,-0.93777 4.49306,0.32597 1.64204,1.8546 1.04866,4.72362 -0.79697,6.1961 -2.45993,1.96258 -6.08042,1.16344 -7.89912,-1.26797 -2.28865,-3.05968 -1.28032,-7.44078 1.73896,-9.60215 3.65677,-2.6177 8.80317,-1.39842 11.30518,2.20996 2.94853,4.25235 1.51729,10.16681 -2.68096,13.0082 -4.84703,3.28051 -11.53129,1.63667 -14.71123,-3.15195 -3.61324,-5.44113 -1.7564,-12.89637 3.62295,-16.41425 6.03482,-3.94654 14.26188,-1.8764 18.11729,4.09394 4.28023,6.62821 1.99658,15.62771 -4.56494,19.82031"
       inkscape:export-filename="./planGraph.png"
       inkscape:export-xdpi="100"
       inkscape:export-ydpi="100" />
    <text
       xml:space="preserve"
       id="text1204"
       style="font-style:normal;font-weight:normal;font-size:10.5833px;line-height:1.25;font-family:sans-serif;letter-spacing:0px;word-spacing:0px;white-space:pre;shape-inside:url(#rect1206);fill:#000000;fill-opacity:1;stroke:none;"
       transform="translate(-14.462203,137.5884)"
       inkscape:export-filename="./planGraph.png"
       inkscape:export-xdpi="100"
       inkscape:export-ydpi="100"><tspan
         x="-811.0918"
         y="-1.1538384"><tspan>Arrête entre différent objets 
</tspan></tspan><tspan
         x="-811.0918"
         y="12.075286"><tspan>si contact</tspan></tspan></text>
    <g
       id="g1200"
       transform="translate(-10.772339,-0.85721665)"
       inkscape:export-filename="./schemaStructure.png"
       inkscape:export-xdpi="100"
       inkscape:export-ydpi="100">
      <rect
         style="fill:#ffffff;stroke:#000000;stroke-width:0.920189"
         id="rect147-6"
         width="97.638176"
         height="111.71048"
         x="-629.58344"
         y="646.92725" />
      <path
         style="fill:none;stroke:#000000;stroke-width:0.266592px;stroke-linecap:butt;stroke-linejoin:miter;stroke-opacity:1"
         d="m -629.41195,683.8779 h 97.72004"
         id="path149-7" />
      <path
         style="fill:none;stroke:#000000;stroke-width:0.266592px;stroke-linecap:butt;stroke-linejoin:miter;stroke-opacity:1"
         d="m -629.41195,647.24377 h 97.72004"
         id="path151-5" />
      <path
         style="fill:none;stroke:#000000;stroke-width:0.264583px;stroke-linecap:butt;stroke-linejoin:miter;stroke-opacity:1"
         d="m -629.58346,646.92722 v 28.80435"
         id="path153-3" />
      <path
         style="fill:none;stroke:#000000;stroke-width:0.264583px;stroke-linecap:butt;stroke-linejoin:miter;stroke-opacity:1"
         d="m -532.17346,646.92722 v 28.80435"
         id="path155-5" />
      <text
         xml:space="preserve"
         id="text157-6"
         style="font-style:normal;font-weight:normal;font-size:13.4056px;line-height:1.25;font-family:sans-serif;letter-spacing:0px;word-spacing:0px;white-space:pre;shape-inside:url(#rect159-3);fill:#000000;fill-opacity:1;stroke:none;"
         transform="translate(-626.96848,562.5668)"
         inkscape:transform-center-x="2.9188879"
         inkscape:transform-center-y="-1.2654843"><tspan
           x="19.367188"
           y="107.99167"><tspan>Individu</tspan></tspan></text>
    </g>
    <g
       id="g1209"
       transform="translate(-9.3155518,-0.85721665)"
       inkscape:export-filename="./schemaStructure.png"
       inkscape:export-xdpi="100"
       inkscape:export-ydpi="100">
      <rect
         style="fill:#ffffff;stroke:#000000;stroke-width:0.920189"
         id="rect1065"
         width="97.638176"
         height="111.71048"
         x="-631.04022"
         y="478.14828" />
      <path
         style="fill:none;stroke:#000000;stroke-width:0.266592px;stroke-linecap:butt;stroke-linejoin:miter;stroke-opacity:1"
         d="m -630.86876,515.09902 h 97.72004"
         id="path1067" />
      <path
         style="fill:none;stroke:#000000;stroke-width:0.266592px;stroke-linecap:butt;stroke-linejoin:miter;stroke-opacity:1"
         d="m -630.86876,478.46481 h 97.72004"
         id="path1069" />
      <path
         style="fill:none;stroke:#000000;stroke-width:0.264583px;stroke-linecap:butt;stroke-linejoin:miter;stroke-opacity:1"
         d="m -631.04026,478.14828 v 28.80435"
         id="path1071" />
      <path
         style="fill:none;stroke:#000000;stroke-width:0.264583px;stroke-linecap:butt;stroke-linejoin:miter;stroke-opacity:1"
         d="m -533.63029,478.14828 v 28.80435"
         id="path1073" />
      <text
         xml:space="preserve"
         id="text1079"
         style="font-style:normal;font-weight:normal;font-size:13.4056px;line-height:1.25;font-family:sans-serif;letter-spacing:0px;word-spacing:0px;white-space:pre;shape-inside:url(#rect1081);fill:#000000;fill-opacity:1;stroke:none;"
         transform="translate(-628.64457,392.75693)"
         inkscape:transform-center-x="2.9188879"
         inkscape:transform-center-y="-1.2654843"><tspan
           x="19.367188"
           y="107.99167"><tspan>Ménage</tspan></tspan></text>
    </g>
    <g
       id="g1218"
       transform="translate(-13.128601,-0.85721665)"
       inkscape:export-filename="./schemaStructure.png"
       inkscape:export-xdpi="100"
       inkscape:export-ydpi="100">
      <rect
         style="fill:#ffffff;stroke:#000000;stroke-width:0.920189"
         id="rect1083"
         width="97.638176"
         height="111.71048"
         x="-627.22717"
         y="307.01044" />
      <path
         style="fill:none;stroke:#000000;stroke-width:0.266592px;stroke-linecap:butt;stroke-linejoin:miter;stroke-opacity:1"
         d="m -627.05569,343.96112 h 97.72004"
         id="path1085" />
      <path
         style="fill:none;stroke:#000000;stroke-width:0.266592px;stroke-linecap:butt;stroke-linejoin:miter;stroke-opacity:1"
         d="m -627.05569,307.32693 h 97.72004"
         id="path1087" />
      <path
         style="fill:none;stroke:#000000;stroke-width:0.264583px;stroke-linecap:butt;stroke-linejoin:miter;stroke-opacity:1"
         d="m -627.2272,307.01041 v 28.80435"
         id="path1089" />
      <path
         style="fill:none;stroke:#000000;stroke-width:0.264583px;stroke-linecap:butt;stroke-linejoin:miter;stroke-opacity:1"
         d="m -529.81721,307.01041 v 28.80435"
         id="path1091" />
      <text
         xml:space="preserve"
         id="text1095"
         style="font-style:normal;font-weight:normal;font-size:13.4056px;line-height:1.25;font-family:sans-serif;letter-spacing:0px;word-spacing:0px;white-space:pre;shape-inside:url(#rect1097);fill:#000000;fill-opacity:1;stroke:none;"
         transform="translate(-632.01213,221.14449)"
         inkscape:transform-center-x="2.9188879"
         inkscape:transform-center-y="-1.2654843"><tspan
           x="19.367188"
           y="107.99167"><tspan>Logement</tspan></tspan></text>
    </g>
    <rect
       style="fill:#ffffff;stroke:#000000;stroke-width:0.920189"
       id="rect1099"
       width="97.638176"
       height="111.71048"
       x="-342.17136"
       y="149.57109"
       inkscape:export-filename="./schemaStructure.png"
       inkscape:export-xdpi="100"
       inkscape:export-ydpi="100" />
    <path
       style="fill:none;stroke:#000000;stroke-width:0.266592px;stroke-linecap:butt;stroke-linejoin:miter;stroke-opacity:1"
       d="m -341.99986,187.34158 h 97.72004"
       id="path1101"
       inkscape:export-filename="./schemaStructure.png"
       inkscape:export-xdpi="100"
       inkscape:export-ydpi="100" />
    <path
       style="fill:none;stroke:#000000;stroke-width:0.266592px;stroke-linecap:butt;stroke-linejoin:miter;stroke-opacity:1"
       d="m -341.99986,149.88757 h 97.72004"
       id="path1103"
       inkscape:export-filename="./schemaStructure.png"
       inkscape:export-xdpi="100"
       inkscape:export-ydpi="100" />
    <path
       style="fill:none;stroke:#000000;stroke-width:0.264583px;stroke-linecap:butt;stroke-linejoin:miter;stroke-opacity:1"
       d="M -342.17138,149.57105 V 178.3754"
       id="path1105"
       inkscape:export-filename="./schemaStructure.png"
       inkscape:export-xdpi="100"
       inkscape:export-ydpi="100" />
    <path
       style="fill:none;stroke:#000000;stroke-width:0.264583px;stroke-linecap:butt;stroke-linejoin:miter;stroke-opacity:1"
       d="M -244.76134,149.57105 V 178.3754"
       id="path1107"
       inkscape:export-filename="./schemaStructure.png"
       inkscape:export-xdpi="100"
       inkscape:export-ydpi="100" />
    <text
       xml:space="preserve"
       id="text1111"
       style="font-style:normal;font-weight:normal;font-size:13.4056px;line-height:1.25;font-family:sans-serif;letter-spacing:0px;word-spacing:0px;white-space:pre;shape-inside:url(#rect1113);fill:#000000;fill-opacity:1;stroke:none;"
       transform="translate(-344.10565,63.705133)"
       inkscape:transform-center-x="2.9188879"
       inkscape:transform-center-y="-1.2654843"
       inkscape:export-filename="./schemaStructure.png"
       inkscape:export-xdpi="100"
       inkscape:export-ydpi="100"><tspan
         x="19.367188"
         y="107.99167"><tspan>Transport</tspan></tspan></text>
    <g
       id="g1264"
       transform="translate(-374.19623,-0.85721665)"
       inkscape:export-filename="./schemaStructure.png"
       inkscape:export-xdpi="100"
       inkscape:export-ydpi="100">
      <rect
         style="fill:#ffffff;stroke:#000000;stroke-width:0.920189"
         id="rect1115"
         width="97.638176"
         height="111.71048"
         x="-451.59579"
         y="364.38589" />
      <path
         style="fill:none;stroke:#000000;stroke-width:0.266592px;stroke-linecap:butt;stroke-linejoin:miter;stroke-opacity:1"
         d="m -451.42428,401.33657 h 97.72004"
         id="path1117" />
      <path
         style="fill:none;stroke:#000000;stroke-width:0.266592px;stroke-linecap:butt;stroke-linejoin:miter;stroke-opacity:1"
         d="m -451.42428,364.70244 h 97.72004"
         id="path1119" />
      <path
         style="fill:none;stroke:#000000;stroke-width:0.264583px;stroke-linecap:butt;stroke-linejoin:miter;stroke-opacity:1"
         d="m -451.59582,364.38587 v 28.80435"
         id="path1121" />
      <path
         style="fill:none;stroke:#000000;stroke-width:0.264583px;stroke-linecap:butt;stroke-linejoin:miter;stroke-opacity:1"
         d="m -354.18587,364.38587 v 28.80435"
         id="path1123" />
      <text
         xml:space="preserve"
         id="text1127"
         style="font-style:normal;font-weight:normal;font-size:13.4056px;line-height:1.25;font-family:sans-serif;letter-spacing:0px;word-spacing:0px;white-space:pre;shape-inside:url(#rect1129);fill:#000000;fill-opacity:1;stroke:none;"
         transform="translate(-433.55263,279.90765)"
         inkscape:transform-center-x="2.9188879"
         inkscape:transform-center-y="-1.2654843"><tspan
           x="19.367188"
           y="107.99167"><tspan>POI</tspan></tspan></text>
    </g>
    <g
       id="g1171"
       transform="translate(-108.88104,-263.37374)"
       inkscape:export-filename="./schemaStructure.png"
       inkscape:export-xdpi="100"
       inkscape:export-ydpi="100">
      <rect
         style="fill:#ffffff;stroke:#000000;stroke-width:0.920189"
         id="rect1131"
         width="97.638176"
         height="111.71048"
         x="-345.98773"
         y="626.43744" />
      <path
         style="fill:none;stroke:#000000;stroke-width:0.266592px;stroke-linecap:butt;stroke-linejoin:miter;stroke-opacity:1"
         d="m -345.81624,663.38807 h 97.72004"
         id="path1133" />
      <path
         style="fill:none;stroke:#000000;stroke-width:0.266592px;stroke-linecap:butt;stroke-linejoin:miter;stroke-opacity:1"
         d="m -345.81624,626.75394 h 97.72004"
         id="path1135" />
      <path
         style="fill:none;stroke:#000000;stroke-width:0.264583px;stroke-linecap:butt;stroke-linejoin:miter;stroke-opacity:1"
         d="m -345.98777,626.43743 v 28.80435"
         id="path1138" />
      <path
         style="fill:none;stroke:#000000;stroke-width:0.264583px;stroke-linecap:butt;stroke-linejoin:miter;stroke-opacity:1"
         d="m -248.57774,626.43743 v 28.80435"
         id="path1140" />
      <text
         xml:space="preserve"
         id="text1144"
         style="font-style:normal;font-weight:normal;font-size:13.4056px;line-height:1.25;font-family:sans-serif;text-align:center;letter-spacing:0px;word-spacing:0px;white-space:pre;shape-inside:url(#rect1146);fill:#000000;fill-opacity:1;stroke:none;"
         transform="translate(-362.2523,533.69848)"
         inkscape:transform-center-x="2.9188879"
         inkscape:transform-center-y="-1.2654843"
         x="24.297649"
         y="0"><tspan
           x="40.018438"
           y="107.99167"><tspan
             style="text-align:center;text-anchor:middle">Lieu de </tspan></tspan><tspan
           x="43.206195"
           y="124.74868"><tspan
             style="text-align:center;text-anchor:middle">travail</tspan></tspan></text>
      <path
         style="fill:none;stroke:#000000;stroke-width:0.264583px;stroke-linecap:butt;stroke-linejoin:miter;stroke-opacity:1"
         d="M -248.20898,629.66215 V 658.4665"
         id="path1073-2" />
    </g>
    <path
       style="fill:none;stroke:#000000;stroke-width:0.7;stroke-linecap:butt;stroke-linejoin:miter;stroke-miterlimit:4;stroke-dasharray:none;stroke-opacity:1"
       d="M -591.53669,205.49416 V 306.93357"
       id="path1173"
       sodipodi:nodetypes="cc"
       inkscape:export-filename="./schemaStructure.png"
       inkscape:export-xdpi="100"
       inkscape:export-ydpi="100" />
    <path
       style="fill:none;stroke:#000000;stroke-width:0.7;stroke-linecap:butt;stroke-linejoin:miter;stroke-miterlimit:4;stroke-dasharray:none;stroke-opacity:1"
       d="m -591.53669,418.5881 v 58.05428"
       id="path1173-9"
       sodipodi:nodetypes="cc"
       inkscape:export-filename="./schemaStructure.png"
       inkscape:export-xdpi="100"
       inkscape:export-ydpi="100" />
    <path
       style="fill:none;stroke:#000000;stroke-width:0.7;stroke-linecap:butt;stroke-linejoin:miter;stroke-miterlimit:4;stroke-dasharray:none;stroke-opacity:1"
       d="m -591.53669,587.96174 v 58.0543"
       id="path1190"
       sodipodi:nodetypes="cc"
       inkscape:export-filename="./schemaStructure.png"
       inkscape:export-xdpi="100"
       inkscape:export-ydpi="100" />
    <path
       style="fill:none;stroke:#000000;stroke-width:0.7;stroke-linecap:butt;stroke-linejoin:miter;stroke-miterlimit:4;stroke-dasharray:none;stroke-opacity:1"
       d="m -561.25513,203.28372 c 2.35728,60.353 156.46486,49.67383 157.93868,158.72675"
       id="path1222"
       sodipodi:nodetypes="cc"
       inkscape:export-filename="./schemaStructure.png"
       inkscape:export-xdpi="100"
       inkscape:export-ydpi="100" />
    <path
       style="fill:none;stroke:#000000;stroke-width:0.7;stroke-linecap:butt;stroke-linejoin:miter;stroke-miterlimit:4;stroke-dasharray:none;stroke-opacity:1"
       d="m -620.00438,203.28372 c -2.35728,60.353 -156.46486,49.67383 -157.93868,158.72675"
       id="path1224"
       sodipodi:nodetypes="cc"
       inkscape:export-filename="./schemaStructure.png"
       inkscape:export-xdpi="100"
       inkscape:export-ydpi="100" />
    <path
       style="fill:none;stroke:#000000;stroke-width:0.7;stroke-linecap:butt;stroke-linejoin:miter;stroke-miterlimit:4;stroke-dasharray:none;stroke-opacity:1"
       d="m -775.11745,477.10559 c -13.53947,153.81915 61.51318,193.47605 134.58887,235.68045"
       id="path1226"
       sodipodi:nodetypes="cc"
       inkscape:export-filename="./schemaStructure.png"
       inkscape:export-xdpi="100"
       inkscape:export-ydpi="100" />
    <path
       style="fill:none;stroke:#000000;stroke-width:0.7;stroke-linecap:butt;stroke-linejoin:miter;stroke-miterlimit:4;stroke-dasharray:none;stroke-opacity:1"
       d="m -407.41671,477.10559 c 13.53947,153.81915 -61.51318,193.47605 -134.58887,235.68045"
       id="path1230"
       sodipodi:nodetypes="cc"
       inkscape:export-filename="./schemaStructure.png"
       inkscape:export-xdpi="100"
       inkscape:export-ydpi="100" />
    <path
       style="fill:none;stroke:#000000;stroke-width:0.7;stroke-linecap:butt;stroke-linejoin:miter;stroke-miterlimit:4;stroke-dasharray:none;stroke-opacity:1"
       d="m -775.11745,477.10559 c -2.89542,51.10103 51.51896,77.82035 133.62861,77.62045"
       id="path1232"
       sodipodi:nodetypes="cc"
       inkscape:export-filename="./schemaStructure.png"
       inkscape:export-xdpi="100"
       inkscape:export-ydpi="100" />
    <path
       style="fill:none;stroke:#000000;stroke-width:0.7;stroke-linecap:butt;stroke-linejoin:miter;stroke-miterlimit:4;stroke-dasharray:none;stroke-opacity:1"
       d="m -290.702,260.0202 c 13.53947,153.81919 -115.94044,483.89884 -251.30358,485.87574"
       id="path1234"
       sodipodi:nodetypes="cc"
       inkscape:export-filename="./schemaStructure.png"
       inkscape:export-xdpi="100"
       inkscape:export-ydpi="100" />
    <circle
       style="fill:#ffffff;stroke:#000000;stroke-width:1.54798"
       id="path211-3-6-1"
       cx="-294.22644"
       cy="143.61377"
       r="5.2741542"
       inkscape:export-filename="./schemaStructure.png"
       inkscape:export-xdpi="100"
       inkscape:export-ydpi="100" />
    <path
       style="fill:none;stroke:#000000;stroke-width:2;stroke-linecap:butt;stroke-linejoin:miter;stroke-miterlimit:4;stroke-dasharray:none;stroke-opacity:1"
       d="m -445.25931,-74.644681 c 1.95505,93.141393 146.22003,81.6423179 151.63829,210.714851"
       id="path1255"
       sodipodi:nodetypes="cc"
       inkscape:export-filename="./planGraph.png"
       inkscape:export-xdpi="100"
       inkscape:export-ydpi="100" />
    <path
       style="fill:none;stroke:#000000;stroke-width:0.7;stroke-linecap:butt;stroke-linejoin:miter;stroke-miterlimit:4;stroke-dasharray:none;stroke-opacity:1"
       d="m -867.32752,188.29307 h 28.22088"
       id="path1270"
       inkscape:export-filename="./schemaStructure.png"
       inkscape:export-xdpi="100"
       inkscape:export-ydpi="100" />
    <text
       xml:space="preserve"
       id="text1276"
       style="font-style:normal;font-weight:normal;font-size:10.5833px;line-height:1.25;font-family:sans-serif;letter-spacing:0px;word-spacing:0px;white-space:pre;shape-inside:url(#rect1278);fill:#000000;fill-opacity:1;stroke:none;"
       transform="translate(-14.462203,193.60426)"
       inkscape:export-filename="./schemaStructure.png"
       inkscape:export-xdpi="100"
       inkscape:export-ydpi="100"><tspan
         x="-811.0918"
         y="-1.1538384"><tspan>Arrête attribution</tspan></tspan></text>
    <text
       xml:space="preserve"
       id="text1280"
       style="font-style:normal;font-weight:normal;font-size:8.46667px;line-height:1.25;font-family:sans-serif;letter-spacing:0px;word-spacing:0px;white-space:pre;shape-inside:url(#rect1282);fill:#000000;fill-opacity:1;stroke:none;"
       transform="translate(-2.7839161,-3.6002766)"
       inkscape:export-filename="./schemaStructure.png"
       inkscape:export-xdpi="100"
       inkscape:export-ydpi="100"><tspan
         x="-816.82227"
         y="415.13164"><tspan
           style="shape-inside:url(#rect1282)">AttendanceIndice</tspan></tspan></text>
    <text
       xml:space="preserve"
       id="text1286"
       style="font-style:normal;font-weight:normal;font-size:8.46667px;line-height:1.25;font-family:sans-serif;letter-spacing:0px;word-spacing:0px;white-space:pre;shape-inside:url(#rect1288);fill:#000000;fill-opacity:1;stroke:none;"
       transform="translate(-2.7839161,10.944033)"
       inkscape:export-filename="./schemaStructure.png"
       inkscape:export-xdpi="100"
       inkscape:export-ydpi="100"><tspan
         x="-816.82227"
         y="415.13164"><tspan
           style="shape-inside:url(#rect1288)">PotentialArea</tspan></tspan></text>
    <text
       xml:space="preserve"
       id="text1290"
       style="font-style:normal;font-weight:normal;font-size:8.46667px;line-height:1.25;font-family:sans-serif;letter-spacing:0px;word-spacing:0px;white-space:pre;shape-inside:url(#rect1292);fill:#000000;fill-opacity:1;stroke:none;"
       transform="translate(-2.7839161,24.878773)"
       inkscape:export-filename="./schemaStructure.png"
       inkscape:export-xdpi="100"
       inkscape:export-ydpi="100"><tspan
         x="-816.82227"
         y="415.13164"><tspan
           style="shape-inside:url(#rect1292)">Type</tspan></tspan></text>
    <text
       xml:space="preserve"
       id="text1294"
       style="font-style:normal;font-weight:normal;font-size:8.46667px;line-height:1.25;font-family:sans-serif;letter-spacing:0px;word-spacing:0px;white-space:pre;shape-inside:url(#rect1296);fill:#000000;fill-opacity:1;stroke:none;"
       transform="translate(-2.7839161,38.471133)"
       inkscape:export-filename="./schemaStructure.png"
       inkscape:export-xdpi="100"
       inkscape:export-ydpi="100"><tspan
         x="-816.82227"
         y="415.13164"><tspan
           style="shape-inside:url(#rect1296)">OpeningHour</tspan></tspan></text>
    <text
       xml:space="preserve"
       id="text1280-3"
       style="font-style:normal;font-weight:normal;font-size:8.46667px;line-height:1.25;font-family:sans-serif;letter-spacing:0px;word-spacing:0px;white-space:pre;shape-inside:url(#rect1282-2);fill:#000000;fill-opacity:1;stroke:none;"
       transform="translate(368.13994,-2.5596266)"
       inkscape:export-filename="./schemaStructure.png"
       inkscape:export-xdpi="100"
       inkscape:export-ydpi="100"><tspan
         x="-816.82227"
         y="415.13164"><tspan
           style="shape-inside:url(#rect1282-2)">WorkforceIndice</tspan></tspan></text>
    <text
       xml:space="preserve"
       id="text1286-6"
       style="font-style:normal;font-weight:normal;font-size:8.46667px;line-height:1.25;font-family:sans-serif;letter-spacing:0px;word-spacing:0px;white-space:pre;shape-inside:url(#rect1288-7);fill:#000000;fill-opacity:1;stroke:none;"
       transform="translate(368.13994,11.984673)"
       inkscape:export-filename="./schemaStructure.png"
       inkscape:export-xdpi="100"
       inkscape:export-ydpi="100"><tspan
         x="-816.82227"
         y="415.13164"><tspan
           style="shape-inside:url(#rect1288-7)">PotentialArea</tspan></tspan></text>
    <text
       xml:space="preserve"
       id="text1290-0"
       style="font-style:normal;font-weight:normal;font-size:8.46667px;line-height:1.25;font-family:sans-serif;letter-spacing:0px;word-spacing:0px;white-space:pre;shape-inside:url(#rect1292-0);fill:#000000;fill-opacity:1;stroke:none;"
       transform="translate(368.13994,25.919403)"
       inkscape:export-filename="./schemaStructure.png"
       inkscape:export-xdpi="100"
       inkscape:export-ydpi="100"><tspan
         x="-816.82227"
         y="415.13164"><tspan
           style="shape-inside:url(#rect1292-0)">Type</tspan></tspan></text>
    <text
       xml:space="preserve"
       id="text1280-37"
       style="font-style:normal;font-weight:normal;font-size:8.46667px;line-height:1.25;font-family:sans-serif;letter-spacing:0px;word-spacing:0px;white-space:pre;shape-inside:url(#rect1282-26);fill:#000000;fill-opacity:1;stroke:none;"
       transform="translate(183.19765,285.26108)"
       inkscape:export-filename="./schemaStructure.png"
       inkscape:export-xdpi="100"
       inkscape:export-ydpi="100"><tspan
         x="-816.82227"
         y="415.13164"><tspan>Age</tspan></tspan></text>
    <text
       xml:space="preserve"
       id="text1286-5"
       style="font-style:normal;font-weight:normal;font-size:8.46667px;line-height:1.25;font-family:sans-serif;letter-spacing:0px;word-spacing:0px;white-space:pre;shape-inside:url(#rect1288-8);fill:#000000;fill-opacity:1;stroke:none;"
       transform="translate(183.19765,299.80538)"
       inkscape:export-filename="./schemaStructure.png"
       inkscape:export-xdpi="100"
       inkscape:export-ydpi="100"><tspan
         x="-816.82227"
         y="415.13164"><tspan>Sexe</tspan></tspan></text>
    <text
       xml:space="preserve"
       id="text1290-9"
       style="font-style:normal;font-weight:normal;font-size:8.46667px;line-height:1.25;font-family:sans-serif;letter-spacing:0px;word-spacing:0px;white-space:pre;shape-inside:url(#rect1292-9);fill:#000000;fill-opacity:1;stroke:none;"
       transform="translate(183.19765,313.74011)"
       inkscape:export-filename="./schemaStructure.png"
       inkscape:export-xdpi="100"
       inkscape:export-ydpi="100"><tspan
         x="-816.82227"
         y="415.13164"><tspan>Occupation</tspan></tspan></text>
    <text
       xml:space="preserve"
       id="text1294-2"
       style="font-style:normal;font-weight:normal;font-size:8.46667px;line-height:1.25;font-family:sans-serif;letter-spacing:0px;word-spacing:0px;white-space:pre;shape-inside:url(#rect1296-0);fill:#000000;fill-opacity:1;stroke:none;"
       transform="translate(183.19765,327.33247)"
       inkscape:export-filename="./schemaStructure.png"
       inkscape:export-xdpi="100"
       inkscape:export-ydpi="100"><tspan
         x="-816.82227"
         y="415.13164"><tspan>CSP</tspan></tspan></text>
    <text
       xml:space="preserve"
       id="text1430"
       style="font-style:normal;font-weight:normal;font-size:8.46667px;line-height:1.25;font-family:sans-serif;letter-spacing:0px;word-spacing:0px;white-space:pre;shape-inside:url(#rect1450);fill:#000000;fill-opacity:1;stroke:none;"
       transform="translate(183.19765,114.66485)"
       inkscape:export-filename="./schemaStructure.png"
       inkscape:export-xdpi="100"
       inkscape:export-ydpi="100"><tspan
         x="-816.82227"
         y="415.13164"><tspan>Structure</tspan></tspan></text>
    <text
       xml:space="preserve"
       id="text1460"
       style="font-style:normal;font-weight:normal;font-size:8.46667px;line-height:1.25;font-family:sans-serif;letter-spacing:0px;word-spacing:0px;white-space:pre;shape-inside:url(#rect1462);fill:#000000;fill-opacity:1;stroke:none;"
       transform="translate(183.19765,-55.435217)"
       inkscape:export-filename="./schemaStructure.png"
       inkscape:export-xdpi="100"
       inkscape:export-ydpi="100"><tspan
         x="-816.82227"
         y="415.13164"><tspan>Surface</tspan></tspan></text>
    <path
       sodipodi:type="spiral"
       style="fill:none;fill-rule:evenodd;stroke:#000000;stroke-width:0.651529;stroke-miterlimit:4;stroke-dasharray:none"
       id="path1137-3"
       sodipodi:cx="-475.26779"
       sodipodi:cy="123.79601"
       sodipodi:expansion="1"
       sodipodi:revolution="3"
       sodipodi:radius="9.768466"
       sodipodi:argument="-17.794338"
       sodipodi:t0="0"
       d="m -475.26779,123.79601 c 0.24148,0.42611 -0.45525,0.53574 -0.70822,0.40136 -0.68554,-0.36417 -0.54422,-1.33218 -0.0945,-1.8178 0.80447,-0.86866 2.19837,-0.61098 2.92737,0.21239 1.06983,1.20832 0.68323,3.07757 -0.51925,4.03693 -1.60272,1.27868 -3.96157,0.75802 -5.14651,-0.82612 -1.49112,-1.99347 -0.83417,-4.84788 1.13298,-6.25608 2.38249,-1.70551 5.73553,-0.91111 7.36566,1.43986 1.92105,2.77053 0.98856,6.62397 -1.74672,8.47522 -3.15799,2.13734 -7.51298,1.06634 -9.5848,-2.05359 -2.35414,-3.54505 -1.14435,-8.40236 2.36045,-10.69437 3.93186,-2.57128 9.29204,-1.22252 11.80395,2.66733 2.78869,4.31847 1.30083,10.18191 -2.97419,12.91351"
       inkscape:export-filename="./planGraph.png"
       inkscape:export-xdpi="100"
       inkscape:export-ydpi="100" />
    <path
       sodipodi:type="spiral"
       style="fill:none;fill-rule:evenodd;stroke:#000000;stroke-width:0.651529;stroke-miterlimit:4;stroke-dasharray:none"
       id="path1137-3-6"
       sodipodi:cx="-497.79761"
       sodipodi:cy="-136.64175"
       sodipodi:expansion="1"
       sodipodi:revolution="3"
       sodipodi:radius="9.768466"
       sodipodi:argument="-17.794338"
       sodipodi:t0="0"
       d="m -497.79761,-136.64175 c 0.24148,0.4261 -0.45525,0.53573 -0.70822,0.40135 -0.68553,-0.36417 -0.54421,-1.33218 -0.0945,-1.81779 0.80446,-0.86866 2.19836,-0.61099 2.92736,0.21238 1.06984,1.20832 0.68323,3.07758 -0.51925,4.03694 -1.60271,1.27867 -3.96157,0.75801 -5.14651,-0.82612 -1.49112,-1.99348 -0.83417,-4.84789 1.13299,-6.25608 2.38249,-1.70551 5.73552,-0.91112 7.36565,1.43985 1.92106,2.77053 0.98856,6.62397 -1.74672,8.47523 -3.15799,2.13734 -7.51298,1.06633 -9.5848,-2.05359 -2.35413,-3.54506 -1.14434,-8.40237 2.36046,-10.69437 3.93186,-2.57129 9.29203,-1.22253 11.80394,2.66732 2.7887,4.31847 1.30084,10.18191 -2.97419,12.91352"
       inkscape:export-filename="./planGraph.png"
       inkscape:export-xdpi="100"
       inkscape:export-ydpi="100" />
    <path
       sodipodi:type="spiral"
       style="fill:none;fill-rule:evenodd;stroke:#000000;stroke-width:0.651529;stroke-miterlimit:4;stroke-dasharray:none"
       id="path1137-3-7"
       sodipodi:cx="-695.85846"
       sodipodi:cy="-93.241165"
       sodipodi:expansion="1"
       sodipodi:revolution="3"
       sodipodi:radius="9.768466"
       sodipodi:argument="-17.794338"
       sodipodi:t0="0"
       d="m -695.85846,-93.241165 c 0.24148,0.426108 -0.45525,0.535734 -0.70822,0.401352 -0.68554,-0.364167 -0.54422,-1.332173 -0.0945,-1.817792 0.80446,-0.868658 2.19836,-0.610982 2.92736,0.212383 1.06983,1.208321 0.68323,3.077576 -0.51925,4.036937 -1.60271,1.278676 -3.96157,0.758019 -5.14651,-0.826118 -1.49112,-1.993475 -0.83417,-4.847889 1.13299,-6.256082 2.38248,-1.70551 5.73552,-0.911113 7.36565,1.439853 1.92106,2.770533 0.98856,6.623976 -1.74672,8.475226 -3.15799,2.137343 -7.51298,1.066337 -9.5848,-2.053588 -2.35413,-3.545057 -1.14435,-8.402365 2.36046,-10.694366 3.93186,-2.57129 9.29203,-1.22253 11.80394,2.667319 2.7887,4.318473 1.30083,10.181911 -2.97419,12.913515"
       inkscape:export-filename="./planGraph.png"
       inkscape:export-xdpi="100"
       inkscape:export-ydpi="100" />
    <path
       sodipodi:type="spiral"
       style="fill:none;fill-rule:evenodd;stroke:#000000;stroke-width:0.651529;stroke-miterlimit:4;stroke-dasharray:none"
       id="path1137-3-5"
       sodipodi:cx="-632.59344"
       sodipodi:cy="-260.15909"
       sodipodi:expansion="1"
       sodipodi:revolution="3"
       sodipodi:radius="9.768466"
       sodipodi:argument="-17.794338"
       sodipodi:t0="0"
       d="m -632.59344,-260.15909 c 0.24147,0.42611 -0.45525,0.53574 -0.70822,0.40135 -0.68554,-0.36416 -0.54422,-1.33217 -0.0945,-1.81779 0.80446,-0.86866 2.19837,-0.61098 2.92737,0.21238 1.06983,1.20833 0.68322,3.07758 -0.51926,4.03694 -1.60271,1.27868 -3.96157,0.75802 -5.1465,-0.82612 -1.49113,-1.99347 -0.83417,-4.84788 1.13298,-6.25608 2.38249,-1.70551 5.73552,-0.91111 7.36565,1.43986 1.92106,2.77053 0.98856,6.62397 -1.74672,8.47522 -3.15798,2.13734 -7.51297,1.06634 -9.58479,-2.05359 -2.35414,-3.54505 -1.14435,-8.40236 2.36045,-10.69437 3.93186,-2.57128 9.29203,-1.22253 11.80394,2.66733 2.7887,4.31847 1.30084,10.18191 -2.97419,12.91351"
       inkscape:export-filename="./planGraph.png"
       inkscape:export-xdpi="100"
       inkscape:export-ydpi="100" />
    <path
       sodipodi:type="spiral"
       style="fill:none;fill-rule:evenodd;stroke:#000000;stroke-width:0.651529;stroke-miterlimit:4;stroke-dasharray:none"
       id="path1137-3-3"
       sodipodi:cx="-240.75142"
       sodipodi:cy="-186.50217"
       sodipodi:expansion="1"
       sodipodi:revolution="3"
       sodipodi:radius="9.768466"
       sodipodi:argument="-17.794338"
       sodipodi:t0="0"
       d="m -240.75142,-186.50217 c 0.24148,0.42611 -0.45525,0.53574 -0.70822,0.40136 -0.68554,-0.36417 -0.54421,-1.33218 -0.0945,-1.8178 0.80446,-0.86866 2.19836,-0.61098 2.92736,0.21239 1.06983,1.20832 0.68323,3.07757 -0.51925,4.03693 -1.60271,1.27868 -3.96157,0.75802 -5.14651,-0.82611 -1.49112,-1.99348 -0.83417,-4.84789 1.13299,-6.25609 2.38248,-1.70551 5.73552,-0.91111 7.36565,1.43986 1.92106,2.77053 0.98856,6.62397 -1.74672,8.47522 -3.15799,2.13735 -7.51298,1.06634 -9.5848,-2.05359 -2.35413,-3.54505 -1.14435,-8.40236 2.36046,-10.69437 3.93186,-2.57128 9.29203,-1.22252 11.80394,2.66733 2.7887,4.31847 1.30084,10.18191 -2.97419,12.91351"
       inkscape:export-filename="./planGraph.png"
       inkscape:export-xdpi="100"
       inkscape:export-ydpi="100" />
    <path
       sodipodi:type="spiral"
       style="fill:none;fill-rule:evenodd;stroke:#000000;stroke-width:0.651529;stroke-miterlimit:4;stroke-dasharray:none"
       id="path1137-3-56"
       sodipodi:cx="-29.517399"
       sodipodi:cy="-237.6416"
       sodipodi:expansion="1"
       sodipodi:revolution="3"
       sodipodi:radius="9.768466"
       sodipodi:argument="-17.794338"
       sodipodi:t0="0"
       d="m -29.517399,-237.6416 c 0.241478,0.42611 -0.455249,0.53573 -0.70822,0.40135 -0.685536,-0.36417 -0.544216,-1.33217 -0.09449,-1.81779 0.804464,-0.86866 2.198367,-0.61098 2.927365,0.21238 1.069833,1.20832 0.683228,3.07758 -0.51925,4.03694 -1.602715,1.27868 -3.961572,0.75802 -5.14651,-0.82612 -1.491123,-1.99347 -0.834168,-4.84789 1.132986,-6.25608 2.382487,-1.70551 5.735521,-0.91111 7.365654,1.43985 1.921055,2.77053 0.988558,6.62398 -1.746721,8.47523 -3.157987,2.13734 -7.512978,1.06633 -9.584798,-2.05359 -2.354135,-3.54506 -1.144348,-8.40237 2.360456,-10.69437 3.93186,-2.57128 9.292033,-1.22253 11.803943,2.66732 2.788696,4.31848 1.300834,10.18191 -2.974192,12.91352"
       inkscape:export-filename="./planGraph.png"
       inkscape:export-xdpi="100"
       inkscape:export-ydpi="100" />
    <path
       sodipodi:type="spiral"
       style="fill:none;fill-rule:evenodd;stroke:#000000;stroke-width:0.651529;stroke-miterlimit:4;stroke-dasharray:none"
       id="path1137-3-2"
       sodipodi:cx="-68.438004"
       sodipodi:cy="-35.36903"
       sodipodi:expansion="1"
       sodipodi:revolution="3"
       sodipodi:radius="9.768466"
       sodipodi:argument="-17.794338"
       sodipodi:t0="0"
       d="m -68.438004,-35.36903 c 0.241478,0.426108 -0.455248,0.535734 -0.708219,0.401352 -0.685537,-0.364167 -0.544216,-1.332173 -0.09448,-1.817792 0.804463,-0.868658 2.198367,-0.610982 2.927364,0.212383 1.069834,1.208321 0.683229,3.077576 -0.51925,4.036937 -1.602715,1.278677 -3.961572,0.758019 -5.146509,-0.826118 -1.491123,-1.993475 -0.834169,-4.847889 1.132985,-6.256082 2.382488,-1.70551 5.735522,-0.911113 7.365654,1.439853 1.921055,2.770533 0.988558,6.623976 -1.746721,8.475227 -3.157987,2.137342 -7.512978,1.066336 -9.584798,-2.053589 -2.354134,-3.545057 -1.144348,-8.402365 2.360456,-10.694371 3.93186,-2.571283 9.292033,-1.222528 11.803943,2.667324 2.788696,4.318473 1.300835,10.181911 -2.974191,12.913515"
       inkscape:export-filename="./planGraph.png"
       inkscape:export-xdpi="100"
       inkscape:export-ydpi="100" />
    <path
       sodipodi:type="spiral"
       style="fill:none;fill-rule:evenodd;stroke:#000000;stroke-width:0.651529;stroke-miterlimit:4;stroke-dasharray:none"
       id="path1137-3-9"
       sodipodi:cx="-259.77115"
       sodipodi:cy="54.501999"
       sodipodi:expansion="1"
       sodipodi:revolution="3"
       sodipodi:radius="9.768466"
       sodipodi:argument="-17.794338"
       sodipodi:t0="0"
       d="m -259.77115,54.501999 c 0.24148,0.426108 -0.45525,0.535734 -0.70822,0.401352 -0.68554,-0.364167 -0.54421,-1.332173 -0.0945,-1.817792 0.80446,-0.868658 2.19836,-0.610982 2.92736,0.212383 1.06983,1.208321 0.68323,3.077576 -0.51925,4.036937 -1.60271,1.278677 -3.96157,0.758019 -5.14651,-0.826118 -1.49112,-1.993475 -0.83417,-4.847889 1.13299,-6.256082 2.38248,-1.70551 5.73552,-0.911113 7.36565,1.439853 1.92106,2.770533 0.98856,6.623976 -1.74672,8.475227 -3.15799,2.137342 -7.51298,1.066336 -9.5848,-2.053589 -2.35413,-3.545057 -1.14435,-8.402365 2.36046,-10.694371 3.93186,-2.571283 9.29203,-1.222528 11.80394,2.667324 2.7887,4.318473 1.30084,10.181911 -2.97419,12.913515"
       inkscape:export-filename="./planGraph.png"
       inkscape:export-xdpi="100"
       inkscape:export-ydpi="100" />
  </g>
</svg>
