<?xml version="1.0" encoding="UTF-8" standalone="no"?>
<!-- Created with Inkscape (http://www.inkscape.org/) -->

<svg
   xmlns:dc="http://purl.org/dc/elements/1.1/"
   xmlns:cc="http://creativecommons.org/ns#"
   xmlns:rdf="http://www.w3.org/1999/02/22-rdf-syntax-ns#"
   xmlns:svg="http://www.w3.org/2000/svg"
   xmlns="http://www.w3.org/2000/svg"
   xmlns:xlink="http://www.w3.org/1999/xlink"
   xmlns:sodipodi="http://sodipodi.sourceforge.net/DTD/sodipodi-0.dtd"
   xmlns:inkscape="http://www.inkscape.org/namespaces/inkscape"
   width="320.97833mm"
   height="214.20126mm"
   viewBox="0 0 320.97833 214.20126"
   version="1.1"
   id="svg1126"
   inkscape:version="0.92.4 (5da689c313, 2019-01-14)"
   sodipodi:docname="013.svg"
   inkscape:export-filename="/home/groolot/Documents/Developpement/in-situ/artworks/2D/013_t.png"
   inkscape:export-xdpi="300"
   inkscape:export-ydpi="300">
  <defs
     id="defs1120" />
  <sodipodi:namedview
     id="base"
     pagecolor="#ffffff"
     bordercolor="#666666"
     borderopacity="1.0"
     inkscape:pageopacity="0.0"
     inkscape:pageshadow="2"
     inkscape:zoom="1"
     inkscape:cx="643.00179"
     inkscape:cy="399.0755"
     inkscape:document-units="mm"
     inkscape:current-layer="layer1"
     showgrid="false"
     fit-margin-top="0"
     fit-margin-left="0"
     fit-margin-right="0"
     fit-margin-bottom="0"
     inkscape:window-width="1920"
     inkscape:window-height="1064"
     inkscape:window-x="0"
     inkscape:window-y="16"
     inkscape:window-maximized="0" />
  <metadata
     id="metadata1123">
    <rdf:RDF>
      <cc:Work
         rdf:about="">
        <dc:format>image/svg+xml</dc:format>
        <dc:type
           rdf:resource="http://purl.org/dc/dcmitype/StillImage" />
        <dc:title></dc:title>
      </cc:Work>
    </rdf:RDF>
  </metadata>
  <g
     inkscape:label="Calque 1"
     inkscape:groupmode="layer"
     id="layer1"
     transform="translate(-108.62988,-114.30413)">
    <image
       sodipodi:absref="/home/groolot/Documents/Developpement/in-situ/artworks/2D/013.png"
       xlink:href="013.png"
       width="320.97833"
       height="214.20126"
       preserveAspectRatio="none"
       style="image-rendering:optimizeQuality"
       id="image1193"
       x="108.62988"
       y="114.30413" />
    <g
       id="g106"
       transform="translate(138.20192,249.8649)"
       style="fill:#f8f6f1;fill-opacity:1">
      <text
         id="text96"
         y="66.976662"
         x="245.00417"
         style="font-style:normal;font-weight:normal;font-size:10.58333302px;line-height:1.25;font-family:sans-serif;letter-spacing:0px;word-spacing:0px;fill:#f8f6f1;fill-opacity:1;stroke:none;stroke-width:0.26458332"
         xml:space="preserve"><tspan
           style="font-style:normal;font-variant:normal;font-weight:normal;font-stretch:normal;font-size:7.9375px;font-family:Adler;-inkscape-font-specification:Adler;fill:#f8f6f1;stroke-width:0.26458332;fill-opacity:1"
           y="66.976662"
           x="245.00417"
           id="tspan94"
           sodipodi:role="line">groolot</tspan></text>
      <text
         id="text100"
         y="61.208092"
         x="196.3593"
         style="font-style:normal;font-weight:normal;font-size:7.9701643px;line-height:1.25;font-family:sans-serif;letter-spacing:0px;word-spacing:0px;fill:#f8f6f1;fill-opacity:1;stroke:none;stroke-width:0.1992541"
         xml:space="preserve"><tspan
           style="font-style:normal;font-variant:normal;font-weight:normal;font-stretch:normal;font-size:15.875px;font-family:Adler;-inkscape-font-specification:Adler;fill:#f8f6f1;stroke-width:0.1992541;fill-opacity:1"
           y="61.208092"
           x="196.3593"
           id="tspan98"
           sodipodi:role="line">in situ</tspan></text>
    </g>
  </g>
</svg>
