<?xml version="1.0" encoding="UTF-8" standalone="no"?>
<!-- Created with Inkscape (http://www.inkscape.org/) -->

<svg
   xmlns:dc="http://purl.org/dc/elements/1.1/"
   xmlns:cc="http://creativecommons.org/ns#"
   xmlns:rdf="http://www.w3.org/1999/02/22-rdf-syntax-ns#"
   xmlns:svg="http://www.w3.org/2000/svg"
   xmlns="http://www.w3.org/2000/svg"
   xmlns:sodipodi="http://sodipodi.sourceforge.net/DTD/sodipodi-0.dtd"
   xmlns:inkscape="http://www.inkscape.org/namespaces/inkscape"
   version="1.1"
   id="svg2"
   xml:space="preserve"
   width="1200"
   height="1080"
   viewBox="0 0 1200 1080"
   sodipodi:docname="Logo Alternatiba Toulouse.svg"
   inkscape:version="0.92.3 (2405546, 2018-03-11)"
   inkscape:export-filename="/home/numahell/Documents/Assos/Alternatiba/cloud-ssimp/Alternatiba/COM/Logos/Alternatiba/Logo Alternatiba Toulouse.png"
   inkscape:export-xdpi="32"
   inkscape:export-ydpi="32"><metadata
     id="metadata8"><rdf:RDF><cc:Work
         rdf:about=""><dc:format>image/svg+xml</dc:format><dc:type
           rdf:resource="http://purl.org/dc/dcmitype/StillImage" /><dc:title /></cc:Work></rdf:RDF></metadata><defs
     id="defs6"><clipPath
       clipPathUnits="userSpaceOnUse"
       id="clipPath36"><path
         d="M 0,779 H 974 V 0 H 0 Z"
         id="path34"
         inkscape:connector-curvature="0" /></clipPath><clipPath
       clipPathUnits="userSpaceOnUse"
       id="clipPath4842"><rect
         style="opacity:1;vector-effect:none;fill:#7845af;fill-opacity:0.94117647;stroke:none;stroke-width:5.6692915;stroke-linecap:round;stroke-linejoin:round;stroke-miterlimit:4;stroke-dasharray:none;stroke-dashoffset:0;stroke-opacity:1"
         id="rect4844"
         width="604.51941"
         height="184.39009"
         x="1678.1832"
         y="25.674627" /></clipPath></defs><sodipodi:namedview
     pagecolor="#ffffff"
     bordercolor="#666666"
     borderopacity="1"
     objecttolerance="10"
     gridtolerance="10"
     guidetolerance="10"
     inkscape:pageopacity="0"
     inkscape:pageshadow="2"
     inkscape:window-width="1853"
     inkscape:window-height="1025"
     id="namedview4"
     showgrid="false"
     inkscape:measure-start="2847.54,-36.5668"
     inkscape:measure-end="2861.55,-34.2328"
     inkscape:zoom="0.32132963"
     inkscape:cx="-187.78234"
     inkscape:cy="331.70722"
     inkscape:window-x="67"
     inkscape:window-y="27"
     inkscape:window-maximized="1"
     inkscape:current-layer="layer1"
     fit-margin-top="0"
     fit-margin-left="0"
     fit-margin-right="0"
     fit-margin-bottom="0" /><g
     id="g10"
     inkscape:groupmode="layer"
     inkscape:label="Logo Alternatiba"
     transform="matrix(1.3333333,0,0,-1.3333333,-385.89662,1089.3362)"><path
       d="M 289.42247,7.002153 H 1189.4225 V 817.00217 H 289.42247 Z"
       style="fill:#ffffff;fill-opacity:1;fill-rule:nonzero;stroke:none;stroke-width:0.98020202"
       id="path12"
       inkscape:connector-curvature="0" /><g
       id="g5064"
       transform="translate(-37.30585)"
       style="fill:#09804f;fill-opacity:0.94117647"><g
         transform="translate(0,33)"
         id="g5028"
         style="fill:#09804f;fill-opacity:0.94117647"><g
           id="g14"
           transform="translate(412.13287,282.95433)"
           style="fill:#09804f;fill-opacity:0.94117647"><path
             d="m 0,0 -0.284,-0.025 -4.03,-52.283 15.288,1.025 z m -19.021,23.777 34.405,2.322 33.785,-120.297 -29.114,-1.958 -4.234,21.186 -21.765,-1.458 -1.355,-21.563 -29.114,-1.95 z"
             style="fill:#09804f;fill-opacity:0.94117647;fill-rule:nonzero;stroke:none"
             id="path16"
             inkscape:connector-curvature="0" /></g><g
           id="g18"
           transform="translate(457.65977,311.06763)"
           style="fill:#09804f;fill-opacity:0.94117647"><path
             d="m 0,0 27.354,1.844 6.448,-96.032 33.678,2.261 1.748,-25.984 -61.031,-4.088 z"
             style="fill:#09804f;fill-opacity:0.94117647;fill-rule:nonzero;stroke:none"
             id="path20"
             inkscape:connector-curvature="0" /></g><g
           id="g22"
           transform="translate(530.65297,288.85273)"
           style="fill:#09804f;fill-opacity:0.94117647"><path
             d="m 0,0 -20.588,-1.386 -1.814,27 68.529,4.606 1.814,-27 -20.587,-1.385 6.377,-95.007 -27.354,-1.836 z"
             style="fill:#09804f;fill-opacity:0.94117647;fill-rule:nonzero;stroke:none"
             id="path24"
             inkscape:connector-curvature="0" /></g><g
           id="g26"
           transform="translate(582.94977,319.48163)"
           style="fill:#09804f;fill-opacity:0.94117647"><path
             d="m 0,0 62.21,4.179 1.744,-25.976 -34.851,-2.343 1.4,-20.826 32.643,2.178 1.674,-24.95 -32.645,-2.198 1.632,-24.252 36.173,2.425 1.75,-25.966 -63.533,-4.269 z"
             style="fill:#09804f;fill-opacity:0.94117647;fill-rule:nonzero;stroke:none"
             id="path28"
             inkscape:connector-curvature="0" /></g><g
           id="g38"
           transform="translate(687.29157,274.65163)"
           style="fill:#09804f;fill-opacity:0.94117647"><path
             d="M 0,0 5.438,0.36 C 13.244,0.894 16.528,6.941 15.95,15.658 15.275,25.56 11.596,29.624 3.363,29.075 l -5.296,-0.37 z m -30.816,49.762 42.791,2.877 C 32.865,54.048 41.719,40.918 42.978,22.123 44.072,5.871 39.333,-5.077 27.002,-8.15 l 0.019,-0.326 c 13.316,-0.483 17.937,-9.963 19.033,-26.187 l 0.701,-10.423 c 0.422,-6.324 0.977,-14.538 2.462,-16.832 0.823,-1.32 1.511,-2.64 3.34,-3.568 l 0.119,-1.686 -29.129,-1.968 c -3.077,6.321 -3.85,17.934 -4.2,23.066 l -0.547,8.196 c -0.933,13.85 -3.527,17.279 -10.14,16.837 l -7.214,-0.492 3.279,-48.877 -27.344,-1.825 z"
             style="fill:#09804f;fill-opacity:0.94117647;fill-rule:nonzero;stroke:none"
             id="path40"
             inkscape:connector-curvature="0" /></g><g
           id="g42"
           transform="translate(740.88437,330.09303)"
           style="fill:#09804f;fill-opacity:0.94117647"><path
             d="m 0,0 30.586,2.057 22.702,-74.01 0.299,0.025 -5.055,75.18 25.585,1.729 8.196,-122.015 -29.999,-2.007 -23.294,74.135 -0.299,-0.025 5.059,-75.365 -25.583,-1.702 z"
             style="fill:#09804f;fill-opacity:0.94117647;fill-rule:nonzero;stroke:none"
             id="path44"
             inkscape:connector-curvature="0" /></g><g
           id="g46"
           transform="translate(864.17537,313.31083)"
           style="fill:#09804f;fill-opacity:0.94117647"><path
             d="m 0,0 -0.289,-0.017 -4.024,-52.281 15.282,1.024 z m -19.025,23.788 34.413,2.311 33.78,-120.296 -29.114,-1.95 -4.235,21.177 -21.765,-1.468 -1.354,-21.553 -29.114,-1.959 z"
             style="fill:#09804f;fill-opacity:0.94117647;fill-rule:nonzero;stroke:none"
             id="path48"
             inkscape:connector-curvature="0" /></g><g
           id="g50"
           transform="translate(917.39317,314.82643)"
           style="fill:#09804f;fill-opacity:0.94117647"><path
             d="M 0,0 -20.584,-1.385 -22.397,25.624 46.132,30.22 47.946,3.229 27.354,1.845 33.736,-93.163 6.391,-95.008 Z"
             style="fill:#09804f;fill-opacity:0.94117647;fill-rule:nonzero;stroke:none"
             id="path52"
             inkscape:connector-curvature="0" /></g><g
           id="g54"
           transform="translate(968.66567,345.39963)"
           style="fill:#09804f;fill-opacity:0.94117647"><path
             d="M 0,0 27.362,1.825 35.56,-120.173 8.196,-122.017 Z"
             style="fill:#09804f;fill-opacity:0.94117647;fill-rule:nonzero;stroke:none"
             id="path56"
             inkscape:connector-curvature="0" /></g><g
           id="g58"
           transform="translate(1042.8229,250.81563)"
           style="fill:#09804f;fill-opacity:0.94117647"><path
             d="m 0,0 7.638,0.518 c 5.009,0.325 9.378,5.776 8.701,15.706 -0.633,9.397 -5.688,14.367 -10.691,14.021 l -7.646,-0.516 z m -3.453,51.271 6.631,0.442 c 5.589,0.387 8.283,6.402 7.848,12.876 -0.463,6.836 -3.935,12.442 -9.532,12.075 l -6.613,-0.461 z m -30.553,46.008 41.315,2.77 C 26.876,101.358 36.8,89.838 38.026,71.565 38.9,58.573 34.826,46.631 23.405,43.123 l 0.023,-0.345 C 37.351,42.158 43.856,28.863 44.7,16.216 46.135,-4.974 38.295,-20.427 15.505,-21.959 l -41.316,-2.778 z"
             style="fill:#09804f;fill-opacity:0.94117647;fill-rule:nonzero;stroke:none"
             id="path60"
             inkscape:connector-curvature="0" /></g><g
           id="g62"
           transform="translate(1128.5768,331.07543)"
           style="fill:#09804f;fill-opacity:0.94117647"><path
             d="m 0,0 -0.299,-0.024 -4.023,-52.275 15.301,1.015 z M -19.034,23.778 15.38,26.099 49.16,-94.197 20.046,-96.146 15.811,-74.979 -5.954,-76.427 -7.3,-98 -36.423,-99.95 Z"
             style="fill:#09804f;fill-opacity:0.94117647;fill-rule:nonzero;stroke:none"
             id="path64"
             inkscape:connector-curvature="0" /></g></g><g
         transform="translate(0,33)"
         id="g5004"
         style="fill:#09804f;fill-opacity:0.94117647"><g
           id="g66"
           transform="translate(1007.7457,434.07833)"
           style="fill:#09804f;fill-opacity:0.94117647"><path
             d="m 0,0 c -3.878,-13.213 -12.254,-23.622 -24.823,-29.827 -12.646,-6.242 -25.737,-6.799 -38.752,-0.78 -15.84,7.361 -25.143,20.042 -29.092,36.81 -1.146,4.939 -1.551,10.01 -1.957,12.625 0.937,15.239 4.5,26.903 12.859,36.814 2.81,3.366 3.682,3.132 5.608,-0.649 4.908,-9.473 10.606,-18.396 18.524,-25.722 1.13,-1.03 1.578,-1.767 0.955,-3.469 -3.017,-8.209 1.245,-16.087 8.995,-16.973 5.563,-0.627 11.019,4.496 11.222,10.557 0.281,8.28 -4.861,13.214 -13.221,12.837 -1.087,-0.038 -2.595,0.501 -3.353,1.306 -3.009,3.284 -6.094,6.537 -8.554,10.221 -3.718,5.533 -6.921,11.394 -10.346,17.136 -1.1,1.84 -0.503,3.192 1.172,4.308 6.239,4.127 13.101,6.382 20.593,6.947 15.135,1.146 27.734,-3.967 37.898,-15.134 C 2.793,40.418 6.236,21.008 0,0 m -93.675,105.055 c -3.92,-3.092 -7.924,-6.049 -11.971,-8.992 -4.212,-3.025 -8.449,-5.993 -13.017,-9.205 -0.541,0.729 -1.113,1.285 -1.383,1.916 -3.358,8.212 -10.809,12.357 -17.433,17.171 -5.737,4.134 -12.069,7.346 -16.873,12.858 -6.402,7.384 -7.41,15.427 -4.34,24.336 0.385,0.983 0.886,1.887 1.435,3.211 2.621,-2.357 5.151,-4.434 7.461,-6.714 7.045,-6.952 15.13,-11.94 25.132,-13.359 0.761,-0.114 1.718,-0.726 2.15,-1.405 1.656,-2.774 4.273,-4.01 7.493,-2.786 6.603,2.5 13.111,5.221 20.059,8.017 0.191,-1.728 0.469,-4.181 0.794,-6.619 0.649,-5.158 1.355,-10.307 1.8,-15.469 0.089,-0.947 -0.558,-2.332 -1.307,-2.96 m -52.119,-58.346 c -0.277,0.011 -0.548,-0.007 -0.845,-0.004 -1.084,2.576 -2.262,5.135 -3.279,7.762 -0.185,0.532 0.006,1.621 0.409,1.953 2.797,2.163 5.688,4.204 8.543,6.292 0.346,-0.229 0.711,-0.436 1.037,-0.677 -1.953,-5.115 -3.914,-10.221 -5.865,-15.326 m -16.749,37.411 c 6.547,-0.211 12.65,-0.265 17.556,-3.986 2.216,-1.647 3.384,-4.738 4.786,-7.304 0.29,-0.476 -0.312,-1.887 -0.937,-2.329 -3.406,-2.513 -6.875,-4.989 -10.437,-7.244 -0.554,-0.345 -2.382,0.138 -2.657,0.681 -2.623,5.546 -5.074,11.181 -7.514,16.82 -0.347,0.855 -0.435,1.825 -0.797,3.362 m 11.571,-47.174 c -2.18,-2.856 -4.465,-5.639 -6.951,-8.232 -0.665,-0.749 -2.051,-1.081 -3.151,-1.173 -14.915,-1.32 -29.882,-2.585 -44.6,-3.845 -3.767,-0.067 -7.454,5.258 -6.115,8.67 3.185,8.331 6.531,16.594 9.689,24.941 1.237,3.28 2.57,6.614 3.02,10.034 0.567,4.422 3.662,6.457 6.692,8.784 3.7,2.843 7.238,5.907 11.078,8.537 1.295,0.871 3.275,0.942 4.924,0.939 4.226,-0.007 6.654,-1.956 8.369,-6.2 4.526,-11.326 9.766,-22.353 14.74,-33.503 0.93,-2.148 1.984,-4.244 2.715,-6.452 0.238,-0.707 0.041,-1.897 -0.41,-2.5 m -55.423,-15.807 c 7.195,0.665 14.053,1.317 20.936,1.902 7.696,0.694 15.409,1.229 23.121,2.014 2.512,0.251 2.776,-0.2 2.791,-2.833 0.02,-4.487 -2.063,-4.982 -5.748,-5.171 -12.294,-0.706 -24.543,-1.805 -36.798,-2.737 -1.716,-0.15 -2.886,0.352 -3.154,2.27 -0.213,1.434 -0.707,2.818 -1.148,4.555 m -0.499,-18.552 c 0.671,2.611 0.922,4.567 1.703,6.272 0.374,0.822 1.712,1.634 2.664,1.728 9.006,0.748 17.992,1.316 27.028,1.951 3.921,0.275 7.883,0.318 11.764,0.925 3.122,0.503 5.172,0.013 5.951,-3.343 0.214,-0.891 0.816,-1.661 1.509,-3.129 -16.985,-1.472 -33.503,-2.918 -50.619,-4.404 m -7.487,95.485 c -5.85,4.235 -12.143,7.977 -17.519,12.747 -8.941,7.979 -10.414,18.447 -4.628,29.51 3.316,-3.181 6.103,-6.389 9.391,-8.997 6.762,-5.422 14.229,-9.661 22.634,-12.128 1.289,-0.375 2.605,-1.934 3.167,-3.268 2.659,-6.596 4.852,-13.361 7.721,-19.879 1.23,-2.86 3.553,-5.228 5.644,-8.113 -2.439,-1.97 -6.048,-4.843 -9.857,-7.953 -0.627,1.088 -1.125,1.759 -1.416,2.484 -3.096,7.104 -9.181,11.286 -15.137,15.597 m -13.264,-63.283 c -2.025,3.088 -3.579,5.207 -4.799,7.496 -0.339,0.64 10e-4,2.205 0.535,2.686 3.453,2.908 7.1,5.621 10.665,8.41 0.258,-0.158 0.523,-0.335 0.827,-0.49 -2.324,-5.784 -4.625,-11.555 -7.228,-18.102 M -240.919,20.69 c -0.716,-0.152 -1.476,-0.283 -2.202,-0.319 -11.335,-0.97 -22.689,-1.934 -34.682,-2.949 -1.045,0.928 -2.31,2.288 -3.824,3.329 -1.95,1.322 -2.063,2.581 -1.155,4.773 3.605,8.833 6.957,17.815 10.342,26.743 0.504,1.28 1.009,2.629 1.151,3.949 0.74,7.473 7.295,9.954 11.885,14.106 1.289,1.168 2.51,0.751 3.397,-0.778 5.563,-9.523 11.191,-19.044 16.774,-28.542 1.717,-2.937 3.557,-5.771 5.326,-8.692 0.421,-0.712 0.864,-1.518 0.879,-2.288 0.08,-1.711 -6.207,-8.975 -7.891,-9.332 m -7.426,-21.822 c -8.068,-0.704 -16.073,-1.241 -24.147,-2.023 -2.586,-0.255 -3.246,0.608 -2.845,3.021 0.549,3.275 1.737,4.959 5.697,5.064 8.397,0.258 16.76,1.313 25.102,2.034 5.093,0.45 5.398,0.247 7.31,-4.432 0.209,-0.562 0.439,-1.167 0.941,-2.385 -4.324,-0.458 -8.196,-0.931 -12.058,-1.279 m -27.175,12.078 c -0.239,1.436 -0.864,2.802 -1.321,4.057 11.39,1.147 22.528,2.266 33.688,3.373 1.42,0.148 3.025,1.006 3.394,-1.462 0.51,-3.61 -0.402,-5.862 -2.801,-6.088 -7.221,-0.649 -14.414,-1.176 -21.584,-1.772 -2.467,-0.212 -4.903,-0.329 -7.295,-0.728 -2.323,-0.389 -3.671,0.13 -4.081,2.62 m -27.393,95.029 c -7.574,6.746 -8.913,15.582 -6.094,25.144 0.364,1.267 1.108,2.451 1.884,4.109 1.04,-1.006 1.903,-1.633 2.528,-2.419 5.388,-6.538 12.215,-11.115 19.609,-15.02 1.901,-1.022 2.847,-2.359 3.468,-4.495 1.856,-6.412 3.963,-12.759 6.334,-18.982 2.813,-7.288 7.906,-12.251 15.775,-13.999 0.265,-0.051 0.519,-0.319 1.168,-0.773 -3.276,-2.629 -6.307,-5.03 -9.731,-7.782 -1.012,2.681 -1.624,4.871 -2.589,6.919 -2.937,6.273 -8.726,9.752 -13.937,13.714 -6.044,4.637 -12.733,8.547 -18.415,13.584 m 11.781,-52.263 c -4.851,-3.975 -9.822,-7.753 -14.714,-11.669 -1.56,-1.204 -2.548,-1.008 -3.535,0.731 -4.001,6.873 -8.051,13.726 -12.126,20.535 -0.489,0.804 -1.327,1.458 -1.699,2.291 -0.575,1.468 -1.778,3.691 -1.225,4.421 1.15,1.488 3.207,2.578 5.105,3.062 1.781,0.475 3.789,-0.021 5.709,-0.127 6.149,-0.725 12.604,-0.28 18.157,-3.937 4.444,-2.905 5.896,-7.347 5.879,-12.342 0.017,-1.002 -0.735,-2.31 -1.551,-2.965 m -8.419,-27.062 c -1.744,2.554 -3.243,4.454 -4.32,6.566 -0.32,0.579 0.15,2.098 0.756,2.593 3.386,2.866 6.913,5.527 10.896,7.878 -2.368,-5.484 -4.738,-10.981 -7.332,-17.037 m -11.172,-12.048 c -12.573,-1.164 -25.209,-2.3 -37.828,-3.46 -2.421,-0.211 -3.862,0.959 -5.721,2.547 -4.728,4.052 -3.174,7.949 -1.295,12.615 3.533,8.746 6.498,17.755 9.811,26.586 0.403,1.153 1.209,2.309 2.149,3.081 4.068,3.206 8.287,6.263 12.773,9.62 2.335,-3.814 4.454,-7.224 6.478,-10.66 6.571,-10.895 13.145,-21.836 19.692,-32.752 0.261,-0.496 0.643,-1.168 0.56,-1.686 -0.348,-2.333 -4.153,-5.684 -6.619,-5.891 m -39.656,-7.746 c -0.096,0.281 1.776,1.949 2.825,2.045 8.649,0.912 17.349,1.58 25.986,2.336 2.764,0.219 5.508,0.499 8.266,0.686 1.62,0.111 3.583,0.859 4.103,-1.713 0.439,-2.404 -0.987,-4.573 -3.37,-4.856 -3.184,-0.382 -6.395,-0.513 -9.548,-0.788 -8.455,-0.732 -16.911,-1.487 -25.886,-2.251 -2.461,0.201 -1.677,2.925 -2.376,4.541 m -1.371,-16.895 c 0.873,3.001 1.524,5.488 2.422,7.861 0.152,0.491 1.218,0.822 1.881,0.89 11.768,1.05 23.517,2.101 35.292,2.924 1.094,0.069 2.759,-1.074 3.367,-2.091 0.917,-1.484 1.077,-3.396 1.729,-5.667 -14.852,-1.283 -29.384,-2.566 -44.691,-3.917 m -8.42,97.091 c -6.681,4.683 -13.867,8.583 -19.507,14.767 -5.305,5.807 -6.509,12.41 -5.361,19.752 0.423,2.536 1.416,4.995 2.294,8.065 3.555,-3.356 6.483,-6.198 9.498,-8.945 5.333,-4.846 11.552,-8.338 18.173,-10.991 2.343,-0.938 2.958,-2.437 3.688,-4.603 2.146,-6.513 4.375,-13.087 7.217,-19.329 2.509,-5.584 7.156,-9.153 14.327,-10.803 -4.842,-3.856 -8.912,-7.104 -13.296,-10.579 -0.82,2.783 -1.264,5.174 -2.195,7.377 -2.949,7.001 -8.963,11.155 -14.838,15.289 m -4.989,-39.047 c -0.198,-0.574 -0.536,-1.139 -0.932,-1.634 -0.249,-0.302 -0.695,-0.506 -1.01,-0.766 -3.868,-2.948 -7.67,-5.923 -12.009,-9.245 -6.315,10.728 -12.256,20.794 -18.599,31.58 9.493,-0.928 18.154,-0.415 26.397,-3.857 4.891,-2.043 7.725,-11.626 6.153,-16.078 m -7.381,-21.858 c -3.258,3.617 -3.183,4.659 -0.29,6.745 1.368,0.968 2.622,2.036 4.474,2.789 -1.352,-3.013 -2.641,-6.044 -4.184,-9.534 m -6.404,-10.505 c -3.448,-3.409 -5.196,-8.2 -5.56,-13.272 -0.075,-1.037 -0.92,-2.033 -1.414,-3.04 -0.698,0.991 -1.837,1.911 -2.064,3.008 -2.183,10.704 -6.518,20.349 -13.822,28.548 -3.015,3.373 -6.188,6.618 -9.599,10.292 3.173,5.982 6.572,12.337 10.323,19.399 2.442,-3.943 4.556,-7.413 6.624,-10.885 4.94,-8.316 9.839,-16.634 14.78,-24.951 0.514,-0.908 0.943,-1.908 1.538,-2.775 1.609,-2.387 1.659,-3.869 -0.806,-6.324 m -31.37,-65.482 c -13.03,-12.753 -28.345,-16.658 -45.634,-11.606 -5.16,1.52 -9.787,4.911 -14.425,7.821 -7.271,4.518 -12.039,11.301 -15.804,18.764 -3.417,6.808 -4.942,14.166 -5.52,21.798 -1.124,15.633 3.225,29.729 13.76,41.105 13.222,14.311 29.707,19.03 48.765,13.129 0.297,-0.124 0.547,-0.253 0.858,-0.391 7.588,-3.256 7.468,-3.192 3.472,-10.431 -4.727,-8.572 -9.295,-17.202 -13.872,-25.877 -1.155,-2.211 -2.378,-3.565 -5.181,-3.873 -4.498,-0.484 -7.83,-3.261 -8.882,-7.662 -1.098,-4.505 -0.715,-8.976 3.083,-12.679 3.545,-3.424 7.528,-3.97 11.718,-2.166 4.007,1.722 5.479,5.565 5.687,9.637 0.17,2.806 0.907,4.352 3.94,4.58 9.224,0.676 18.411,1.527 27.643,2.188 5.801,0.428 6.183,-0.055 6.044,-5.791 -0.005,-0.727 0.056,-1.492 0.099,-1.981 -1.055,-14.17 -5.555,-26.554 -15.751,-36.565 m -5.597,82.852 c 5.883,-2.819 9.328,-7.686 12.184,-12.637 3.172,-5.451 5.248,-11.527 7.501,-17.455 1.358,-3.665 0.539,-4.807 -3.079,-5.047 -10.784,-0.783 -21.551,-1.515 -32.366,-2.194 -2.996,-0.168 -3.934,1.284 -2.512,3.86 6.016,11.104 12.08,22.179 18.272,33.473 m 165.43,43.912 c 2.112,0.951 4.442,1.465 7.18,2.288 5.955,-1.494 12.171,-2.497 17.945,-4.635 3.808,-1.432 5.902,-5.452 5.764,-9.553 -0.034,-1.768 -2.044,-3.816 -3.66,-5.155 -3.536,-3.027 -7.448,-5.628 -11.123,-8.451 -1.537,-1.149 -2.536,-1.18 -3.565,0.618 -4.353,7.399 -8.863,14.739 -13.168,22.167 -0.388,0.607 0.109,2.489 0.627,2.721 M 10.644,24.302 c -0.58,8.963 -3.405,17.637 -8.011,25.628 -7.231,12.5 -17.063,21.946 -30.61,27.155 -8.038,3.076 -16.385,3.888 -24.802,2.987 -7.307,-0.815 -14.181,-3.356 -20.605,-7.116 -2.758,-1.619 -3.538,-1.132 -4.345,2.105 -2.696,10.593 -5.843,21.084 -7.864,31.8 -1.659,9.157 -2.189,18.546 -2.837,27.847 -0.289,4.493 -0.43,5.365 -4.443,6.803 -0.379,0.129 -0.682,0.568 -1.066,0.633 -1.836,0.368 -3.703,0.965 -5.524,0.906 -5.5,-0.184 -10.998,-1.105 -16.481,-0.929 -10.504,0.347 -18.199,5.881 -22.76,15.033 -3.165,6.257 -5.151,13.05 -7.486,19.645 -1.958,5.387 -4.009,10.641 -9.156,13.828 -8.247,5.065 -18.998,3.905 -26.135,-2.562 -9.7,-8.831 -16.089,-19.712 -19.468,-32.311 -1.643,-6.078 -2.364,-12.384 -3.506,-18.73 -0.202,0.028 -0.657,0.006 -0.958,0.208 -6.239,3.854 -10.997,9.1 -14.182,15.607 -3.207,6.575 -5.683,13.519 -8.817,20.149 -2.103,4.531 -4.614,8.789 -9.305,11.429 -5.807,3.281 -16.539,4.015 -20.491,0.476 -3.932,-3.513 -7.77,-7.325 -10.87,-11.574 -6.217,-8.498 -10.66,-17.897 -12.754,-28.326 -0.419,-2.106 -0.847,-4.254 -1.272,-6.369 -0.349,-0.146 -0.727,-0.3 -1.073,-0.414 -2.18,3.52 -4.776,6.873 -6.55,10.624 -3.038,6.414 -5.249,13.251 -8.47,19.567 -1.872,3.676 -4.637,7.178 -7.79,9.801 -4.559,3.821 -10.375,3.831 -16.127,3.369 -4.433,-0.363 -6.728,-3.544 -9.621,-6.2 -10.326,-9.431 -15.908,-21.39 -19.283,-34.577 -0.979,-3.813 -1.284,-7.744 -2.117,-12.69 -2.064,1.91 -3.635,3.135 -4.939,4.591 -5.536,6.344 -8.762,13.958 -11.783,21.701 -1.941,4.917 -3.931,10.112 -7.088,14.236 -7.186,9.303 -20.856,9.785 -29.42,1.646 -12.873,-12.302 -19.778,-27.516 -21.315,-45.118 -1.196,-13.933 1.443,-27.326 6.829,-40.202 3.102,-7.397 7.731,-13.156 15.858,-15.367 1.936,-0.533 1.471,-1.657 0.79,-2.929 -3.617,-6.743 -7.203,-13.511 -10.82,-20.258 -0.986,-1.848 -2.236,-1.564 -4.022,-0.949 -6.006,2.068 -11.997,4.463 -18.137,5.571 -9.256,1.713 -18.335,-0.147 -26.801,-3.885 -7.163,-3.142 -13.302,-7.822 -18.602,-13.675 -6.734,-7.417 -11.357,-15.849 -13.913,-25.486 -2.695,-10.034 -3.427,-20.222 -0.936,-30.253 1.715,-6.844 4.087,-13.744 7.438,-19.934 4.436,-8.244 10.784,-15.16 18.946,-20.242 8.183,-5.12 16.882,-8.526 26.571,-8.944 10.436,-0.443 20.149,1.742 29.328,7.125 8.486,4.989 15.082,11.652 20.161,19.898 6.975,11.307 9.607,23.75 9.394,36.914 -0.014,0.899 0.833,1.788 1.284,2.71 0.683,-0.628 1.69,-1.117 1.986,-1.902 4.012,-10.277 17.985,-18.718 29.154,-6.396 0.642,0.681 1.865,1.001 2.871,1.077 13.802,1.242 27.573,2.297 41.34,3.703 3.202,0.318 5.353,-0.384 7.671,-2.557 5.809,-5.459 16.664,-6.41 22.946,2.333 1.46,2.008 3.135,3.194 5.781,3.388 11.005,0.823 22.041,1.8 33.044,2.919 3.865,0.38 7.085,0.057 10.378,-2.483 3.579,-2.699 8.153,-3.547 12.482,-1.727 2.857,1.204 5.261,3.437 7.949,5.116 1.329,0.827 2.724,1.908 4.123,2.035 15.905,1.443 31.807,2.799 47.718,4.042 1.479,0.084 3.344,-0.537 4.483,-1.448 5.724,-4.443 12.98,-5.757 17.925,-2.98 11.269,6.3 14.394,21.41 6.024,31.332 -3.135,3.723 -3.009,6.759 -1.463,10.87 4.274,11.51 8.2,23.185 12.322,34.761 0.346,0.954 0.955,1.953 1.727,2.509 6.763,4.978 13.556,9.87 20.388,14.783 1.739,1.251 3.532,2.462 5.084,3.551 3.196,-10.207 6.283,-20.013 9.258,-29.82 0.181,-0.717 -0.356,-1.856 -0.887,-2.536 -1.57,-1.995 -3.316,-3.849 -5.019,-5.757 -4.474,-5.105 -7.816,-10.861 -10.071,-17.215 -2.661,-7.368 -4.132,-14.826 -4.157,-22.771 -0.082,-8.123 1.221,-15.914 4.018,-23.424 3.395,-9.257 8.844,-17.258 16.106,-24.171 11.699,-11.058 25.57,-16.142 41.253,-14.984 13.399,0.988 25.012,6.785 34.512,16.706 13.481,14.13 18.27,31.248 17.01,50.094"
             style="fill:#09804f;fill-opacity:0.94117647;fill-rule:nonzero;stroke:none"
             id="path68"
             inkscape:connector-curvature="0" /></g><g
           id="g70"
           transform="translate(658.59387,631.54323)"
           style="fill:#09804f;fill-opacity:0.94117647"><path
             d="m 0,0 c 0.093,-0.257 0.189,-0.523 0.282,-0.78 -3.526,-3.278 -7.026,-6.526 -10.776,-10.015 1.236,-0.482 2.626,-1.059 4.922,-1.998 -1.217,-1.457 -2.303,-2.639 -3.257,-3.918 -0.506,-0.725 -0.687,-1.634 -1.021,-2.472 0.881,-0.119 1.785,-0.448 2.571,-0.277 1.246,0.253 2.342,0.99 3.61,1.289 2.734,0.707 3.966,-0.457 3.139,-3.136 -0.699,-2.448 -1.797,-4.765 -2.561,-7.204 -0.436,-1.289 -0.514,-2.701 -0.722,-4.049 0.416,-0.211 0.833,-0.412 1.248,-0.632 1.577,3.631 4.208,5.806 7.961,6.51 0.271,0.036 0.506,0.394 0.702,0.607 5.498,5.454 10.937,10.967 16.584,16.294 0.78,0.736 2.664,1.023 3.773,0.66 9.295,-3.054 20.498,-0.064 26.231,8.005 5.485,7.721 7.003,15.88 2.656,24.589 -0.833,1.696 -0.322,2.48 1.032,3.332 1.854,1.165 1.897,2.668 0.138,3.786 -4.165,2.727 -8.215,5.776 -12.706,7.766 C 31.3,43.798 18.595,39.511 11.407,27.959 7.866,22.277 4.369,16.555 0.568,11.063 -1.457,8.164 -3.049,4.33 -8.013,5.414 -9.733,5.783 -10.111,4.337 -9.126,2.88 -6.912,-0.412 -3.808,-1.135 0,0"
             style="fill:#09804f;fill-opacity:0.94117647;fill-rule:nonzero;stroke:none"
             id="path72"
             inkscape:connector-curvature="0" /></g><g
           id="g74"
           transform="translate(798.17047,639.43183)"
           style="fill:#09804f;fill-opacity:0.94117647"><path
             d="m 0,0 c 1.28,0.135 2.799,-0.136 3.869,0.445 4.593,2.646 7.932,6.539 10.52,11.224 2.398,4.355 4.963,8.689 7.779,12.802 0.683,0.998 2.561,1.192 3.915,1.73 0.05,-1.241 0.426,-2.584 0.122,-3.721 -2.639,-9.121 -0.738,-17.761 5.865,-23.89 11.573,-10.762 28.559,-9.257 36.955,4.668 4.622,7.695 5.101,15.891 0.382,23.635 -4.329,7.078 -10.635,11.808 -19.453,12.024 -6.894,0.129 -12.938,-2.06 -18.092,-7.241 -1.209,2.154 -2.019,3.894 -3.065,5.467 -2.529,3.62 -7.897,4.77 -10.638,2.367 -2.225,-1.953 -4.52,-3.842 -6.775,-5.807 C 8.842,31.471 6.592,28.917 6.861,25.32 7.432,17.267 4.644,10.316 0.53,3.637 -0.038,2.682 0.153,1.236 0,0"
             style="fill:#09804f;fill-opacity:0.94117647;fill-rule:nonzero;stroke:none"
             id="path76"
             inkscape:connector-curvature="0" /></g><g
           id="g78"
           transform="translate(739.66757,651.94453)"
           style="fill:#09804f;fill-opacity:0.94117647"><path
             d="m 0,0 c 1.963,-2.343 2.511,-4.847 1.263,-7.696 -0.878,-2.096 0.007,-3.077 2.042,-3.771 1.023,-0.346 2.159,-1.3 2.632,-2.265 4.247,-8.878 10.952,-14.115 20.946,-14.722 8.814,-0.577 15.454,3.399 20.132,9.681 8.144,10.996 4.952,26.936 -6.48,33.731 -1.111,0.659 -1.9,2.314 -2.257,3.679 -0.565,1.926 -1.128,3.26 -3.474,3.429 -1.042,0.075 -2.474,0.975 -2.932,1.892 -1.716,3.595 -1.842,3.72 -4.588,0.581 C 25.669,22.644 24.3,21.254 21.433,23.082 19.226,24.547 16.802,24.36 15.722,20.995 15.075,18.965 13.581,18.094 11.518,19.698 9.499,21.275 8.092,20.968 7.137,18.455 6.851,17.628 6.222,16.491 5.547,16.266 2.532,15.384 3.699,13.878 4.621,12.199 5,11.472 5.387,10.216 5.034,9.695 3.324,7.115 1.315,4.762 -0.389,2.196 -0.696,1.728 -0.441,0.509 0,0"
             style="fill:#09804f;fill-opacity:0.94117647;fill-rule:nonzero;stroke:none"
             id="path80"
             inkscape:connector-curvature="0" /></g><g
           id="g82"
           transform="translate(620.58557,612.22383)"
           style="fill:#09804f;fill-opacity:0.94117647"><path
             d="m 0,0 c 12.455,-1.122 23.681,9.542 24.419,21.046 0.974,15.163 -8.288,24.615 -21.588,25.9 -13.112,1.271 -23.953,-7.835 -25.3,-21.238 C -23.89,11.935 -13.466,0.597 0,0"
             style="fill:#09804f;fill-opacity:0.94117647;fill-rule:nonzero;stroke:none"
             id="path84"
             inkscape:connector-curvature="0" /></g></g></g></g><g
     inkscape:groupmode="layer"
     id="layer1"
     inkscape:label="Toulouse"
     transform="translate(-385.89662,50.669499)"><g
       id="g4908"
       transform="matrix(1.2084186,0,0,1.2084186,-435.22921,-181.88642)"><rect
   ry="5.25"
   rx="5.25"
   transform="matrix(1.3333333,0,0,1.3333333,0,1038.6667)"
   y="-181.30334"
   x="721.86151"
   height="112.5"
   width="491.25"
   id="rect4871"
   style="opacity:1;vector-effect:none;fill:#ffffff;fill-opacity:1;stroke:#6f8185;stroke-width:1.5;stroke-linecap:round;stroke-linejoin:round;stroke-miterlimit:4;stroke-dasharray:none;stroke-dashoffset:0;stroke-opacity:1" /><rect
   ry="5.25"
   rx="5.25"
   transform="matrix(1.3333333,0,0,1.3333333,0,1038.6667)"
   y="-168.17834"
   x="734.98651"
   height="86.25"
   width="465"
   id="rect4850"
   style="opacity:1;vector-effect:none;fill:#fefefe;fill-opacity:1;stroke:#fb0036;stroke-width:10.5;stroke-linecap:round;stroke-linejoin:round;stroke-miterlimit:4;stroke-dasharray:none;stroke-dashoffset:0;stroke-opacity:1" /><text
   transform="matrix(1.3333333,0,0,1.3333333,0,1038.6667)"
   id="text4848"
   y="-104.66858"
   x="800.46112"
   style="font-style:normal;font-variant:normal;font-weight:bold;font-stretch:normal;font-size:48px;line-height:1.25;font-family:sans-serif;-inkscape-font-specification:'sans-serif Bold';letter-spacing:0px;word-spacing:0px;fill:#000000;fill-opacity:1;stroke:none;stroke-width:10.5;stroke-miterlimit:4;stroke-dasharray:none"
   xml:space="preserve"><tspan
     dy="0"
     dx="0 0 0 0 0 0 0 1.25"
     style="font-style:normal;font-variant:normal;font-weight:bold;font-stretch:normal;font-size:56px;font-family:sans-serif;-inkscape-font-specification:'sans-serif Bold';stroke-width:10.5;stroke-miterlimit:4;stroke-dasharray:none"
     y="-104.66858"
     x="800.46112"
     id="tspan4846"
     sodipodi:role="line">TOULOUSE</tspan></text>


</g></g></svg>