<?xml version="1.0" encoding="UTF-8" standalone="no"?>
<!-- Created with Inkscape (http://www.inkscape.org/) -->

<svg
   xmlns:dc="http://purl.org/dc/elements/1.1/"
   xmlns:cc="http://creativecommons.org/ns#"
   xmlns:rdf="http://www.w3.org/1999/02/22-rdf-syntax-ns#"
   xmlns:svg="http://www.w3.org/2000/svg"
   xmlns="http://www.w3.org/2000/svg"
   xmlns:sodipodi="http://sodipodi.sourceforge.net/DTD/sodipodi-0.dtd"
   xmlns:inkscape="http://www.inkscape.org/namespaces/inkscape"
   width="210mm"
   height="200mm"
   viewBox="0 0 744.09449 708.66141"
   id="svg2"
   version="1.1"
   inkscape:version="0.91 r13725"
   sodipodi:docname="FredEtKaty_pgp.svg"
   inkscape:export-filename="/home/h4ck3r/Documents/manueldunovice/images/FredEtKaty_pgp.png"
   inkscape:export-xdpi="336"
   inkscape:export-ydpi="336">
  <defs
     id="defs4">
    <inkscape:perspective
       sodipodi:type="inkscape:persp3d"
       inkscape:vp_x="-20.924681 : 1436.1013 : 1"
       inkscape:vp_y="1238.1456 : 183.78403 : 0"
       inkscape:vp_z="2.7616793 : 1022.8625 : 1"
       inkscape:persp3d-origin="-23.963811 : 566.4557 : 1"
       id="perspective4243" />
    <filter
       style="color-interpolation-filters:sRGB"
       inkscape:label="Drop Shadow"
       id="filter4307">
      <feFlood
         flood-opacity="0.498039"
         flood-color="rgb(0,0,0)"
         result="flood"
         id="feFlood4309" />
      <feComposite
         in="flood"
         in2="SourceGraphic"
         operator="in"
         result="composite1"
         id="feComposite4311" />
      <feGaussianBlur
         in="composite1"
         stdDeviation="3"
         result="blur"
         id="feGaussianBlur4313" />
      <feOffset
         dx="6"
         dy="6"
         result="offset"
         id="feOffset4315" />
      <feComposite
         in="SourceGraphic"
         in2="offset"
         operator="over"
         result="composite2"
         id="feComposite4317" />
    </filter>
    <filter
       style="color-interpolation-filters:sRGB"
       inkscape:label="Drop Shadow"
       id="filter4307-4">
      <feFlood
         flood-opacity="0.498039"
         flood-color="rgb(0,0,0)"
         result="flood"
         id="feFlood4309-6" />
      <feComposite
         in="flood"
         in2="SourceGraphic"
         operator="in"
         result="composite1"
         id="feComposite4311-8" />
      <feGaussianBlur
         in="composite1"
         stdDeviation="3"
         result="blur"
         id="feGaussianBlur4313-3" />
      <feOffset
         dx="6"
         dy="6"
         result="offset"
         id="feOffset4315-2" />
      <feComposite
         in="SourceGraphic"
         in2="offset"
         operator="over"
         result="composite2"
         id="feComposite4317-3" />
    </filter>
  </defs>
  <sodipodi:namedview
     id="base"
     pagecolor="#ffffff"
     bordercolor="#e230ae"
     borderopacity="1"
     inkscape:pageopacity="0.0"
     inkscape:pageshadow="2"
     inkscape:zoom="1.8101934"
     inkscape:cx="407.81417"
     inkscape:cy="223.74662"
     inkscape:document-units="px"
     inkscape:current-layer="layer1"
     showgrid="false"
     showguides="false"
     inkscape:window-width="1920"
     inkscape:window-height="1027"
     inkscape:window-x="0"
     inkscape:window-y="0"
     inkscape:window-maximized="1"
     borderlayer="true" />
  <metadata
     id="metadata7">
    <rdf:RDF>
      <cc:Work
         rdf:about="">
        <dc:format>image/svg+xml</dc:format>
        <dc:type
           rdf:resource="http://purl.org/dc/dcmitype/StillImage" />
        <dc:title />
      </cc:Work>
    </rdf:RDF>
  </metadata>
  <g
     inkscape:label="Calque 1"
     inkscape:groupmode="layer"
     id="layer1"
     transform="translate(0,-343.70079)">
    <rect
       style="opacity:1;fill:#ffffff;fill-opacity:1;stroke:#000000;stroke-width:1.30414569;stroke-linejoin:round;stroke-miterlimit:4;stroke-dasharray:none;stroke-opacity:1"
       id="rect4793"
       width="792.57831"
       height="736.32831"
       x="-25.195431"
       y="334.94678"
       ry="1.0068954" />
    <path
       style="fill:#000000"
       d="m 224.38535,735.68965 c -14.59832,-2.27675 -25.87984,-8.5746 -30.27709,-16.90202 -1.46539,-2.77516 -1.35751,-8.65509 0.21351,-11.63494 1.92663,-3.65436 3.36163,-2.78689 2.00412,1.21149 -1.80157,5.30657 -0.81301,8.93196 3.65368,13.39863 4.02383,4.02383 10.90985,7.57129 18.82712,9.69914 4.74066,1.2741 6.23061,1.42462 13.87022,1.40124 10.10222,-0.031 14.47079,-0.95319 21.64934,-4.57053 5.6798,-2.86209 7.59072,-5.25023 7.92449,-9.90347 0.35803,-4.99096 -1.74148,-10.23134 -6.47359,-16.15812 -2.03505,-2.5488 -2.07216,-3.23621 -0.17483,-3.23621 3.56126,0 9.97336,11.04327 9.97336,17.17661 l 0,2.23203 4.45703,-0.27807 c 4.60489,-0.28728 8.53459,-1.58713 9.93831,-3.28731 2.27961,-2.761 -0.4331,-8.39717 -7.23913,-15.04084 -4.3551,-4.25126 -4.85193,-4.92397 -4.24662,-5.75061 0.377,-0.51487 0.94151,-0.93614 1.25454,-0.93614 1.17061,0 10.62981,9.95453 12.08391,12.71674 2.00303,3.80504 2.37173,7.83322 0.92678,10.12595 -1.88448,2.99013 -7.2529,4.95671 -13.56125,4.96782 l -3.60811,0.006 -1.12004,2.38282 c -2.36669,5.03492 -8.51871,8.89791 -18.001,11.30331 -6.45311,1.63695 -15.61491,2.08359 -22.07475,1.07613 z m -13.73031,-50.10369 c -7.03986,-2.10722 -9.25926,-20.13287 -4.73781,-38.48021 0.68876,-2.79506 1.64094,-5.99014 2.11588,-7.10019 0.76819,-1.79528 0.98499,-1.95327 1.96264,-1.43006 0.74589,0.39918 0.97917,0.87587 0.72581,1.48333 -3.39516,8.14203 -5.04368,25.78881 -3.21512,34.41643 1.41354,6.66913 3.44447,8.96121 7.07425,7.9838 2.17028,-0.58438 9.05035,-4.87321 11.56585,-7.20976 1.7615,-1.63619 6.87292,-5.14768 9.3344,-6.41264 2.23365,-1.14789 10.69456,-2.62816 12.43793,-2.17606 1.11888,0.29017 0.49896,0.65305 -3.74075,2.18964 -2.79506,1.013 -5.50322,1.97924 -6.01807,2.14718 -1.43336,0.46757 -1.17309,0.8254 2.14444,2.94822 10.72805,6.8647 22.24431,9.97747 26.18008,7.07631 0.85874,-0.63301 1.90174,-2.22765 2.44332,-3.73565 1.36436,-3.79874 0.99523,-19.99149 -0.64237,-28.18076 -1.21728,-6.08714 -1.01687,-8.29785 0.58306,-6.43322 1.38638,1.61566 2.43589,4.98768 3.35805,10.78928 1.03369,6.50281 1.15885,19.16334 0.22656,22.91471 -2.01007,8.08825 -7.51533,10.35085 -17.87838,7.34776 -8.20749,-2.37844 -20.1885,-9.34487 -19.12431,-11.1199 0.43952,-0.73311 0.90512,-1.07711 -7.05308,5.21129 -8.48877,6.70763 -13.68714,8.98433 -17.74238,7.7705 z m 48.35826,-47.08048 c -2.7728,-1.46361 -5.20625,-4.9381 -5.20625,-7.43341 l 0,-1.96473 -3.87836,1.00791 c -3.50558,0.91103 -4.59118,0.95193 -11.29594,0.42566 -9.01093,-0.70727 -10.46062,-1.31088 -8.93556,-3.72043 0.41181,-0.65068 1.58407,-0.66272 8.14965,-0.0837 8.42436,0.74297 10.93229,0.43115 17.99246,-2.23708 5.43161,-2.05274 5.66732,-2.39201 5.23804,-7.5409 -0.59767,-7.16982 -0.14888,-6.69568 -5.56665,-5.88089 -5.83766,0.87795 -11.36999,0.91262 -13.31341,0.0834 -1.67156,-0.71316 -3.36854,-2.0085 -3.36854,-2.57124 0,-0.203 3.18953,-0.52917 7.08795,-0.72482 12.71737,-0.63826 20.33477,-2.29286 23.2976,-5.06055 2.51424,-2.34868 3.05127,-5.06756 2.97802,-15.07728 -0.0791,-10.81333 -1.09875,-19.14337 -4.54382,-37.12114 -2.5965,-13.54991 -4.01089,-18.78281 -6.23616,-23.07227 l -1.10349,-2.12703 -1.38019,3.09474 c -0.75917,1.70211 -3.08432,8.68306 -5.16709,15.51324 -4.49536,14.74201 -5.52766,17.30319 -7.36131,18.26395 -3.0813,1.61444 -4.99845,-1.03119 -7.76466,-10.71492 l -1.81795,-6.36425 -0.32703,2.94216 c -0.17992,1.6182 -0.67663,6.17155 -1.10385,10.11857 -0.63285,5.84744 -0.97832,7.37802 -1.86549,8.26516 -1.93432,1.93437 -3.62172,0.74759 -7.26363,-5.10867 -1.76532,-2.83865 -3.27067,-5.10027 -3.34532,-5.02582 -0.0746,0.0745 -0.61532,3.6049 -1.2016,7.84546 -1.18037,8.53791 -1.75846,10.45913 -3.2934,10.94631 -1.28298,0.4072 -2.34153,-0.28119 -7.33828,-4.7724 -2.16973,-1.95015 -4.12346,-3.54573 -4.34165,-3.54573 -0.21824,0 -0.0527,1.4884 0.36737,3.30757 0.42024,1.81915 0.80931,5.85126 0.86455,8.96023 0.0953,5.36749 0.0437,5.66075 -1.01998,5.8127 -1.06012,0.15144 -1.13914,-0.15058 -1.46915,-5.61686 -0.1918,-3.17729 -0.70209,-7.22124 -1.13404,-8.98654 -2.15717,-8.81641 0.0552,-9.45394 8.19246,-2.36087 3.06304,2.66995 4.99603,4.01873 5.14102,3.58727 0.12777,-0.38031 0.73727,-4.61296 1.35441,-9.4059 1.20742,-9.3776 1.36078,-10.06819 2.31678,-10.43172 1.56879,-0.59655 3.06886,0.91779 6.17768,6.23645 1.81183,3.09986 3.51136,5.77026 3.7766,5.93422 0.6688,0.41331 0.9717,-1.36417 1.91103,-11.21244 1.24381,-13.04066 1.42494,-13.76503 3.38504,-13.53832 1.26818,0.14668 1.56296,0.60664 2.67651,4.17688 0.68827,2.20663 2.09617,6.72064 3.1287,10.03115 1.03247,3.3105 2.08502,6.1475 2.33892,6.30443 0.82472,0.50969 2.46136,-3.5595 5.81716,-14.46329 6.60871,-21.47307 7.86646,-23.77215 11.84122,-21.6449 2.55008,1.36475 6.02211,11.33138 7.72667,22.17984 0.46233,2.94217 1.41803,8.47879 2.12376,12.3036 2.36227,12.80222 3.14223,20.41015 3.18092,31.02648 0.037,10.14367 0.034,10.17008 -1.49947,13.29301 -1.74858,3.56108 -4.55758,5.70732 -8.93978,6.83043 -2.91252,0.74647 -2.86449,0.62763 -2.04481,5.06324 0.89106,4.82128 0.69374,4.64792 3.5421,3.11236 2.20373,-1.188 3.03159,-1.3441 5.95242,-1.12242 3.57303,0.27117 4.58986,0.77202 4.10473,2.02186 -0.21042,0.54196 -1.28128,0.76514 -3.75586,0.78272 -2.63509,0.0187 -3.81425,0.28792 -4.9389,1.12761 -0.81256,0.60666 -1.47737,1.30552 -1.47737,1.55302 0,0.2475 1.51315,0.72366 3.36258,1.05813 4.06379,0.73493 5.14477,1.55882 3.59163,2.73736 -0.80379,0.60989 -1.86822,0.73587 -4.27954,0.50648 -4.50202,-0.4283 -5.51994,0.37037 -2.25551,1.76968 1.42279,0.60988 2.52299,1.43524 2.52299,1.89271 0,1.39639 -2.45223,1.56967 -4.96937,0.35116 -2.64443,-1.28016 -5.60644,-1.45589 -7.02731,-0.41691 -0.90277,0.6601 -0.91034,0.81803 -0.11297,2.35999 0.99317,1.92052 3.18036,3.77346 4.9905,4.22777 0.69634,0.17477 2.75685,-0.0578 4.57899,-0.51679 1.82211,-0.45899 3.40393,-0.74359 3.51508,-0.63242 0.3852,0.38521 -0.55722,1.42135 -2.71343,2.98331 -2.60996,1.89066 -5.55638,2.04827 -8.56842,0.45837 z m 12.98162,-0.53341 c 0,-0.61027 1.29032,-2.47589 2.86741,-4.14579 4.68942,-4.96553 6.76152,-8.00322 6.76152,-9.91235 0,-2.07308 -1.30578,-4.09009 -2.64783,-4.09009 -0.9483,0 -1.94529,-1.46954 -1.38024,-2.03457 0.61259,-0.6126 4.62253,1.09314 5.41571,2.30377 1.25266,1.91178 1.49499,5.0529 0.55972,7.25585 -0.44553,1.0495 -1.92754,3.39469 -3.29329,5.21154 -4.1388,5.50582 -8.283,8.21341 -8.283,5.41164 z m -51.76663,-9.94723 c -2.37384,-0.95513 -3.29643,-8.86812 -1.76701,-15.15522 0.89767,-3.6898 0.90306,-3.69843 2.11722,-3.38092 0.74655,0.19523 1.09729,0.94766 1.35811,2.91349 0.81532,6.14623 1.74434,6.55966 13.5727,6.03985 5.72754,-0.25171 8.6252,-0.19143 8.8574,0.18428 0.60847,0.98459 -2.93029,1.80387 -10.45522,2.42051 l -7.32445,0.60022 -0.87541,2.29227 c -1.23496,3.23364 -3.46703,4.89675 -5.48334,4.08552 z m 3.06498,-4.6916 1.63397,-2.37493 -1.60898,-0.95045 c -0.88494,-0.52275 -1.74635,-1.38331 -1.91426,-1.91235 -0.48919,-1.54128 -1.29844,-0.52523 -1.29516,1.62616 0,1.93413 0.90579,5.9865 1.33379,5.9865 0.11916,0 0.95194,-1.06872 1.85064,-2.37493 z m 16.61597,-19.39896 c -4.19374,-2.16496 -5.56987,-7.21571 -4.14942,-15.22959 1.15825,-6.53445 4.37464,-13.22832 5.71996,-11.90433 0.42024,0.41355 0.22771,1.38583 -0.68858,3.4771 -1.57642,3.59787 -3.03332,9.97805 -3.02938,13.26623 0.009,7.77168 3.63858,10.19464 11.42323,7.62646 3.51881,-1.16087 3.24611,-0.4112 -0.61489,1.69022 -3.55896,1.937 -6.32467,2.27995 -8.66092,1.07391 z m 4.80379,-21.02126 c -1.51463,-1.51465 -1.44447,-4.81324 0.13378,-6.28638 2.6976,-2.51802 6.28548,-1.95727 6.28548,0.98237 0,2.01064 -1.22518,4.44254 -2.79063,5.539 -1.57442,1.10275 -2.34049,1.05314 -3.62863,-0.23499 z m 11.09262,-0.66868 c -0.82866,-0.62923 -1.9986,-3.07657 -1.9986,-4.1806 0,-0.67593 2.00309,-2.63987 2.69251,-2.63987 0.30399,0 1.38516,0.8324 2.40253,1.84977 1.58606,1.58604 1.77781,2.03902 1.34513,3.17711 -0.46972,1.23551 -2.01084,2.46227 -3.09317,2.46227 -0.25729,0 -0.86413,-0.30091 -1.3484,-0.66868 z"
       id="path4224"
       inkscape:connector-curvature="0"
       sodipodi:nodetypes="csscsssssssscscscsssscssccsccscsssscscsccscsssssssscsscsscscssssssccsssccccscsscscscssscssccsscccsscsssscsscscsscssscscssssssssscccssccscscscscscsscsssscscsssssssscsssssc" />
    <path
       style="fill:#000000"
       d="m 538.73536,719.42355 c -9.502,-1.55985 -15.65115,-5.19014 -18.10699,-10.68994 -1.17464,-2.63062 -1.40732,-7.75913 -0.52323,-11.53235 1.78259,-7.6077 7.48884,-14.45586 12.07628,-14.49297 1.52728,-0.0124 2.19452,1.21565 1.3307,2.44894 -0.35044,0.50032 -1.33265,1.26873 -2.18278,1.70759 -5.6398,2.91162 -9.51561,12.86904 -7.55552,19.41111 0.65855,2.19809 3.12803,4.92746 5.74891,6.3539 5.09189,2.77137 14.67845,4.12827 22.91764,3.24385 8.01563,-0.86044 14.29039,-2.76841 21.60772,-6.57032 8.95291,-4.65174 15.92022,-11.04917 15.95137,-14.64659 0.006,-0.69227 0.35643,-1.70806 0.77874,-2.25726 l 0.7678,-0.99852 0.69137,0.98701 c 1.50421,2.14758 0.48156,6.20931 -2.47039,9.81183 -1.7434,2.12761 -6.96342,6.33868 -10.49274,8.46472 -6.53844,3.93875 -14.83912,7.10673 -21.79906,8.31976 -5.48556,0.9561 -14.32883,1.16333 -18.73982,0.43924 z m -22.79744,-16.97316 c -5.38919,-0.90863 -12.01002,-4.85451 -13.57715,-8.09174 -1.06226,-2.19433 -1.10973,-3.24189 -0.27425,-6.05512 2.09308,-7.04822 14.58343,-17.91408 15.24421,-13.26158 0.0737,0.51925 -0.062,0.94402 -0.30154,0.94402 -0.23957,0 -0.33784,0.25465 -0.21845,0.56585 0.13645,0.35553 -0.72481,1.1659 -2.31762,2.18059 -2.77897,1.77046 -7.1082,6.51168 -8.41992,9.22135 -1.29603,2.67728 -1.11862,4.80399 0.52937,6.34501 2.00176,1.87191 4.19195,3.07172 8.0233,4.39529 3.34049,1.15395 3.41255,1.20818 3.54016,2.66111 0.0716,0.81574 -0.0228,1.45954 -0.2098,1.43067 -0.18702,-0.029 -1.09522,-0.17987 -2.01831,-0.33545 z m 50.52806,-24.56725 c -1.17873,-0.641 -3.02344,-3.10192 -3.72275,-4.96633 -1.1951,-3.18623 0.11139,-5.79506 3.38963,-6.7686 1.20651,-0.35828 2.25374,-0.65142 2.32722,-0.65142 0.0734,0 0.13365,0.64582 0.13365,1.43515 0,1.25435 -0.15904,1.47008 -1.2622,1.71237 -2.68405,0.58952 -2.48086,2.6698 0.61455,6.29301 1.42254,1.66511 1.73717,2.29445 1.42549,2.85141 -0.47972,0.85717 -1.44519,0.88856 -2.90559,0.0944 z m 13.25502,-5.09995 c -1.83487,-2.25252 -1.8918,-2.40079 -1.21085,-3.15327 0.69798,-0.77124 0.73727,-0.76833 1.6889,0.12569 1.21008,1.13682 2.8164,4.37918 2.45731,4.96017 -0.48591,0.7862 -0.99221,0.45284 -2.93536,-1.93259 z m 5.55552,0.89129 -1.14882,-0.64705 4.53597,-2.30663 c 8.94516,-4.54884 10.01236,-7.07789 6.16694,-14.6141 -2.25892,-4.427 -5.26054,-8.96408 -11.42234,-17.26537 -6.23547,-8.40059 -10.19932,-13.90441 -10.19932,-14.16192 0,-0.26864 2.51134,-1.29446 2.67086,-1.091 2.88038,3.67354 17.87489,24.03425 19.12159,25.96479 0.96866,1.49995 2.55059,4.31757 3.51544,6.26137 1.59819,3.21971 1.75429,3.8196 1.75429,6.74198 0,2.77047 -0.1522,3.43803 -1.11629,4.89637 -1.10092,1.6653 -3.87401,3.76413 -7.40246,5.60257 -2.32209,1.20991 -4.97622,1.46362 -6.47586,0.61899 z m -31.65918,-19.93053 c -4.21835,-0.61417 -7.8202,-3.10704 -8.35533,-5.78282 l -0.27039,-1.35194 3.76252,1.94674 c 5.76256,2.9816 8.91651,2.95605 13.23456,-0.10722 1.72685,-1.22505 2.10887,-1.34564 2.83205,-0.894 1.17303,0.73257 1.05774,1.1926 -0.73741,2.94156 -2.75904,2.68814 -6.44764,3.83273 -10.466,3.24768 z m -21.40401,-4.17177 c -2.20337,-1.00029 -5.13117,-3.89134 -6.18026,-6.10271 -0.4379,-0.92305 -0.88085,-2.55445 -0.98429,-3.62531 -0.42369,-4.38619 3.65359,-12.10849 6.39314,-12.10849 1.65422,0 1.37517,1.68768 -0.80552,4.87251 -2.05926,3.00748 -2.52385,4.61889 -2.22582,7.72042 0.30558,3.18051 3.61978,6.87997 6.72831,7.51052 1.07976,0.21903 1.38507,0.5087 1.49066,1.41433 0.121,1.03804 0.01,1.13807 -1.25874,1.12967 -0.76528,-0.005 -2.18616,-0.36999 -3.15748,-0.81094 z m -25.44501,-5.04457 c -1.3511,-0.43163 -2.89892,-1.20041 -3.43966,-1.7084 -1.32209,-1.24206 -1.73969,-3.222 -0.86421,-4.0975 0.61241,-0.61241 0.78512,-0.54245 2.03838,0.82581 2.54264,2.77593 8.9286,3.70055 11.63894,1.68517 2.14421,-1.5944 1.28695,-4.38733 -1.68385,-5.48616 -2.434,-0.90025 -2.54601,-1.56769 -0.32461,-1.93356 3.13198,-0.51586 4.53184,-1.28449 4.53184,-2.48836 0,-1.40546 -2.43177,-4.0728 -4.60756,-5.05394 -1.40528,-0.63372 -1.65342,-0.91871 -1.43111,-1.64376 0.14792,-0.48243 0.30778,-0.92369 0.35525,-0.9806 0.0476,-0.0569 1.06711,0.18781 2.26591,0.5438 1.74745,0.51894 2.65422,0.55953 4.5737,0.20469 3.01811,-0.55792 4.23357,-1.63004 3.54972,-3.13099 -1.0917,-2.39604 -6.13516,-4.92658 -11.1608,-5.59992 -2.21545,-0.29682 -2.77563,-0.25933 -2.77563,0.18578 0,0.34123 -0.49376,0.55767 -1.27216,0.55767 -0.69969,0 -1.92694,0.27357 -2.72722,0.60793 -1.66478,0.6956 -1.87168,1.68122 -0.6752,3.21649 1.19481,1.53308 2.15719,3.58594 2.15719,4.60144 0,0.50343 -0.63058,1.51002 -1.40123,2.23686 -1.07001,1.00916 -1.3249,1.51672 -1.07843,2.14738 0.67747,1.7331 0.44494,2.71391 -0.64333,2.71391 -1.35438,0 -2.33141,-1.46312 -2.33141,-3.49135 0,-1.27282 0.27885,-1.88683 1.28265,-2.82453 l 1.28262,-1.19816 -1.2817,-2.43161 c -0.70498,-1.33738 -1.2822,-2.67875 -1.28267,-2.98083 -4.3e-4,-0.30207 -0.1591,-0.45146 -0.35239,-0.33198 -0.38716,0.23928 -0.78701,-1.30144 -2.60228,-10.02757 -3.40037,-16.3456 -4.68751,-39.2964 -2.76485,-49.29924 0.71972,-3.74441 1.8401,-6.71309 2.53351,-6.71309 1.28679,0 1.35942,0.91221 0.34354,4.31683 -2.14497,7.18856 -1.61774,32.07032 1.0372,48.95034 l 1.152,7.32446 0.52376,-3.90999 c 0.28804,-2.1505 0.80186,-4.99554 1.14173,-6.32232 0.55682,-2.1734 0.54959,-2.61547 -0.0731,-4.46339 -1.11762,-3.31698 -0.97346,-16.31934 0.23915,-21.56098 1.60584,-6.94184 3.81877,-10.17151 6.507,-9.49681 1.38369,0.34727 1.40547,0.78685 0.12385,2.49704 -3.34178,4.4593 -5.21222,19.56813 -3.35642,27.11223 2.2992,9.34676 9.76764,16.20857 23.10589,21.22907 6.09996,2.29601 16.40211,4.38357 21.65937,4.38891 2.18245,0.002 8.27147,-0.73819 8.60213,-1.046 0.12237,-0.1139 -4.84927,-10.27301 -5.22463,-10.67612 -0.38293,-0.41121 -1.82506,1.53217 -2.07891,2.80148 -0.23314,1.16579 -0.0733,1.54363 1.15367,2.72575 0.78341,0.75478 1.79749,1.5862 2.25346,1.84758 1.14003,0.65351 0.47425,1.18396 -1.48603,1.18396 -2.14649,0 -3.8313,-1.27909 -4.52998,-3.43915 -0.72538,-2.24246 -0.1454,-4.42274 1.77241,-6.66332 l 1.44285,-1.68561 -4.15733,-7.28521 c -2.28652,-4.00688 -4.30188,-7.42766 -4.47862,-7.60174 -0.1767,-0.1741 -0.33208,0.77653 -0.34525,2.11248 -0.0607,6.15009 -4.23434,10.5214 -10.0457,10.5214 -2.04593,0 -4.73573,-0.71218 -5.87157,-1.55464 -0.77455,-0.57445 -0.67458,-0.60694 1.25636,-0.40824 1.15382,0.11872 3.13027,0.0264 4.39215,-0.20518 4.48076,-0.82231 6.54205,-2.55974 7.62681,-6.4284 1.06264,-3.78967 -1.60033,-11.71768 -5.06686,-15.08471 l -1.70749,-1.65853 -0.005,1.23896 c -0.009,2.34967 -0.5319,4.41874 -1.20671,4.773 -0.37222,0.19538 -1.62296,0.48291 -2.77945,0.63895 -1.793,0.24193 -2.31728,0.13908 -3.5599,-0.69834 -0.80152,-0.54013 -1.86792,-1.71411 -2.36979,-2.60885 l -0.91253,-1.62678 -0.43734,1.58393 c -0.60742,2.19987 -1.59767,3.16295 -3.25213,3.16295 -1.89935,0 -4.58733,-2.54465 -4.99752,-4.73094 -0.89517,-4.77166 4.3415,-6.99203 7.53617,-3.19536 l 1.05027,1.24817 0.26649,-1.06187 c 0.42293,-1.68504 2.88371,-3.58834 4.63938,-3.58834 1.56832,0 4.34939,1.09679 4.34939,1.71531 0,0.19854 0.59344,0.66787 1.31876,1.04295 l 1.31881,0.68198 -0.98364,-1.61523 c -4.21031,-6.91395 -13.46006,-17.5727 -17.07308,-19.67391 -1.47539,-0.85802 -1.53037,-0.958 -0.99324,-1.80547 0.29359,-0.46329 0.61093,-0.43363 1.77673,0.166 5.24523,2.69797 10.54529,8.72634 19.53158,22.21557 3.67029,5.50942 11.32935,18.23187 14.80136,24.58645 l 2.20057,4.02762 2.37236,-0.96658 c 2.95324,-1.20327 6.16898,-1.63203 8.14605,-1.08615 1.21988,0.33683 1.557,0.29739 1.74968,-0.20466 0.38877,-1.01317 0.26388,-16.63512 -0.18554,-23.20993 -0.54944,-8.03708 -1.70754,-15.44918 -2.90668,-18.60314 -0.29555,-0.7774 -0.24642,-1.17883 0.18844,-1.53974 0.88856,-0.73743 1.317,-0.23741 2.25408,2.63048 2.10972,6.45656 3.21626,19.12148 2.87861,32.94692 l -0.23062,9.44267 1.16361,0.97908 c 0.63995,0.53851 1.39976,1.54934 1.68846,2.2463 0.28866,0.69696 0.83239,1.27339 1.20823,1.28095 1.21422,0.0244 6.67614,8.79718 5.47714,8.79718 -0.9678,0 -2.93184,-1.34892 -3.99662,-2.74489 l -1.13421,-1.48707 -0.76282,1.1628 c -1.47157,2.24334 -4.62068,5.08013 -7.11551,6.40985 -2.10545,1.12219 -2.47449,1.48153 -2.24951,2.19031 1.21388,3.82471 1.89122,6.82571 2.06435,9.14669 0.1765,2.36634 0.14848,2.51835 -0.20814,1.12931 -0.22667,-0.88278 -1.18164,-3.57326 -2.12218,-5.97885 -1.8293,-4.67881 -1.88604,-4.72779 -4.58049,-3.95504 -2.31582,0.66418 -12.33807,0.53788 -16.57583,-0.20886 -4.17925,-0.73645 -10.78352,-2.45479 -13.00973,-3.38496 -1.8856,-0.78786 -1.8847,-0.78813 -1.88651,0.55279 -0.005,2.51027 -2.78615,5.13971 -5.43932,5.13971 -1.01931,0 -1.01978,0.003 -0.22587,1.52542 0.34472,0.66097 0.62791,1.98742 0.62934,2.94765 0,1.43254 -0.22687,1.93896 -1.2762,2.8219 l -1.2788,1.07603 0.67362,1.98415 c 0.61922,1.8238 0.61884,2.12776 -0.005,3.7613 -1.36484,3.57374 -7.13092,4.95241 -12.94476,3.09506 z m 59.03317,-27.787 c 0.13531,-1.22173 0.36776,-3.66995 0.51648,-5.4405 l 0.27039,-3.21915 -1.61959,-0.44973 c -2.1113,-0.58623 -2.45085,-0.57402 -5.4125,0.1945 -3.9814,1.03315 -3.96841,0.91168 -0.7971,7.44391 l 2.78049,5.72724 2.0079,-1.01746 c 1.94435,-0.98529 2.01564,-1.08771 2.25393,-3.23881 z m 2.3629,-0.37095 c 2.00442,-2.53579 2.21717,-4.3352 0.71852,-6.07747 l -0.96951,-1.12711 -0.6946,3.72601 c -0.38202,2.04932 -0.81741,4.15084 -0.96747,4.67005 -0.41797,1.44597 0.0671,1.14388 1.91306,-1.19148 z m -62.96857,-2.0318 c 0.83139,-0.21466 2.81174,-0.52241 4.4008,-0.68389 l 2.88917,-0.2936 -2.11819,-1.93795 c -2.30901,-2.11251 -5.24175,-5.97562 -5.74843,-7.57196 -0.51263,-1.61522 -0.90045,-0.37946 -1.83776,5.85607 -0.46897,3.11975 -0.98345,6.01316 -1.14335,6.4298 -0.21608,0.56306 0.009,0.47955 0.87771,-0.32534 0.64267,-0.59557 1.84866,-1.25848 2.68005,-1.47313 z m 82.56132,-1.99838 c -1.80728,-1.29057 -5.12604,-5.48618 -6.03077,-7.62414 -1.29141,-3.05166 0.85089,-3.63399 2.57103,-0.69885 0.60419,1.03096 2.33417,3.11016 3.84446,4.62044 2.01304,2.01302 2.71035,2.99541 2.61256,3.68051 -0.19035,1.33382 -1.15044,1.34088 -2.99728,0.022 z m -68.42236,-4.83982 c -3.45532,-1.88882 -4.80366,-4.37965 -3.59419,-6.63959 0.88698,-1.6573 3.45559,-2.2998 8.51042,-2.12874 1.53646,0.052 1.59472,0.1071 1.46849,1.38897 l -0.13151,1.33483 -2.73769,-0.10162 c -2.93426,-0.10891 -5.19609,0.4829 -4.92732,1.28924 0.0908,0.27256 1.56947,1.26876 3.28575,2.21377 2.57375,1.41712 3.12057,1.89963 3.12057,2.7535 0,1.5907 -1.96195,1.54734 -4.99452,-0.11036 z m 76.13012,-2.95432 c -0.99187,-0.50193 -6.59452,-7.34227 -8.08593,-9.87224 -0.69099,-1.17218 -0.68885,-1.26169 0.0461,-1.92699 0.73399,-0.66422 0.97499,-0.43269 5.02526,4.82765 2.62939,3.415 4.25426,5.90344 4.25426,6.51528 0,1.15196 0.0781,1.12325 -1.23985,0.4563 z m 6.40918,-7.00509 c -4.59886,-2.05897 -6.96437,-5.74817 -11.30277,-17.62752 -1.70117,-4.65816 -3.08333,-7.15832 -4.62972,-8.37473 -0.99506,-0.78269 -1.06107,-0.99161 -0.61965,-1.96044 0.48461,-1.06362 0.5152,-1.07054 1.59819,-0.36095 2.70525,1.77257 3.83976,3.68225 7.30187,12.29131 2.46173,6.12151 4.4994,9.94775 6.09708,11.44868 0.49008,0.4604 1.907,1.36198 3.14871,2.00351 2.63443,1.36106 3.04443,2.28345 1.28723,2.89601 -0.95348,0.33238 -1.58858,0.26275 -2.88094,-0.31587 z"
       id="path4224-6"
       inkscape:connector-curvature="0"
       sodipodi:nodetypes="sssscccssscsccsssscsccsccscccccsscsssscsscscsscsssscsssssssccssccssssssssccsccsssssscscsscsssccsscsssccccssssscccccssssccccssscccscsscsssccscscccsscsccsscccscssscsscsccsscccsscccscscsssscsccsccccccsccsscccsscscssscscsccscssscccscsccscssscscssccsscscsssss" />
    <path
       style="opacity:1;fill:#cccccc;fill-opacity:1;stroke:#000000;stroke-width:2.91499996;stroke-linejoin:round;stroke-miterlimit:4;stroke-dasharray:none;stroke-opacity:1;filter:url(#filter4307-4)"
       d="m 317.3506,594.92257 c -0.0411,-0.9232 5.64607,-63.98328 12.63821,-140.13351 L 342.7018,316.33409 398.76599,208.16816 c 30.83531,-59.49126 56.20489,-107.75129 56.37686,-107.24452 0.17196,0.50678 -1.17776,32.69202 -2.99938,71.52275 l -3.31202,70.60134 -64.68653,174.56699 c -35.57759,96.01184 -62.38182,176.66621 -62.9409,177.88154 -0.70625,1.53527 -3.80147,0.59254 -3.85342,-0.57369 z"
       id="path4301"
       inkscape:connector-curvature="0"
       sodipodi:nodetypes="cscscscssc"
       transform="matrix(0.86003087,0,0,0.86003087,80.399762,351.94189)" />
    <path
       style="opacity:1;fill:#808080;fill-opacity:1;stroke:#000000;stroke-width:2.50698996;stroke-linejoin:round;stroke-miterlimit:4;stroke-dasharray:none;stroke-opacity:1"
       d="m 291.59591,865.62178 c -0.69391,-1.93545 9.25266,-53.92356 19.25933,-119.96386 l 22.46988,-116.51 17.81005,-3.81834 c 11.87818,-2.54661 22.08598,-0.0441 22.08598,0.21373 0,1.51934 -20.43525,238.15383 -21.90508,241.15682 l -2.44169,4.98861 -36.53605,4.51349 -18.48208,-4.27594 z"
       id="path4303"
       inkscape:connector-curvature="0"
       sodipodi:nodetypes="sscssscccs" />
    <path
       style="opacity:1;fill:#b3b3b3;fill-opacity:1;stroke:#000000;stroke-width:2.50698996;stroke-linejoin:round;stroke-miterlimit:4;stroke-dasharray:none;stroke-opacity:1"
       d="m 333.07482,627.1703 c 0,-1.17844 129.02611,-190.96513 129.84412,-190.9253 0.34128,0.0166 5.23493,-1.8659 5.98991,-0.96436 7.09744,8.47513 -0.68503,4.24829 -46.33185,93.2796 l -48.95324,95.48031 -22.35304,0.11878 c -13.20874,0.0702 -18.1959,3.56256 -18.1959,3.01097 z"
       id="path4305"
       inkscape:connector-curvature="0"
       sodipodi:nodetypes="scsscss" />
    <rect
       style="opacity:1;fill:#cccccc;fill-opacity:1;stroke:#000000;stroke-width:2.20383072;stroke-linejoin:round;stroke-miterlimit:4;stroke-dasharray:none;stroke-opacity:1"
       id="rect4321"
       width="200.79723"
       height="81.070915"
       x="68.284988"
       y="782.09448" />
    <text
       xml:space="preserve"
       style="font-style:normal;font-weight:normal;font-size:18.13393784px;line-height:125%;font-family:sans-serif;letter-spacing:0px;word-spacing:0px;fill:#000000;fill-opacity:1;stroke:none;stroke-width:1px;stroke-linecap:butt;stroke-linejoin:miter;stroke-opacity:1"
       x="74.090149"
       y="803.14404"
       id="text4323"
       sodipodi:linespacing="125%"><tspan
         sodipodi:role="line"
         id="tspan4325"
         x="74.090149"
         y="803.14404"
         style="font-style:normal;font-variant:normal;font-weight:normal;font-stretch:normal;font-family:monospace;-inkscape-font-specification:monospace">Tu viens chez </tspan><tspan
         sodipodi:role="line"
         x="74.090149"
         y="825.81146"
         id="tspan4327"
         style="font-style:normal;font-variant:normal;font-weight:normal;font-stretch:normal;font-family:monospace;-inkscape-font-specification:monospace">moi pour terminer </tspan><tspan
         sodipodi:role="line"
         x="74.090149"
         y="848.47888"
         id="tspan4329"
         style="font-style:normal;font-variant:normal;font-weight:normal;font-stretch:normal;font-family:monospace;-inkscape-font-specification:monospace">l'exposé  ?</tspan></text>
    <rect
       style="opacity:1;fill:#cccccc;fill-opacity:1;stroke:#000000;stroke-width:2.20383072;stroke-linejoin:round;stroke-miterlimit:4;stroke-dasharray:none;stroke-opacity:1"
       id="rect4321-4"
       width="200.79723"
       height="81.070915"
       x="417.11725"
       y="782.56958" />
    <text
       xml:space="preserve"
       style="font-style:normal;font-weight:normal;font-size:18.13393784px;line-height:125%;font-family:sans-serif;letter-spacing:0px;word-spacing:0px;fill:#000000;fill-opacity:1;stroke:none;stroke-width:1px;stroke-linecap:butt;stroke-linejoin:miter;stroke-opacity:1"
       x="607.95416"
       y="803.61914"
       id="text4323-5"
       sodipodi:linespacing="125%"><tspan
         sodipodi:role="line"
         id="tspan4325-7"
         x="618.86285"
         y="803.61914"
         style="font-style:normal;font-variant:normal;font-weight:normal;font-stretch:normal;font-family:monospace;-inkscape-font-specification:monospace;text-align:end;text-anchor:end">Tu viens chez </tspan><tspan
         sodipodi:role="line"
         x="618.86285"
         y="826.28656"
         id="tspan4327-0"
         style="font-style:normal;font-variant:normal;font-weight:normal;font-stretch:normal;font-family:monospace;-inkscape-font-specification:monospace;text-align:end;text-anchor:end">moi pour terminer </tspan><tspan
         sodipodi:role="line"
         x="607.95416"
         y="848.95398"
         id="tspan4329-7"
         style="font-style:normal;font-variant:normal;font-weight:normal;font-stretch:normal;font-family:monospace;-inkscape-font-specification:monospace;text-align:end;text-anchor:end">l'exposé  ?</tspan></text>
    <text
       xml:space="preserve"
       style="font-style:normal;font-weight:normal;font-size:20.88439369px;line-height:125%;font-family:sans-serif;letter-spacing:0px;word-spacing:0px;fill:#000000;fill-opacity:1;stroke:none;stroke-width:1px;stroke-linecap:butt;stroke-linejoin:miter;stroke-opacity:1"
       x="490.98984"
       y="506.2373"
       id="text4323-5-6"
       sodipodi:linespacing="125%"><tspan
         sodipodi:role="line"
         x="490.98984"
         y="506.2373"
         style="font-style:normal;font-variant:normal;font-weight:bold;font-stretch:normal;font-family:Purisa;-inkscape-font-specification:'Purisa Bold'"
         id="tspan4409">Mais quel exposé ?</tspan></text>
    <text
       xml:space="preserve"
       style="font-style:normal;font-weight:normal;font-size:19.19927216px;line-height:125%;font-family:sans-serif;letter-spacing:0px;word-spacing:0px;fill:#000000;fill-opacity:1;stroke:none;stroke-width:1px;stroke-linecap:butt;stroke-linejoin:miter;stroke-opacity:1"
       x="171.8772"
       y="485.16983"
       id="text4323-5-6-6"
       sodipodi:linespacing="125%"><tspan
         sodipodi:role="line"
         x="171.8772"
         y="485.16983"
         style="font-style:normal;font-variant:normal;font-weight:bold;font-stretch:normal;font-family:Purisa;-inkscape-font-specification:'Purisa Bold'"
         id="tspan4409-6">J'espère qu'elle</tspan><tspan
         sodipodi:role="line"
         x="171.8772"
         y="509.16891"
         style="font-style:normal;font-variant:normal;font-weight:bold;font-stretch:normal;font-family:Purisa;-inkscape-font-specification:'Purisa Bold'"
         id="tspan4517">comprendra !</tspan></text>
    <rect
       style="opacity:1;fill:#cccccc;fill-opacity:1;stroke:#000000;stroke-width:2.20383072;stroke-linejoin:round;stroke-miterlimit:4;stroke-dasharray:none;stroke-opacity:1"
       id="rect4321-2"
       width="200.79723"
       height="81.070915"
       x="68.12426"
       y="952.90369" />
    <text
       xml:space="preserve"
       style="font-style:normal;font-weight:normal;font-size:18.13393784px;line-height:125%;font-family:sans-serif;letter-spacing:0px;word-spacing:0px;fill:#000000;fill-opacity:1;stroke:none;stroke-width:1px;stroke-linecap:butt;stroke-linejoin:miter;stroke-opacity:1"
       x="73.929413"
       y="974.90344"
       id="text4323-6"
       sodipodi:linespacing="125%"><tspan
         sodipodi:role="line"
         x="73.929413"
         y="974.90344"
         id="tspan4329-2"
         style="font-style:normal;font-variant:normal;font-weight:normal;font-stretch:normal;font-family:monospace;-inkscape-font-specification:monospace">XO3FgSDRER465458M</tspan><tspan
         sodipodi:role="line"
         x="73.929413"
         y="997.57086"
         style="font-style:normal;font-variant:normal;font-weight:normal;font-stretch:normal;font-family:monospace;-inkscape-font-specification:monospace"
         id="tspan4484">hs:pPG$gkjDF5da%f</tspan><tspan
         sodipodi:role="line"
         x="73.929413"
         y="1020.2383"
         style="font-style:normal;font-variant:normal;font-weight:normal;font-stretch:normal;font-family:monospace;-inkscape-font-specification:monospace"
         id="tspan4482">mlkpoRAFgtA$Klml5</tspan></text>
    <rect
       style="opacity:1;fill:#cccccc;fill-opacity:1;stroke:#000000;stroke-width:2.20383072;stroke-linejoin:round;stroke-miterlimit:4;stroke-dasharray:none;stroke-opacity:1"
       id="rect4321-2-6"
       width="200.79723"
       height="81.070915"
       x="412.31778"
       y="953.60712" />
    <text
       xml:space="preserve"
       style="font-style:normal;font-weight:normal;font-size:18.13393784px;line-height:125%;font-family:sans-serif;letter-spacing:0px;word-spacing:0px;fill:#000000;fill-opacity:1;stroke:none;stroke-width:1px;stroke-linecap:butt;stroke-linejoin:miter;stroke-opacity:1"
       x="418.12292"
       y="975.60687"
       id="text4323-6-7"
       sodipodi:linespacing="125%"><tspan
         sodipodi:role="line"
         x="418.12292"
         y="975.60687"
         id="tspan4329-2-3"
         style="font-style:normal;font-variant:normal;font-weight:normal;font-stretch:normal;font-family:monospace;-inkscape-font-specification:monospace">XO3FgSDRER465458M</tspan><tspan
         sodipodi:role="line"
         x="418.12292"
         y="998.27429"
         style="font-style:normal;font-variant:normal;font-weight:normal;font-stretch:normal;font-family:monospace;-inkscape-font-specification:monospace"
         id="tspan4484-6">hs:pPG$gkjDF5da%f</tspan><tspan
         sodipodi:role="line"
         x="418.12292"
         y="1020.9417"
         style="font-style:normal;font-variant:normal;font-weight:normal;font-stretch:normal;font-family:monospace;-inkscape-font-specification:monospace"
         id="tspan4482-0">mlkpoRAFgtA$Klml5</tspan></text>
    <circle
       style="opacity:1;fill:none;fill-opacity:1;stroke:#000000;stroke-width:3.32693338;stroke-linejoin:round;stroke-miterlimit:4;stroke-dasharray:none;stroke-opacity:1"
       id="path4537-3"
       cx="971.57465"
       cy="523.64569"
       r="14.992258"
       transform="matrix(0.8932834,0.4494939,-0.4494939,0.8932834,0,0)" />
    <rect
       style="opacity:1;fill:none;fill-opacity:1;stroke:#000000;stroke-width:1.26411033;stroke-linejoin:round;stroke-miterlimit:4;stroke-dasharray:none;stroke-opacity:1"
       id="rect4539-0"
       width="45.894691"
       height="11.439783"
       x="911.25134"
       y="517.94446"
       ry="1.2771224"
       transform="matrix(0.8932834,0.4494939,-0.4494939,0.8932834,0,0)" />
    <rect
       style="opacity:1;fill:none;fill-opacity:1;stroke:#000000;stroke-width:0;stroke-linejoin:round;stroke-miterlimit:4;stroke-dasharray:none;stroke-opacity:1"
       id="rect4541-8"
       width="0.21703261"
       height="12.370858"
       x="902.55811"
       y="524.9165"
       transform="matrix(0.8932834,0.4494939,-0.4494939,0.8932834,0,0)" />
    <rect
       style="opacity:1;fill:none;fill-opacity:1;stroke:#000000;stroke-width:1.22573078;stroke-linejoin:round;stroke-miterlimit:4;stroke-dasharray:none;stroke-opacity:1"
       id="rect4545-7"
       width="5.4217386"
       height="8.9838343"
       x="914.72778"
       y="529.45856"
       ry="0"
       transform="matrix(0.8932834,0.4494939,-0.4494939,0.8932834,0,0)" />
    <rect
       style="opacity:1;fill:none;fill-opacity:1;stroke:#000000;stroke-width:1.35068631;stroke-linejoin:round;stroke-miterlimit:4;stroke-dasharray:none;stroke-opacity:1"
       id="rect4545-9-6"
       width="6.6689672"
       height="13.632585"
       x="922.98706"
       y="529.31067"
       ry="0.065780737"
       transform="matrix(0.8932834,0.4494939,-0.4494939,0.8932834,0,0)" />
    <rect
       style="opacity:1;fill:#ffffff;fill-opacity:1;stroke:none;stroke-width:1.69500005;stroke-linejoin:round;stroke-miterlimit:4;stroke-dasharray:none;stroke-opacity:1"
       id="rect4606"
       width="5.3183522"
       height="7.8108273"
       x="-928.9845"
       y="523.73712"
       transform="matrix(-0.8932834,-0.4494939,-0.4494939,0.8932834,0,0)" />
    <rect
       style="opacity:1;fill:#ffffff;fill-opacity:1;stroke:none;stroke-width:1.69500005;stroke-linejoin:round;stroke-miterlimit:4;stroke-dasharray:none;stroke-opacity:1"
       id="rect4608"
       width="4.1976652"
       height="4.5728803"
       x="-919.5343"
       y="526.17133"
       transform="matrix(-0.8932834,-0.4494939,-0.4494939,0.8932834,0,0)" />
    <path
       style="opacity:1;fill:#ffffff;fill-opacity:1;stroke:none;stroke-width:1.69500005;stroke-linejoin:round;stroke-miterlimit:4;stroke-dasharray:none;stroke-opacity:1"
       d="m 628.08381,917.0127 c 4.76654,1.67829 10.19601,0.45683 13.78261,-3.10065 1.16431,-1.15485 1.55898,-1.71334 2.43452,-3.44502 0.87674,-1.7347 1.08805,-2.35074 1.3312,-3.88677 0.80554,-5.08843 -1.44967,-10.26735 -5.71838,-13.13184 -0.95676,-0.64203 -2.93004,-1.54437 -3.93473,-1.79919 -2.64325,-0.6705 -5.07696,-0.58908 -7.62961,0.25529 -2.58172,0.85397 -4.57558,2.24351 -6.31128,4.39836 -0.48349,0.60025 -0.67848,0.92632 -1.33976,2.24049 -0.87372,1.73635 -1.10848,2.46537 -1.33268,4.13837 -0.67652,5.04826 1.58167,10.06664 5.78783,12.86233 0.68888,0.45788 2.17489,1.20265 2.93024,1.46871 l 0,0 z m 7.41829,-13.28518 c -0.196,-0.15504 -0.56983,-0.5573 -0.83066,-0.89396 -1.20448,-1.55467 -1.34152,-3.73947 -0.34292,-5.46694 0.50451,-0.8727 1.06136,-1.42785 1.89976,-1.89386 1.58662,-0.8819 3.383,-0.86135 4.96124,0.0568 1.12369,0.65361 1.82455,1.52762 2.22919,2.77971 0.66745,2.06539 -0.0585,4.2729 -1.83964,5.59387 -1.06328,0.78858 -2.71941,1.12325 -4.03895,0.81619 -0.55917,-0.13012 -1.57116,-0.62257 -2.03802,-0.99172 z"
       id="path4610"
       inkscape:connector-curvature="0" />
    <path
       style="opacity:1;fill:#000000;fill-opacity:1;stroke:none;stroke-width:1.69500005;stroke-linejoin:round;stroke-miterlimit:4;stroke-dasharray:none;stroke-opacity:1"
       d="m 627.81002,917.3369 c 2.86983,1.02025 5.92531,1.05168 8.92192,0.0918 2.64797,-0.84819 4.7903,-2.30694 6.53955,-4.45289 0.49108,-0.60247 0.68877,-0.93435 1.40863,-2.36494 0.71894,-1.42875 0.86868,-1.78755 1.0588,-2.53699 1.02916,-4.05692 0.222,-8.28187 -2.22823,-11.66346 -1.28493,-1.77336 -2.62349,-2.92567 -4.70729,-4.05241 -1.18579,-0.64116 -1.54724,-0.8009 -2.42363,-1.07155 -4.95089,-1.52856 -10.30504,-0.26131 -13.91376,3.29321 -1.15564,1.13826 -1.65241,1.84215 -2.52757,3.58136 -0.88191,1.75263 -1.13007,2.5128 -1.3667,4.1864 -0.72889,5.15515 1.6997,10.50074 6.09294,13.41119 0.76943,0.50976 2.29992,1.27769 3.14549,1.57798 l -10e-6,10e-6 z m 7.16888,-14.13636 c -0.91466,-0.93479 -1.50811,-2.41833 -1.49063,-3.72639 0.0445,-3.3208 3.25526,-5.7245 6.49572,-4.86282 3.21051,0.85374 4.86975,4.41458 3.40937,7.31679 -0.41006,0.81493 -0.76999,1.24479 -1.52792,1.82474 -1.15865,0.88658 -2.83225,1.24121 -4.30232,0.91163 -0.70345,-0.1577 -2.05556,-0.92368 -2.58422,-1.46395 z"
       id="path4612"
       inkscape:connector-curvature="0" />
    <circle
       style="opacity:1;fill:#000000;fill-opacity:1;stroke:#000000;stroke-width:3.32693338;stroke-linejoin:round;stroke-miterlimit:4;stroke-dasharray:none;stroke-opacity:1"
       id="path4537-3-2"
       cx="-341.43771"
       cy="831.60046"
       r="14.992258"
       transform="matrix(-0.94439043,-0.32882628,-0.32882628,0.94439043,0,0)" />
    <rect
       style="opacity:1;fill:none;fill-opacity:1;stroke:#000000;stroke-width:1.26411033;stroke-linejoin:round;stroke-miterlimit:4;stroke-dasharray:none;stroke-opacity:1"
       id="rect4539-0-4"
       width="45.894691"
       height="11.439783"
       x="-401.76102"
       y="825.89923"
       ry="1.2771224"
       transform="matrix(-0.94439043,-0.32882628,-0.32882628,0.94439043,0,0)" />
    <rect
       style="opacity:1;fill:none;fill-opacity:1;stroke:#000000;stroke-width:0;stroke-linejoin:round;stroke-miterlimit:4;stroke-dasharray:none;stroke-opacity:1"
       id="rect4541-8-0"
       width="0.21703261"
       height="12.370858"
       x="-410.45419"
       y="832.87134"
       transform="matrix(-0.94439043,-0.32882628,-0.32882628,0.94439043,0,0)" />
    <rect
       style="opacity:1;fill:none;fill-opacity:1;stroke:#000000;stroke-width:1.22573078;stroke-linejoin:round;stroke-miterlimit:4;stroke-dasharray:none;stroke-opacity:1"
       id="rect4545-7-0"
       width="5.4217386"
       height="8.9838343"
       x="-398.28445"
       y="837.41339"
       ry="0"
       transform="matrix(-0.94439043,-0.32882628,-0.32882628,0.94439043,0,0)" />
    <rect
       style="opacity:1;fill:none;fill-opacity:1;stroke:#000000;stroke-width:1.35068631;stroke-linejoin:round;stroke-miterlimit:4;stroke-dasharray:none;stroke-opacity:1"
       id="rect4545-9-6-6"
       width="6.6689672"
       height="13.632585"
       x="-390.02524"
       y="837.2655"
       ry="0.065780737"
       transform="matrix(-0.94439043,-0.32882628,-0.32882628,0.94439043,0,0)" />
    <rect
       style="opacity:1;fill:#ffffff;fill-opacity:1;stroke:none;stroke-width:1.69500005;stroke-linejoin:round;stroke-miterlimit:4;stroke-dasharray:none;stroke-opacity:1"
       id="rect4606-8"
       width="5.3183522"
       height="7.8108273"
       x="384.0278"
       y="831.69196"
       transform="matrix(0.94439043,0.32882628,-0.32882628,0.94439043,0,0)" />
    <rect
       style="opacity:1;fill:#ffffff;fill-opacity:1;stroke:none;stroke-width:1.69500005;stroke-linejoin:round;stroke-miterlimit:4;stroke-dasharray:none;stroke-opacity:1"
       id="rect4608-5"
       width="4.1976652"
       height="4.5728803"
       x="393.47806"
       y="834.12616"
       transform="matrix(0.94439043,0.32882628,-0.32882628,0.94439043,0,0)" />
    <path
       style="opacity:1;fill:#ffffff;fill-opacity:1;stroke:none;stroke-width:1.69500005;stroke-linejoin:round;stroke-miterlimit:4;stroke-dasharray:none;stroke-opacity:1"
       d="m 43.082419,909.53026 c -4.521965,-2.25572 -7.422548,-7.00524 -7.362948,-12.05655 0.01892,-1.6398 0.145775,-2.31187 0.780306,-4.14562 0.635915,-1.83671 0.931353,-2.41712 1.865381,-3.66053 3.094185,-4.11911 8.383031,-6.10286 13.410591,-5.03005 1.126847,0.24044 3.147945,1.02987 4.030027,1.57417 2.320767,1.43193 3.95566,3.23656 5.125354,5.65746 1.183015,2.44849 1.572334,4.84738 1.232355,7.59336 -0.0947,0.76492 -0.193232,1.13185 -0.67699,2.52121 -0.639167,1.83569 -0.999416,2.51156 -2.045025,3.83667 -3.1551,3.99848 -8.330714,5.86838 -13.265339,4.79264 -0.808197,-0.17619 -2.377074,-0.72527 -3.093738,-1.08268 l 0,0 z m 4.38018,-14.57192 c 0.247741,0.0328 0.796759,0.0215 1.220057,-0.0254 1.954696,-0.21665 3.619234,-1.63841 4.165138,-3.55761 0.275761,-0.96959 0.287036,-1.75582 0.03836,-2.68223 -0.470565,-1.75318 -1.735258,-3.02912 -3.4928,-3.52386 -1.251319,-0.35228 -2.36671,-0.24752 -3.54755,0.33307 -1.947849,0.95772 -3.028212,3.01512 -2.737676,5.21351 0.173442,1.31238 1.085419,2.73474 2.2241,3.46882 0.482529,0.31108 1.540367,0.69527 2.130348,0.77373 z"
       id="path4610-4"
       inkscape:connector-curvature="0" />
    <path
       style="opacity:1;fill:#ffffff;fill-opacity:1;stroke:none;stroke-width:1.69500005;stroke-linejoin:round;stroke-miterlimit:4;stroke-dasharray:none;stroke-opacity:1"
       d="m 43.040071,909.95249 c -2.729609,-1.35132 -4.878215,-3.524 -6.273856,-6.34413 -1.233285,-2.49203 -1.676201,-5.04572 -1.351969,-7.79524 0.09099,-0.77192 0.191787,-1.14483 0.718384,-2.65727 0.525995,-1.51049 0.67951,-1.8677 1.085453,-2.52571 2.197715,-3.56198 5.793839,-5.92199 9.927492,-6.51508 2.167742,-0.31103 3.926746,-0.15141 6.185918,0.56125 1.285583,0.40556 1.651792,0.55401 2.455981,0.99514 4.542709,2.49233 7.357969,7.2196 7.315956,12.28475 -0.01342,1.62202 -0.173348,2.46857 -0.813572,4.3073 -0.645161,1.8529 -1.018457,2.56007 -2.055852,3.89451 -3.195445,4.11049 -8.724635,6.08568 -13.871833,4.95542 -0.901502,-0.19795 -2.517973,-0.76287 -3.321999,-1.16124 l 0,10e-6 z m 5.165079,-14.98504 c 1.307815,0.007 2.786268,-0.59951 3.713587,-1.52222 2.354197,-2.34254 1.846504,-6.32116 -1.0271,-8.049 -2.847055,-1.71186 -6.559077,-0.42594 -7.627407,2.64232 -0.299979,0.86154 -0.358281,1.41916 -0.247457,2.36706 0.169426,1.44907 1.07921,2.89785 2.338811,3.72439 0.602727,0.3955 2.093685,0.83367 2.849566,0.83745 z"
       id="path4612-9"
       inkscape:connector-curvature="0" />
    <text
       xml:space="preserve"
       style="font-style:normal;font-weight:normal;font-size:34.40123367px;line-height:125%;font-family:sans-serif;letter-spacing:0px;word-spacing:0px;fill:#000000;fill-opacity:1;stroke:none;stroke-width:1px;stroke-linecap:butt;stroke-linejoin:miter;stroke-opacity:1"
       x="262.82361"
       y="413.50925"
       id="text4653"
       sodipodi:linespacing="125%"><tspan
         sodipodi:role="line"
         id="tspan4655"
         x="262.82361"
         y="413.50925">Fred</tspan></text>
    <text
       xml:space="preserve"
       style="font-style:normal;font-weight:normal;font-size:34.40123367px;line-height:125%;font-family:sans-serif;letter-spacing:0px;word-spacing:0px;fill:#000000;fill-opacity:1;stroke:none;stroke-width:1px;stroke-linecap:butt;stroke-linejoin:miter;stroke-opacity:1"
       x="546.36487"
       y="410.66583"
       id="text4657"
       sodipodi:linespacing="125%"><tspan
         sodipodi:role="line"
         id="tspan4659"
         x="546.36487"
         y="410.66583">Katy</tspan></text>
    <path
       style="opacity:1;fill:#000000;fill-opacity:1;stroke:none;stroke-width:1.69500005;stroke-linejoin:round;stroke-miterlimit:4;stroke-dasharray:none;stroke-opacity:1"
       d="m 170.6664,879.53781 c 10.06222,0 18.29496,0.0737 18.29496,0.16383 0,0.14837 -6.64795,19.35347 -14.96485,43.23124 -1.76554,5.06871 -3.27324,9.21586 -3.35044,9.21586 -0.13694,0 -18.27464,-52.01993 -18.27464,-52.41284 0,-0.10887 8.23274,-0.1979 18.29497,-0.1979 z"
       id="path4923-6"
       inkscape:connector-curvature="0" />
    <path
       style="opacity:1;fill:#000000;fill-opacity:1;stroke:none;stroke-width:1.69500005;stroke-linejoin:round;stroke-miterlimit:4;stroke-dasharray:none;stroke-opacity:1"
       d="m 309.84611,998.8264 c 0,-10.06222 0.0737,-18.29496 0.16383,-18.29496 0.14837,0 19.35347,6.64795 43.23124,14.96485 5.06871,1.76554 9.21586,3.27324 9.21586,3.35044 0,0.13694 -52.01993,18.27467 -52.41284,18.27467 -0.10887,0 -0.1979,-8.2328 -0.1979,-18.295 z"
       id="path4923-6-7"
       inkscape:connector-curvature="0" />
    <path
       style="opacity:1;fill:#000000;fill-opacity:1;stroke:none;stroke-width:1.69500005;stroke-linejoin:round;stroke-miterlimit:4;stroke-dasharray:none;stroke-opacity:1"
       d="m 513.46601,933.16088 c 10.06222,0 18.29496,-0.0737 18.29496,-0.16383 0,-0.14837 -6.64795,-19.35347 -14.96485,-43.23124 -1.76554,-5.06871 -3.27324,-9.21586 -3.35044,-9.21586 -0.13694,0 -18.27464,52.01993 -18.27464,52.41284 0,0.10887 8.23274,0.1979 18.29497,0.1979 z"
       id="path4923-6-0"
       inkscape:connector-curvature="0" />
    <text
       xml:space="preserve"
       style="font-style:normal;font-weight:normal;font-size:40px;line-height:125%;font-family:sans-serif;letter-spacing:0px;word-spacing:0px;fill:#000000;fill-opacity:1;stroke:none;stroke-width:1px;stroke-linecap:butt;stroke-linejoin:miter;stroke-opacity:1"
       x="32.419418"
       y="947.73499"
       id="text4993"
       sodipodi:linespacing="125%"><tspan
         sodipodi:role="line"
         id="tspan4995"
         x="32.419418"
         y="947.73499">K</tspan></text>
    <text
       xml:space="preserve"
       style="font-style:normal;font-weight:normal;font-size:40px;line-height:125%;font-family:sans-serif;letter-spacing:0px;word-spacing:0px;fill:#000000;fill-opacity:1;stroke:none;stroke-width:1px;stroke-linecap:butt;stroke-linejoin:miter;stroke-opacity:1"
       x="617.27667"
       y="953.47626"
       id="text4993-4"
       sodipodi:linespacing="125%"><tspan
         sodipodi:role="line"
         id="tspan4995-9"
         x="617.27667"
         y="953.47626">K’</tspan></text>
  </g>
</svg>
