<?xml version="1.0" encoding="UTF-8" standalone="no"?>
<!-- Created with Inkscape (http://www.inkscape.org/) -->

<svg
   xmlns:dc="http://purl.org/dc/elements/1.1/"
   xmlns:cc="http://creativecommons.org/ns#"
   xmlns:rdf="http://www.w3.org/1999/02/22-rdf-syntax-ns#"
   xmlns:svg="http://www.w3.org/2000/svg"
   xmlns="http://www.w3.org/2000/svg"
   xmlns:sodipodi="http://sodipodi.sourceforge.net/DTD/sodipodi-0.dtd"
   xmlns:inkscape="http://www.inkscape.org/namespaces/inkscape"
   width="297mm"
   height="210mm"
   viewBox="0 0 1052.3622 744.09448"
   id="svg2"
   version="1.1"
   inkscape:version="0.91 r13725"
   sodipodi:docname="cleparcoeur.svg">
  <defs
     id="defs4" />
  <sodipodi:namedview
     id="base"
     pagecolor="#ffffff"
     bordercolor="#666666"
     borderopacity="1.0"
     inkscape:pageopacity="0.0"
     inkscape:pageshadow="2"
     inkscape:zoom="0.7"
     inkscape:cx="655.6153"
     inkscape:cy="371.292"
     inkscape:document-units="px"
     inkscape:current-layer="layer1"
     showgrid="false"
     borderlayer="true"
     inkscape:window-width="1920"
     inkscape:window-height="1028"
     inkscape:window-x="0"
     inkscape:window-y="0"
     inkscape:window-maximized="1" />
  <metadata
     id="metadata7">
    <rdf:RDF>
      <cc:Work
         rdf:about="">
        <dc:format>image/svg+xml</dc:format>
        <dc:type
           rdf:resource="http://purl.org/dc/dcmitype/StillImage" />
        <dc:title></dc:title>
      </cc:Work>
    </rdf:RDF>
  </metadata>
  <g
     inkscape:label="Calque 1"
     inkscape:groupmode="layer"
     id="layer1"
     transform="translate(0,-308.26772)">
    <rect
       style="opacity:1;fill:#ffffff;fill-opacity:1;stroke:none;stroke-width:1.00699997;stroke-miterlimit:4;stroke-dasharray:none;stroke-opacity:1"
       id="rect4200"
       width="1074.2856"
       height="771.42859"
       x="-10.000002"
       y="300.93362" />
    <path
       style="fill:#000000"
       d="m 277.97625,961.15551 c -2.51385,-0.30238 -9.56567,-1.15871 -15.67072,-1.90298 -29.44697,-3.5899 -69.47052,-14.70171 -87.97146,-24.42368 -29.41189,-15.45551 -38.62966,-41.54926 -21.56046,-61.03344 4.12283,-4.70608 14.71827,-12.40852 17.06917,-12.40852 3.19252,0 0.20279,5.29874 -5.31333,9.4169 -7.5856,5.66324 -13.23921,15.86542 -13.19611,23.81331 0.0692,12.76953 10.89402,25.60194 29.03244,34.41663 32.00376,15.55281 89.0095,26.53858 127.64601,24.59912 30.1171,-1.51181 48.10565,-7.77074 55.15597,-19.19097 5.16949,-8.37365 7.1313,-19.91475 5.00229,-29.42813 -1.38311,-6.1804 -2.96401,-8.81639 -9.5032,-15.84552 -9.17399,-9.86135 -8.87584,-12.93876 0.79976,-8.25489 10.47497,5.07085 16.23486,14.26653 17.62518,28.13865 0.74164,7.39987 0.98958,7.85878 4.46091,8.25672 8.20231,0.94029 14.75172,-7.85709 13.52986,-18.17376 -0.95518,-8.06507 -7.21703,-20.31595 -13.12583,-25.6798 -4.47855,-4.06552 -4.58937,-4.37033 -2.48304,-6.83035 2.08291,-2.43265 2.38692,-2.45553 5.50264,-0.41403 4.71738,3.09095 7.41702,6.51485 12.15614,15.41747 3.69508,6.9413 4.17556,9.05322 4.21084,18.50862 0.0445,11.91749 -1.59976,15.43261 -9.87443,21.10996 -3.48022,2.38782 -5.6606,2.92105 -10.0006,2.44573 -4.50127,-0.49299 -5.55246,-0.20632 -5.5628,1.51705 -0.0285,4.74336 -6.47419,15.57739 -12.33933,20.74009 -11.50407,10.12629 -28.7097,14.49035 -60.12498,15.25021 -11.49187,0.27796 -22.95108,0.25799 -25.46492,-0.0444 z M 17.888414,953.50588 C 9.3436934,948.93997 6.8836518,944.85017 5.7805638,933.37685 l -0.9258783,-9.62837 7.2496665,-7.02176 c 5.767347,-5.58616 8.123831,-7.02178 11.525552,-7.02178 6.167604,0 19.962406,-4.20696 29.369016,-8.95661 4.468506,-2.25627 9.169725,-4.12187 10.44715,-4.14577 1.277425,-0.0239 3.732112,-1.21719 5.454846,-2.65178 3.096273,-2.57836 3.113641,-2.72429 1.502169,-12.68902 -2.907702,-17.98075 -2.97391,-20.86144 -0.687944,-29.92742 1.809054,-7.17435 2.077545,-12.02262 1.39613,-25.20656 -0.731822,-14.15694 -0.492322,-17.53649 1.80383,-25.46077 3.464666,-11.9565 3.342434,-15.80047 -0.78902,-24.82499 -3.051481,-6.66516 -3.342434,-8.52231 -2.595202,-16.56298 1.039491,-11.18395 -4.988512,-53.12277 -7.946364,-55.28558 -1.546177,-1.13063 -1.60651,-3.63545 -0.377403,-15.67396 1.759826,-17.23716 0.06921,-32.88911 -4.702652,-43.54221 -1.727958,-3.85757 -3.141848,-7.85672 -3.141848,-8.88703 0,-3.89956 13.509207,-8.34095 30.98898,-10.18816 17.123918,-1.80962 27.305048,-3.85581 42.141038,-8.46943 4.66857,-1.4518 9.22288,-2.64413 10.12068,-2.64962 1.20769,-0.008 1.63236,3.73324 1.63236,14.37973 l 0,14.3897 3.081,-0.77326 c 4.6781,-1.17415 9.75672,3.97779 11.07528,11.23524 2.01134,11.07058 -2.07859,13.45679 -4.36573,2.5472 -1.47697,-7.0446 -3.10476,-9.34715 -6.28775,-8.89402 -2.18123,0.31053 -2.9487,1.44031 -3.27139,4.8153 -0.39699,4.15254 -0.22566,4.36043 2.93826,3.56633 4.05976,-1.01894 4.85231,2.47447 0.84961,3.74488 -4.13863,1.31356 -11.61396,10.61264 -13.1668,16.37896 -4.28672,15.91995 9.96345,17.15378 16.60209,1.43746 1.35617,-3.21042 2.25736,-4.02401 3.30116,-2.98017 2.40285,2.40278 -1.10152,11.24587 -6.24661,15.76337 -3.2488,2.85247 -5.92914,4.03879 -9.12519,4.03879 -4.83441,0 -9.74875,-3.67854 -9.74875,-7.2972 0,-1.69571 -0.952,-1.91279 -5.22357,-1.1911 -3.43398,0.58017 -5.22358,0.39579 -5.22358,-0.53816 0,-0.78138 1.32222,-1.42968 2.93826,-1.44068 4.31859,-0.0294 5.76565,-1.41053 6.8199,-6.50947 1.26867,-6.13557 6.42095,-14.8719 10.54065,-17.87291 3.22621,-2.35018 3.27648,-2.58882 1.32927,-6.32307 -1.46339,-2.80649 -2.02584,-7.80885 -2.03158,-18.07138 -0.0131,-12.89879 -0.21613,-14.12936 -2.29341,-13.51728 -17.00143,5.0097 -30.13427,7.72917 -44.726844,9.26186 -9.696258,1.01841 -19.218308,2.58214 -21.160172,3.47494 -3.510506,1.61404 -3.517949,1.6464 -1.305893,5.68543 1.88349,3.43908 2.22472,8.01812 2.22472,29.85398 0,14.18553 0.440739,25.79165 0.97942,25.79139 0.538681,-2.5e-4 0.97942,2.51191 0.97942,5.58259 0,3.07067 1.46913,13.95847 3.264733,24.19512 2.005199,11.43141 3.264733,23.58637 3.264733,31.50525 0,10.99848 0.477826,13.91971 3.251935,19.87876 3.859306,8.29018 4.053101,12.58803 0.996527,22.09284 -1.779279,5.53259 -2.282048,11.6895 -2.285313,27.98725 0,13.63566 -0.663655,23.73671 -1.902164,29.07632 -1.576736,6.79815 -1.617218,9.22775 -0.23924,14.36482 0.912167,3.40055 1.995797,12.10286 2.407937,19.33848 0.676061,11.8659 0.413576,14.17041 -2.677473,23.50607 -2.625498,7.92955 -3.35719,12.52483 -3.128006,19.64715 l 0.298919,9.29674 4.703697,-1.65955 c 2.587105,-0.91274 6.997106,-2.81393 9.800206,-4.22486 2.80323,-1.41093 9.571022,-3.54777 15.039838,-4.74853 10.61326,-2.33031 20.85799,-7.86166 23.41702,-12.64321 1.0532,-1.9678 1.29087,-6.50567 0.74005,-14.12601 -0.46294,-6.40382 -0.23193,-13.4709 0.5375,-16.45044 0.74201,-2.87296 1.86848,-14.03835 2.50327,-24.81197 0.6348,-10.77362 1.83544,-21.35135 2.6682,-23.50608 0.83277,-2.15472 2.0227,-10.16468 2.64431,-17.79991 1.10178,-13.53331 2.79239,-21.36871 7.92429,-36.72632 3.64801,-10.91722 3.30534,-15.04795 -1.67481,-20.18612 -6.04354,-6.23535 -7.14049,-12.35984 -5.91518,-33.02383 1.99463,-33.63821 2.34539,-36.56501 4.38271,-36.56501 1.56237,0 1.77576,2.0022 1.21775,11.42656 -1.64046,27.70932 -1.97164,44.35712 -0.95435,47.99158 0.90394,3.23025 1.77863,3.91768 4.98447,3.91768 2.82895,0 5.01397,1.28127 8.02053,4.70299 6.28683,7.15483 18.33122,12.02831 29.97986,12.13062 5.21511,0.0458 9.48201,0.27237 9.48201,0.50346 0,1.22449 -11.66835,5.46276 -15.10722,5.48738 -5.84323,0.0418 -17.34514,-3.66094 -22.69251,-7.30531 l -4.6418,-3.16347 -0.78118,5.57519 c -0.42964,3.06637 -2.57418,11.74556 -4.7656,19.28709 -2.45142,8.43636 -4.27105,18.23376 -4.72968,25.46492 -0.40992,6.46417 -1.63746,14.98512 -2.72788,18.93545 -1.09029,3.95033 -1.9894,12.24739 -1.99789,18.43792 -0.0131,6.19054 -0.94599,16.47444 -2.08329,22.85313 -1.41715,7.94904 -1.80918,14.95508 -1.24595,22.26984 1.52241,19.77237 -4.87033,26.32823 -32.598362,33.42995 -4.309448,1.10375 -14.299531,4.72113 -22.200185,8.03863 -8.673351,3.64198 -15.646302,5.81048 -17.599135,5.47318 -1.778887,-0.30724 -5.598625,0.65801 -8.488305,2.14501 -3.544847,1.82415 -8.439988,2.8528 -15.0482,3.16215 -8.464669,0.39629 -10.62109,0.0167 -15.885799,-2.79653 z m 35.474198,-8.37767 c 9.940463,-4.84578 12.493745,-6.6675 12.847381,-9.16626 0.364997,-2.57867 0.02612,-2.95015 -1.95884,-2.14579 -1.320127,0.53502 -3.869366,1.42172 -5.664969,1.97045 -1.795603,0.54871 -8.224515,3.40985 -14.286341,6.35808 l -11.021608,5.36041 -6.60795,-3.79484 c -5.947691,-3.41568 -6.730051,-4.40308 -7.829352,-9.88227 -0.877952,-4.3761 -0.780924,-6.69519 0.345409,-8.2493 3.661332,-5.05241 6.74311,-10.06565 6.74768,-10.97665 0.01437,-2.81015 -5.694347,-0.28429 -10.990788,4.86333 l -6.0118111,5.84275 0.8565354,7.54266 c 1.0419717,9.17623 4.3477107,14.22506 11.4511167,17.48891 7.958375,3.65675 16.911056,2.20433 32.123537,-5.21148 z m -40.276489,-9.3054 c 0,-1.79561 0.296438,-2.53017 0.658692,-1.63237 0.362255,0.8978 0.362255,2.36693 0,3.26473 -0.362254,0.8978 -0.658692,0.16324 -0.658692,-1.63236 z m 29.058997,1.57817 c 1.501124,-1.32104 4.396158,-3.43881 6.433744,-4.70615 2.037454,-1.26736 3.428492,-2.5802 3.09131,-2.91744 -0.337182,-0.33723 -2.842799,0.89993 -5.567937,2.74924 -7.162563,4.86065 -10.619785,5.41197 -14.72708,2.34846 -1.912611,-1.42659 -3.675828,-3.60365 -3.918332,-4.83789 -0.689643,-3.50921 3.262643,-6.83349 8.35184,-7.0248 5.461898,-0.20534 7.106801,-1.03635 7.106801,-3.59033 0,-1.40471 -1.738013,-1.87131 -6.855939,-1.84049 -6.735406,0.0406 -6.92019,0.14711 -10.510743,6.05937 -4.543725,7.48188 -3.907885,12.24556 2.111107,15.81578 4.689985,2.78184 9.814963,2.05449 14.485229,-2.05575 z m -0.771261,-10.54261 c 0.484748,-3.23924 -1.340891,-3.65065 -3.681966,-0.82976 -0.894145,1.07736 -2.43523,1.95884 -3.424574,1.95884 -2.246006,0 -2.380513,3.48135 -0.166632,4.31388 2.479891,0.93257 6.803312,-2.30294 7.273172,-5.44296 z m 22.109429,3.39235 c 0.897801,-0.70244 1.632366,-2.89821 1.632366,-4.87949 0,-1.98126 1.46913,-7.50541 3.264733,-12.27589 1.795603,-4.77048 3.264733,-10.43669 3.264733,-12.59157 0,-3.73576 -0.136596,-3.8327 -2.938259,-2.08438 -1.616043,1.00847 -4.701216,2.24313 -6.855944,2.74368 -2.154723,0.50056 -5.834078,2.09156 -8.176328,3.53556 l -4.258648,2.62546 4.079088,3.81043 c 3.928257,3.66954 4.060414,4.14075 3.57423,12.74405 -0.476259,8.42838 -0.355203,8.8973 2.1384,8.29147 1.453851,-0.35318 3.377827,-1.21687 4.275629,-1.91932 z m -12.40599,-3.06769 c 3.830055,-1.35099 3.076162,-10.137 -1.155584,-13.46563 -3.78683,-2.97871 -8.935314,-3.56181 -10.4081,-1.17875 -0.623172,1.00827 -0.248511,1.26081 1.101913,0.74264 1.125288,-0.43185 3.068457,-0.0376 4.317936,0.87608 1.822374,1.33248 2.14297,3.00375 1.620091,8.44502 -0.451578,4.69933 -0.207768,6.56914 0.79333,6.08525 0.794767,-0.38418 2.473492,-1.06126 3.730414,-1.50461 z m 23.832555,6.02799 c 0.443873,-0.71824 1.800827,-1.2969 3.015308,-1.2859 1.903078,0.0172 1.937553,0.19496 0.249425,1.2859 -2.557461,1.65274 -4.286202,1.65274 -3.264733,0 z m 2.611787,-8.86695 c 1.963541,-2.07044 11.100092,-3.49073 11.100092,-1.72553 0,0.79818 -0.808087,1.45123 -1.795603,1.45123 -0.987517,0 -3.778863,0.37154 -6.202993,0.82563 -3.068065,0.57473 -4.010529,0.40719 -3.101496,-0.55133 z m 33.30028,-6.66405 c 0,-1.22155 3.10267,-2.75151 5.57995,-2.75151 0.79685,0 0.30793,0.86279 -1.08624,1.91732 -2.92155,2.20976 -4.49371,2.5016 -4.49371,0.83419 z m -29.481849,-3.89677 c 0.809001,-1.3091 12.530699,-4.4882 13.387756,-3.63104 0.571851,0.57178 -10.823765,4.7763 -12.945319,4.7763 -0.632575,0 -0.831723,-0.51537 -0.442437,-1.14526 z m 29.481849,-9.30188 c 1.07736,-0.69625 3.13414,-1.2659 4.57062,-1.2659 2.16269,0 2.275,0.21764 0.65295,1.2659 -1.07736,0.69625 -3.13414,1.26589 -4.57063,1.26589 -2.16269,0 -2.27499,-0.21764 -0.65294,-1.26589 z m -26.117868,-5.85164 c 0,-2.09543 2.232947,-2.7642 12.643136,-3.78669 3.721662,-0.36553 9.304362,-1.89925 12.405982,-3.40828 5.57408,-2.71187 5.60359,-2.71266 2.55211,-0.0687 -2.75269,2.38527 -22.036947,9.19762 -26.036245,9.19762 -0.860714,0 -1.564983,-0.87029 -1.564983,-1.93396 z m -2.611786,-5.95277 c 0,-0.72555 1.616043,-1.88054 3.591206,-2.56667 1.975164,-0.68613 5.286909,-2.15906 7.359231,-3.27318 3.768024,-2.02564 6.278865,-1.64965 3.980232,0.59602 -2.172745,2.12269 -14.930669,6.60342 -14.930669,5.24383 z m 27.423754,-5.79161 c 0,-1.15636 7.69315,-4.60468 10.05577,-4.50732 1.35225,0.0558 0.13203,1.12372 -2.87335,2.51494 -5.49925,2.54572 -7.18242,3.01262 -7.18242,1.99238 z m -27.423754,-8.35361 c 0,-0.82967 2.140881,-1.48193 4.897099,-1.49195 2.693405,-0.0104 6.36623,-0.38358 8.161833,-0.83062 2.294193,-0.57114 2.876491,-0.39567 1.95884,0.59025 -1.926715,2.06996 -15.017772,3.58004 -15.017772,1.73232 z m 31.341434,-6.6977 c -1.62205,-1.04826 -1.50974,-1.2659 0.65295,-1.2659 1.43648,0 3.49326,0.56965 4.57063,1.2659 1.62205,1.04825 1.50974,1.26589 -0.65295,1.26589 -1.43648,0 -3.49327,-0.56964 -4.57063,-1.26589 z m -27.423754,-6.5525 c 0,-0.53803 1.322216,-1.33259 2.938259,-1.76566 3.87785,-1.03925 9.469032,-1.04207 8.431239,-0.004 -1.289962,1.28995 -11.369498,2.85906 -11.369498,1.76992 z m 22.200184,-2.32641 c 0,-1.3031 9.08275,-4.67385 10.03305,-3.72346 0.38302,0.38298 -1.49564,1.61223 -4.17481,2.73167 -5.62422,2.34992 -5.85824,2.38954 -5.85824,0.99179 z m -29.8441,-7.35409 c 1.175304,-1.26494 14.262835,-4.6548 17.438115,-4.51668 1.436482,0.0626 0.01306,0.93002 -3.171101,1.92784 -7.397232,2.32069 -15.360438,3.76567 -14.267014,2.58884 z m 31.14999,-5.89607 c 0,-1.39254 7.68074,-3.27289 8.79937,-2.15422 1.11706,1.11704 0.23546,1.60392 -4.55521,2.51582 -2.33429,0.44433 -4.24416,0.28161 -4.24416,-0.3616 z m -27.423754,-4.98735 c 0,-1.26679 9.548299,-4.22502 13.637181,-4.22502 4.042262,0 1.918227,2.29726 -2.863562,3.09714 -2.693405,0.45053 -6.219317,1.18183 -7.835359,1.6251 -1.622573,0.44506 -2.93826,0.22242 -2.93826,-0.49722 z m 30.035544,-5.51613 c 0,-1.14733 4.60784,-2.58187 8.37952,-2.60874 1.37655,-0.0104 2.15773,0.32738 1.7358,0.74931 -1.31347,1.31342 -10.11532,2.93143 -10.11532,1.85943 z m -29.551058,-6.27175 c 0.502247,-0.81247 3.096142,-1.84513 5.764343,-2.29479 2.668201,-0.44965 5.953176,-1.12302 7.300074,-1.49637 1.399134,-0.38785 2.112543,-0.13463 1.66423,0.59076 -0.431597,0.69826 -3.00264,1.58479 -5.713544,1.97007 -2.710903,0.38526 -6.053729,1.15208 -7.428442,1.70403 -1.717903,0.68968 -2.214012,0.54154 -1.586661,-0.4737 z m 28.801738,-4.03425 c 0.39085,-0.63249 2.04163,-1.43839 3.66825,-1.79091 1.62662,-0.35252 3.98598,-1.0732 5.2429,-1.60153 1.30132,-0.54701 2.28532,-0.39319 2.28532,0.35727 0,0.72482 -1.85059,1.96299 -4.11252,2.75149 -4.95835,1.72846 -8.05345,1.85241 -7.08395,0.28368 z m -29.286224,-6.27298 c 0,-1.32424 11.739588,-4.77882 12.762755,-3.75566 0.362125,0.36211 -0.918173,1.25779 -2.845019,1.99039 -6.039886,2.29638 -9.917736,2.98659 -9.917736,1.76527 z M 316.08168,814.64254 C 312.53465,802.80365 302.801,736.30391 302.79355,723.85889 l -0.005,-8.89752 4.24416,0.40922 c 4.03573,0.38911 4.2619,0.6978 4.60552,6.28573 0.19874,3.23209 2.40243,20.03277 4.8971,37.33485 4.33453,30.06286 5.49254,47.66125 3.71954,56.52622 -1.08361,5.41806 -2.36814,5.14876 -4.17286,-0.87485 z m -198.25299,-0.95771 c 2.77633,-1.03928 5.56767,-1.56835 6.20299,-1.17572 2.55877,1.58141 0.8389,2.53242 -5.04898,2.79195 l -6.20194,0.27336 z m -38.348211,-4.36395 c 0,-0.6249 2.662978,-1.88175 5.917656,-2.79301 4.532755,-1.2691 6.595544,-1.30296 8.814779,-0.1447 2.737282,1.4287 2.688573,1.48272 -0.882001,0.97933 -2.07859,-0.29303 -5.732479,0.28336 -8.119913,1.28088 -5.081753,2.12329 -5.730521,2.2 -5.730521,0.6775 z M 119.6367,799.0883 c 1.61604,-0.31127 4.26047,-0.31127 5.87651,0 1.61605,0.31126 0.29383,0.56594 -2.93825,0.56594 -3.23209,0 -4.55431,-0.25468 -2.93826,-0.56594 z m -28.60442,-9.61743 c 3.121477,-1.38555 6.27991,-2.14557 7.018784,-1.68891 0.738875,0.45666 -0.933583,1.62295 -3.716441,2.59178 -7.528213,2.62078 -9.825541,1.99269 -3.302343,-0.90287 z m 28.93089,-3.66255 c 0,-0.62846 1.61604,-1.46879 3.59121,-1.86738 1.97516,-0.3986 4.61959,-1.12259 5.87652,-1.60885 3.60465,-1.39451 2.66193,1.4163 -1.04093,3.10337 -3.92878,1.7901 -8.4268,1.98913 -8.4268,0.37286 z M 86.242003,775.24085 c 1.204947,-0.75508 5.024685,-1.67641 8.488306,-2.0474 7.829481,-0.83863 3.883073,1.2533 -4.802684,2.54582 -4.355807,0.64817 -5.3095,0.5192 -3.685622,-0.49842 z m 36.332957,-4.19233 c -1.79561,-0.75464 -2.63282,-1.61364 -1.86038,-1.90889 0.77244,-0.29524 3.41687,0.33645 5.87652,1.40374 2.9841,1.29487 3.60309,1.93002 1.86037,1.90889 -1.43648,-0.0174 -4.08091,-0.64909 -5.87651,-1.40374 z M 86.662892,763.4449 c 1.436483,-0.61728 4.374742,-1.10504 6.529466,-1.08393 3.82026,0.0375 3.836453,0.0644 0.652947,1.08393 -1.795603,0.57505 -4.733863,1.06283 -6.529466,1.08393 -2.967773,0.0349 -3.027191,-0.0637 -0.652947,-1.08393 z m 31.667908,-7.45107 c 1.61605,-0.31127 4.26048,-0.31127 5.87652,0 1.61604,0.31126 0.29383,0.56593 -2.93826,0.56593 -3.23208,0 -4.5543,-0.25467 -2.93826,-0.56593 z m 270.54136,-2.46965 c -1.03966,-1.25272 -1.74779,-4.60723 -1.62769,-7.71059 0.19515,-5.04266 -0.15067,-5.66641 -4.21664,-7.60533 -5.05883,-2.41239 -6.60394,-6.44177 -4.54588,-11.85488 1.24913,-3.28545 1.14984,-3.58906 -0.90699,-2.77371 -5.89017,2.33492 -17.36175,3.66821 -21.45665,2.49381 -8.82981,-2.53236 -9.87211,-12.5692 -2.26378,-21.79941 6.70007,-8.12835 23.56387,-15.21519 36.28774,-15.24958 8.70142,-0.0235 23.48145,4.84174 27.78636,9.14666 4.84639,4.84638 4.75896,9.25914 -0.42827,21.61663 l -4.12414,9.82492 2.81825,5.01439 c 1.55004,2.75792 2.81824,6.12584 2.81824,7.48428 0,3.71577 -3.43597,7.87804 -7.07808,8.57428 -3.15668,0.60344 -3.18948,0.52924 -1.34352,-3.04046 2.40191,-4.64478 2.40799,-8.26433 0.0172,-10.24848 -3.4483,-2.86184 -3.71421,-8.6687 -0.70288,-15.34948 5.30597,-11.77156 6.53375,-16.16179 5.21101,-18.63335 -1.46605,-2.73933 -8.17551,-5.60591 -18.47762,-7.89444 -6.62093,-1.47079 -8.2762,-1.35461 -16.56332,1.16252 -10.34094,3.14096 -19.09203,9.13496 -22.92928,15.70522 -2.53559,4.34155 -2.53648,4.43169 -0.062,6.3094 1.93335,1.46708 5.00698,1.73916 13.37276,1.18374 9.8468,-0.65376 11.30552,-1.11022 15.60136,-4.88202 4.69749,-4.12444 4.74997,-4.13609 6.00149,-1.33132 1.01915,2.28402 0.60797,3.5157 -2.13288,6.38885 -6.24387,6.54528 -6.94321,13.35353 -1.37166,13.35353 3.20609,0 5.86444,5.99294 4.91153,11.07242 -0.78169,4.16676 -0.53997,4.85118 1.94265,5.5004 3.87385,1.01304 2.91647,4.87146 -1.33169,5.36692 -1.97041,0.22979 -4.12813,-0.52663 -5.20563,-1.82492 z M 84.051106,752.04499 c 1.472133,-1.46341 12.676436,-4.43565 13.524352,-3.58771 0.710014,0.70994 -5.866986,3.21428 -10.912566,4.15524 -2.598989,0.48469 -3.478116,0.29365 -2.611786,-0.56753 z m 28.729654,-8.18849 c 3.71121,-1.59478 11.43283,-1.59478 10.44714,0 -0.44387,0.71825 -3.56378,1.26459 -6.93299,1.21411 -4.62377,-0.0692 -5.48553,-0.367 -3.51415,-1.21411 z m 258.00869,-7.35852 c -3.17453,-4.03576 -3.61869,-9.61809 -0.76526,-9.61809 1.06773,0 2.83068,2.12856 3.91768,4.7301 3.55544,8.50937 1.81676,11.20529 -3.15242,4.88799 z m -284.779504,0.82906 -7.182413,-0.88019 7.431838,-0.21284 c 4.087446,-0.11714 7.795007,0.37479 8.23888,1.09303 0.443873,0.71824 0.331697,1.2101 -0.249425,1.09303 -0.580992,-0.11701 -4.288554,-0.60894 -8.23888,-1.09303 z m 23.506074,-5.18675 c 0,-0.99101 9.89345,-3.9545 13.20193,-3.9545 3.07786,0 0.0679,1.48655 -6.53743,3.22909 -3.66538,0.96695 -6.6645,1.29338 -6.6645,0.72541 z m -31.341434,-6.6655 c 2.513845,-0.73601 6.186669,-1.84523 8.161833,-2.46491 1.975163,-0.61967 3.591206,-0.65296 3.591206,-0.0739 0,1.48817 -2.621711,2.31854 -9.953648,3.15252 -5.926274,0.67408 -6.05164,0.63132 -1.799391,-0.61366 z m 35.912064,-7.66972 c 2.48289,-1.13009 12.13658,-1.90889 10.99131,-0.8867 -0.29931,0.26709 -3.48242,0.84333 -7.07363,1.28053 -4.39538,0.53511 -5.6758,0.4064 -3.91768,-0.39383 z m -37.217957,-4.88719 c 0,-1.3773 16.695061,-5.03734 17.824659,-3.9077 0.396861,0.3968 -1.573602,1.33943 -4.37853,2.09474 -9.291038,2.50181 -13.446129,3.06205 -13.446129,1.81296 z m 39.176797,-6.68479 c 1.07736,-0.67565 4.8971,-1.60993 8.4883,-2.07616 4.7515,-0.61689 5.93294,-0.48004 4.33857,0.50251 -1.20494,0.74264 -5.02468,1.67691 -8.4883,2.07618 -4.19309,0.48335 -5.64277,0.31542 -4.33857,-0.50253 z m -37.870904,-4.25072 c 0,-1.18725 13.706786,-4.26912 15.833825,-3.5601 0.774917,0.25831 -2.47062,1.39792 -7.212448,2.53247 -4.741699,1.13455 -8.621377,1.59698 -8.621377,1.02763 z m 41.695214,-7.21055 c 5.87417,-1.84287 8.77547,-1.39351 5.27907,0.81764 -1.05647,0.66819 -3.97775,1.16579 -6.49159,1.10578 l -4.57063,-0.10917 5.78315,-1.8143 z M 77.52164,690.6392 c 1.558191,-1.52149 13.759282,-4.62989 14.655517,-3.73368 0.344233,0.34425 -1.930894,1.28717 -5.056027,2.09537 -3.125002,0.80819 -6.857115,1.79434 -8.293597,2.19145 -1.711896,0.47322 -2.161776,0.28263 -1.305893,-0.55314 z m 1.508176,-13.05678 c -0.332611,-0.53868 2.717825,-1.05646 6.778891,-1.15063 5.718376,-0.1326 6.500084,0.0534 3.465972,0.82492 -5.371662,1.36582 -9.521137,1.49774 -10.244863,0.32571 z m 207.434734,-3.75354 c -11.49186,-1.75081 -23.22527,-3.81446 -26.07424,-4.5859 -4.8444,-1.31175 -5.01856,-1.52062 -2.68867,-3.22429 3.31324,-2.42268 17.84872,-2.36043 32.02765,0.13717 14.46535,2.54806 13.95808,2.61569 16.44444,-2.19241 2.08328,-4.02862 2.03606,-4.3564 -1.59883,-11.09552 -2.06003,-3.81936 -4.13114,-6.94634 -4.60244,-6.94885 -1.11169,-0.007 -10.89154,13.44496 -10.57656,14.54664 0.132,0.46163 -0.8398,1.12169 -2.15955,1.46682 -1.71222,0.44775 -2.25934,0.0204 -1.91008,-1.49228 0.55793,-2.41625 -6.82706,-11.08541 -8.54098,-10.02616 -0.61927,0.38273 -1.04538,-0.14486 -0.94692,-1.17243 0.21138,-2.2059 -0.66847,-2.34794 -7.86188,-1.26922 -4.84258,0.72618 -5.5142,1.26761 -6.21658,5.01162 -0.78936,4.20767 -7.23652,11.43549 -11.54937,12.94784 -3.24594,1.13823 -8.00606,-1.34533 -10.42407,-5.43868 -2.18002,-3.69048 -5.08223,-17.15264 -4.05585,-18.81336 0.33459,-0.5414 -0.30716,-2.29144 -1.42614,-3.88899 -2.64749,-3.77983 -2.56709,-4.59025 0.55368,-5.58075 1.7702,-0.56185 4.14334,0.42584 7.50889,3.12515 5.47448,4.39076 18.70782,8.35309 25.78037,7.71917 l 4.51494,-0.40467 -5.37303,-6.87897 c -5.96983,-7.64306 -5.81195,-10.67199 0.25339,-4.86102 2.57333,2.46541 3.90406,3.09269 3.90406,1.84032 0,-1.04502 1.49031,-4.09322 3.31181,-6.7738 2.14047,-3.14997 2.71781,-4.88403 1.63237,-4.90281 -2.1186,-0.0367 4.26839,-5.12611 6.48239,-5.16549 3.22515,-0.0573 1.52111,4.31107 -4.76152,12.20657 l -6.39389,8.0353 3.07137,3.85186 c 1.68925,2.11853 3.47144,3.45178 3.96043,2.96279 0.48901,-0.48899 3.1624,-4.5796 5.94091,-9.09022 4.70512,-7.63831 4.89453,-8.31871 2.75992,-9.91425 -2.18425,-1.63263 -2.18348,-1.79354 0.0162,-3.42538 1.59004,-1.17957 9.71573,-1.98206 26.11787,-2.5794 51.54049,-1.87703 64.63831,-5.34678 71.92219,-19.05292 8.29616,-15.61096 10.50488,-49.05059 5.99476,-90.75958 -2.02278,-18.70647 -2.38474,-20.03337 -5.25986,-19.2815 -3.61742,0.94598 -6.02597,-1.59734 -11.34965,-11.98477 l -4.72354,-9.21642 -0.76215,5.22357 c -0.94055,6.44627 -2.14064,8.48757 -4.99182,8.49087 -1.96933,0.003 -2.16438,-1.6221 -1.80277,-15.0141 0.34764,-12.87484 0.74099,-15.19624 2.75786,-16.27562 3.56677,-1.90888 5.89145,0.6873 10.47533,11.69876 2.24242,5.38681 4.9184,11.26333 5.94659,13.05893 1.78521,3.11763 1.87153,3.13758 1.91571,0.44282 0.0255,-1.55204 -1.06829,-6.40303 -2.43054,-10.77995 -1.36226,-4.37693 -1.99856,-8.25364 -1.414,-8.61491 0.58456,-0.36129 0.47104,-2.80021 -0.25227,-5.41981 -2.47466,-8.96243 3.35243,-14.2897 9.21633,-8.42581 4.35627,4.35628 14.23705,23.9499 18.51503,36.71534 5.21329,15.55646 6.11614,31.66767 1.94549,34.71732 -3.29247,2.40752 -4.30094,2.3303 -5.71547,-0.43762 -1.75967,-3.44325 -3.14746,-11.89859 -1.55397,-9.46772 2.12476,3.24127 1.59686,-8.65066 -0.75628,-17.03721 -1.97089,-7.02419 -2.23678,-7.34052 -5.05293,-6.01151 -2.50405,1.18172 -2.80636,1.98236 -1.91807,5.07968 5.50072,19.17989 7.63133,80.94354 3.47116,100.62485 -2.60193,12.30946 -7.76226,22.22807 -14.27997,27.44736 -2.80895,2.24937 -9.11528,5.11115 -15.01777,6.815 l -10.17538,2.93728 0.63933,10.91698 c 1.18131,20.17146 0.94472,22.50863 -2.77168,27.38109 -6.72435,8.81607 -24.78395,15.60089 -40.96213,15.38908 -4.30944,-0.0564 -17.23779,-1.53507 -28.72965,-3.28588 z m 27.3136,-7.34655 c -1.36059,-1.61604 -2.63304,-3.18918 -2.82768,-3.49587 -0.19463,-0.30669 -1.17717,0.56831 -2.18343,1.94443 -2.40573,3.29004 -1.48604,4.4897 3.44189,4.4897 l 4.04302,0 z m 17.01465,0.94777 c 6.99909,-1.13459 16.84127,-6.29791 20.23925,-10.61775 2.61328,-3.32223 2.73786,-4.49393 1.9138,-17.99932 -0.48478,-7.94516 -0.95612,-14.54972 -1.04742,-14.67678 -0.0913,-0.12706 -3.81868,0.10016 -8.28309,0.505 -6.33352,0.57431 -8.28441,1.26311 -8.87844,3.13475 -0.41873,1.31929 -2.68512,5.2056 -5.03643,8.63625 -4.12246,6.0148 -4.20834,6.40011 -2.40502,10.79044 l 1.87009,4.5529 2.43267,-3.00422 c 1.69499,-2.09323 2.20015,-4.16683 1.66587,-6.83822 -0.59661,-2.98306 -0.29581,-3.83399 1.35529,-3.83399 1.16714,0 2.12207,0.72671 2.12207,1.61493 0,0.88821 2.0724,-1.46239 4.60533,-5.22357 4.11419,-6.10922 7.15521,-8.60344 7.14356,-5.85909 -0.003,0.53868 -2.35103,4.50533 -5.21942,8.81478 -4.409,6.62402 -5.23708,8.94575 -5.35635,15.01777 l -0.14108,7.18241 -1.55703,-5.02304 -1.55703,-5.02305 -3.62977,5.23775 c -1.99637,2.88078 -4.85234,6.31645 -6.34659,7.63484 -2.25191,1.98688 -2.09088,1.31696 0.941,-3.9148 l 3.65783,-6.31189 -3.25727,-3.25727 -3.25727,-3.25727 -4.82637,6.71794 c -5.13255,7.14415 -5.24103,9.29852 -0.71298,14.15881 1.69582,1.82026 3.69799,2.63929 5.53511,2.26429 1.58303,-0.32313 5.1964,-0.96331 8.02969,-1.4226 z m -80.19236,-8.82465 c 1.10373,-0.87497 3.29533,-3.42754 4.87023,-5.67239 l 2.86346,-4.08154 -4.87024,-0.80337 c -2.67864,-0.44186 -6.55346,-1.69034 -8.61072,-2.7744 -2.05727,-1.08406 -3.93546,-1.97102 -4.17377,-1.97102 -0.81058,0 3.60375,13.70408 4.94266,15.34424 1.6337,2.00128 2.4096,1.99481 4.97838,-0.0415 z m 42.41372,-9.5397 5.02488,-7.29591 -3.14818,-5.76302 c -1.7315,-3.16966 -3.45429,-5.75788 -3.8284,-5.7516 -0.82698,0.0138 -10.47443,14.85061 -10.47443,16.10852 0,1.31848 5.74942,9.9629 6.63888,9.98175 0.41929,0.009 3.02356,-3.26699 5.78725,-7.27974 z m 22.58161,0.0754 c 2.29297,-3.25308 4.16906,-6.49684 4.16906,-7.20836 0,-0.71151 -1.46913,-3.62091 -3.26473,-6.46533 -5.74648,-9.10302 -3.2929,-11.30016 2.62789,-2.35322 l 3.6279,5.48212 4.36156,-5.15565 c 5.18106,-6.12435 5.72552,-9.08014 1.46216,-7.9376 -1.61604,0.43309 -5.94023,0.79546 -9.60931,0.80527 -6.62903,0.0178 -6.70101,0.0629 -11.42657,7.18015 -2.61553,3.93923 -4.75551,7.73502 -4.75551,8.43504 0,1.62782 6.92156,13.13225 7.90094,13.13225 0.40565,0 2.61361,-2.66162 4.90661,-5.91471 z m -10.33599,-16.93846 4.22019,-5.87652 -8.52526,0 -8.52527,0 3.96601,5.87652 c 2.18132,3.23208 4.11859,5.87652 4.30508,5.87652 0.18648,0 2.23814,-2.64444 4.55925,-5.87652 z m -193.13197,37.27712 c 0,-0.75078 0.80809,-1.36506 1.7956,-1.36506 0.98752,0 3.77887,-0.37154 6.203,-0.82564 2.96568,-0.55557 3.98023,-0.39379 3.10149,0.49456 -1.92919,1.95026 -11.10009,3.35162 -11.10009,1.69614 z m -33.953224,-3.83653 c 3.232086,-0.5616 8.227127,-1.44432 11.100093,-1.96162 4.306444,-0.77539 4.79106,-0.66915 2.759874,0.60507 -1.354995,0.85009 -6.350036,1.73282 -11.100092,1.96162 -7.545712,0.36346 -7.894255,0.28705 -2.759875,-0.60507 z m 36.565014,-7.39027 c 3.23208,-1.0184 6.75799,-1.81586 7.83536,-1.77212 3.16861,0.12863 -6.86835,3.59865 -10.44715,3.6118 -2.2353,0.008 -1.4118,-0.57185 2.61179,-1.83968 z m -42.11506,-2.81291 c 1.616043,-0.31127 4.260477,-0.31127 5.87652,0 1.616042,0.31126 0.293826,0.56594 -2.93826,0.56594 -3.232086,0 -4.554303,-0.25468 -2.93826,-0.56594 z m 471.10097,-3.62952 c -15.67237,-2.44218 -42.46225,-8.95773 -59.38578,-14.44319 -14.18721,-4.59853 -33.16481,-12.24944 -30.53864,-12.31179 3.75381,-0.0891 25.30351,4.55359 45.52406,9.80779 27.95824,7.26479 49.98664,11.05117 64.29349,11.05117 19.82009,0 26.46877,-3.89118 27.4798,-16.08271 0.83319,-10.04739 -2.95626,-22.35359 -16.82957,-54.65371 -13.37078,-31.1301 -15.16187,-38.54179 -10.16045,-42.04493 1.67825,-1.17548 5.53612,-2.13725 8.57304,-2.13725 7.88267,0 18.39299,-2.48217 20.83019,-4.91938 3.00917,-3.00917 1.68285,-11.66991 -3.35394,-21.9011 l -4.15432,-8.43863 -18.66398,0 c -59.87304,0 -104.81223,-10.34716 -143.28911,-32.992 -31.45171,-18.51032 -53.01096,-44.11577 -57.43535,-68.21473 -2.86262,-15.59221 1.25081,-40.19293 9.82273,-58.74575 4.1203,-8.91785 10.75294,-16.34311 14.59853,-16.34311 2.55731,0 2.35843,0.8249 -1.38084,5.72734 -13.85643,18.16671 -20.73377,56.22486 -13.8769,76.79263 12.07128,36.20888 60.63001,69.64762 118.97605,81.92983 23.6985,4.9887 35.13106,5.9685 68.55939,5.87573 26.80546,-0.0744 35.87912,-0.59924 50.70817,-2.93308 43.10033,-6.78323 130.86736,-22.63371 174.72581,-40.49291 84.09845,-34.24498 73.28935,-21.73318 47.61672,-9.94155 -1.15801,0.53188 -20.33644,3.92071 -29.85161,9.38167 -40.91332,23.48106 -150.96068,40.61543 -197.23324,46.64267 -8.47612,1.10405 -15.87779,2.00736 -16.44817,2.00736 -0.57036,0 0.59259,3.23076 2.58436,7.17946 1.99177,3.94871 4.32132,10.30704 5.17677,14.12961 1.33147,5.94963 1.24786,7.54483 -0.58074,11.08095 -2.94432,5.69369 -8.13843,8.00674 -21.35103,9.50806 -6.21456,0.70614 -11.53397,1.51867 -11.82092,1.8056 -0.97635,0.97636 2.66248,10.45589 11.79697,30.73224 15.98278,35.47794 19.32654,45.5251 19.64253,59.02083 0.37501,16.01751 -9.81434,24.2595 -31.18888,25.22811 -6.39755,0.28991 -16.88994,-0.29622 -23.36514,-1.30523 z M 109.51602,650.0871 c 0,-0.67484 2.49752,-1.62402 5.55005,-2.10929 3.05252,-0.48525 6.95989,-1.23373 8.68301,-1.66325 2.0338,-0.50692 2.83327,-0.29577 2.27853,0.60176 -0.46999,0.7605 -3.34897,1.77061 -6.39771,2.2447 -3.04886,0.47408 -6.57164,1.15246 -7.82856,1.50752 -1.25693,0.35505 -2.28532,0.0934 -2.28532,-0.58144 z m -36.456226,-2.03202 c 0.299311,-0.25917 3.1886,-0.85516 6.420685,-1.32442 4.106512,-0.59623 5.286517,-0.46032 3.91768,0.45121 -1.761389,1.17295 -11.648698,2.00806 -10.338365,0.87321 z m -0.761727,-7.36414 c 2.154724,-0.54828 6.268287,-1.00783 9.141252,-1.02122 4.446697,-0.0208 4.738042,0.13116 1.95884,1.02122 -1.795603,0.57505 -5.909167,1.0346 -9.141252,1.02122 -5.274503,-0.0218 -5.475219,-0.12641 -1.95884,-1.02122 z m 43.094473,-1.35689 c 9.17469,-2.95346 8.48831,-2.83009 8.48831,-1.52574 0,1.15035 -10.50617,4.22832 -14.05703,4.11829 -1.24673,-0.0386 1.25928,-1.20527 5.56872,-2.59255 z m 136.5429,-9.35893 c 2.22301,-7.75121 12.72387,-20.4404 15.49699,-18.72652 0.77141,0.47676 1.40257,1.43683 1.40257,2.1335 0,1.59097 -12.95351,17.25416 -15.89001,19.21396 -1.94485,1.29798 -2.05298,1.01728 -1.00955,-2.62094 z m -56.79013,-0.47755 c -3.54594,-3.54593 -3.20767,-18.83991 1.34865,-60.9759 3.78578,-35.01036 4.86193,-41.39029 7.23492,-42.89226 4.49812,-2.84708 4.86517,-0.87881 3.19246,17.11954 l -0.91024,9.7942 6.40684,-15.01777 c 13.80829,-32.3669 24.37212,-49.62394 30.3771,-49.62394 1.31218,0 3.26665,1.25762 4.34328,2.79474 1.9224,2.74458 1.99955,2.69771 4.2998,-2.61179 2.2984,-5.30525 5.07227,-6.76163 7.75976,-4.07414 0.90594,0.90594 3.45397,-1.91544 7.96077,-8.81478 9.17145,-14.04029 15.32173,-19.94136 20.7835,-19.94136 5.30325,0 6.98918,2.70491 7.06843,11.34071 l 0.0577,6.28884 2.70947,-5.22357 c 3.81976,-7.36409 6.25416,-9.7942 9.81149,-9.7942 2.02908,0 3.60114,1.12114 4.57783,3.26474 2.18356,4.79238 4.53692,4.00358 7.40593,-2.4823 4.40022,-9.94742 12.35493,-8.80338 14.08661,2.02593 1.02631,6.41819 2.54156,5.40313 3.68092,-2.46583 2.00171,-13.82492 3.38593,-17.31915 6.86087,-17.31915 3.14356,0 3.20742,0.18812 2.3271,6.85594 -1.70198,12.89153 -5.73052,31.23296 -7.26656,33.08377 -0.84393,1.01688 -2.9316,1.84887 -4.63925,1.84887 -2.04581,0 -3.14117,0.7795 -3.21136,2.28532 -0.0627,1.34488 -0.90085,0.46398 -2.03678,-2.14066 l -1.93025,-4.42596 -6.04492,9.31325 c -5.78813,8.91763 -9.2169,11.75638 -12.07003,9.99305 -1.68655,-1.04234 -1.68487,-8.8141 0.004,-17.71847 0.94659,-4.99132 0.89378,-8.26331 -0.18618,-11.53562 l -1.50758,-4.56799 -7.0078,13.96917 c -3.85441,7.68304 -7.55567,13.96917 -8.22517,13.96917 -2.43512,0 -2.87634,-2.86789 -1.39269,-9.05242 1.40916,-5.87403 0.17243,-19.96141 -1.93765,-22.07148 -2.1011,-2.10112 -15.20705,15.69206 -26.70523,36.25617 -5.24449,9.3796 -7.7776,15.91583 -10.62805,27.42376 -4.55621,18.39454 -4.78954,22.11893 -0.61933,9.8855 10.70191,-31.39437 26.68338,-59.48637 31.97954,-56.21316 2.44584,1.51161 1.53949,4.42917 -3.3619,10.82207 -8.67204,11.31094 -21.68367,43.12005 -28.56752,69.83807 -1.98387,7.69993 -4.11053,13.68868 -4.72592,13.30835 -0.61539,-0.38034 -1.18894,-4.03584 -1.27455,-8.12334 l -0.15567,-7.43181 -1.85674,8.48831 c -1.02121,4.66856 -2.12922,14.61243 -2.46225,22.09747 -0.33302,7.48506 -0.94715,13.94923 -1.36474,14.36483 -0.41757,0.41561 -1.95894,-0.71348 -3.42525,-2.50908 -2.43497,-2.98179 -2.59848,-4.45311 -1.88666,-16.97661 0.42864,-7.54154 1.09524,-16.06249 1.48131,-18.93545 0.38606,-2.87297 -1.91806,4.66363 -5.12029,16.74798 -3.20222,12.08437 -6.91081,23.83549 -8.2413,26.11361 -3.21753,5.50917 -6.44811,6.02117 -8.24892,1.30732 -1.34643,-3.52446 -1.57131,-3.17996 -5.12473,7.85057 -4.97545,15.4448 -8.70225,19.40826 -13.62271,14.48779 z m 9.40704,-14.94552 c 1.45224,-3.96188 5.09553,-18.06553 8.09619,-31.34143 3.00066,-13.2759 7.17389,-31.37418 9.27386,-40.21839 2.09997,-8.84423 3.79067,-16.48371 3.75711,-16.97662 -0.0956,-1.40486 -9.98933,22.21688 -16.96182,40.49727 -6.55125,17.17595 -9.09503,31.04184 -9.09503,49.5758 0,9.27924 1.08959,8.9396 4.92969,-1.53663 z m 27.04079,-54.53771 c 4.58297,-19.19222 9.25455,-38.3974 10.38129,-42.6782 2.29637,-8.72466 2.65999,-19.93844 0.7427,-22.90524 -0.74957,-1.15987 -1.27405,-1.32842 -1.2859,-0.41325 -0.0104,0.85009 -1.90949,4.58518 -4.21888,8.30021 -3.86253,6.21352 -4.02108,6.88461 -1.97914,8.37772 1.22086,0.89272 1.97131,1.87157 1.66767,2.17521 -1.55877,1.55877 -14.74886,63.19441 -17.01354,79.5021 -0.44885,3.23209 -1.06966,7.63948 -1.37958,9.7942 -0.4971,3.45614 -0.25034,3.25939 2.09461,-1.67007 1.46194,-3.07326 6.40779,-21.29047 10.99077,-40.48268 z m 5.45939,-7.14472 c -0.36227,-0.8978 -0.65868,-0.16323 -0.65868,1.63237 0,1.7956 0.29641,2.53017 0.65868,1.63237 0.36227,-0.8978 0.36227,-2.36693 0,-3.26474 z m 9.06537,-1.93163 c -0.43394,-0.43394 -0.74258,0.33736 -0.68588,1.71398 0.0627,1.5213 0.3721,1.83073 0.78897,0.78898 0.37723,-0.9427 0.33084,-2.06903 -0.10304,-2.50296 z m 1.30589,-6.52947 c -0.43393,-0.43394 -0.74258,0.33736 -0.68588,1.71398 0.0627,1.5213 0.3721,1.83074 0.78897,0.78899 0.37723,-0.9427 0.33085,-2.06904 -0.10304,-2.50297 z m 67.71464,-53.98553 c -1.11945,-1.81133 -1.90307,-1.47359 -1.90307,0.82025 0,1.11975 0.59724,1.66679 1.3272,1.21566 0.72995,-0.45113 0.98911,-1.3673 0.57587,-2.03591 z m 12.75513,-23.59715 c 1.07182,-0.66243 1.11645,-1.78614 0.15641,-3.93769 -1.24974,-2.80076 -1.52716,-2.51166 -3.9779,4.14534 -4.15478,11.28575 -4.74063,16.02243 -0.97158,7.85536 1.81128,-3.92485 3.96816,-7.55319 4.79307,-8.06301 z m -37.71245,134.7796 c -5.7734,-2.62148 -12.20486,-11.50398 -12.20486,-16.85617 0,-4.67644 2.23601,-3.21375 6.12011,4.00348 3.0917,5.74486 4.98591,7.50434 11.95002,11.10009 7.83603,4.04596 8.04427,4.27156 3.91767,4.24441 -2.39703,-0.0158 -6.79935,-1.13709 -9.78294,-2.49181 z m 44.99679,-12.77561 c -3.33465,-7.53852 -4.01914,-26.05259 -1.2094,-32.71208 3.16333,-7.49756 11.10441,-6.88322 15.27494,1.18167 6.60138,12.7657 1.24937,37.68526 -8.09372,37.68526 -2.61702,0 -3.77899,-1.19758 -5.97182,-6.15485 z m 8.00122,-12.7447 c 0.0868,-4.91109 -0.0104,-5.04258 -1.81432,-2.46631 -1.29799,1.85315 -1.64613,4.32342 -1.09122,7.74296 0.65886,4.06009 1.00627,4.53234 1.81433,2.46631 0.54968,-1.40541 1.04073,-4.88974 1.09121,-7.74296 z m 14.1765,6.40028 c -1.81274,-3.97853 0.43613,-25.67734 2.97873,-28.74098 3.33174,-4.0145 9.84634,-1.28632 12.10573,5.06962 1.43457,4.03559 -1.36356,18.90752 -4.34527,23.09493 -3.60077,5.05682 -8.57611,5.32388 -10.73919,0.57643 z"
       id="path4147"
       inkscape:connector-curvature="0"
       sodipodi:nodetypes="ssssssssssssssssssssssssssssccssssssssscccssssscsccscsssscccsssssscsccssssscsssscccscsccccscscsssssssscsssssscssscccssssssssccsscssccscsssssssccssccssssscccsscssssssscsscssscccscscsscsssssssssccscsssssssscsssscssscssscscsssssssscssscsssccsscsssssssscsscsccscccscsscscsscccssssccscscssscssssssssscsssscsssssscscsccsscsssssssssssssscssssssssssssssssssssscssccccsssssccscssssscsssccscssscsscscscssssccccccccscccscccsssssccscssssssssssscsssscsscsssssssssscscsssscscsssssssssssscsssccscsscsssscsssscssssscsscccssscccsssssscsssssscscscscssscssssssccscccsssssssssscsssscssssssscsssssssscssssssssssssssssssscsssssscccsscsscccsscsscsssssssssscsssssssscsssssssssssscsscsccssssssssscscsscssssssssssscsssssscsssssssssssccsccccscccsscssssssssscssssssscssssssss" />
    <text
       xml:space="preserve"
       style="font-style:normal;font-weight:normal;font-size:29.71234131px;line-height:150%;font-family:sans-serif;letter-spacing:0px;word-spacing:0px;fill:#000000;fill-opacity:1;stroke:none;stroke-width:1px;stroke-linecap:butt;stroke-linejoin:miter;stroke-opacity:1"
       x="401.70245"
       y="344.04205"
       id="text4149"
       sodipodi:linespacing="150%"><tspan
         sodipodi:role="line"
         id="tspan4151"
         x="401.70245"
         y="344.04205"
         style="font-style:normal;font-variant:normal;font-weight:bold;font-stretch:normal;line-height:150%;font-family:Purisa;-inkscape-font-specification:'Purisa Bold'">Pour être sûr de ne</tspan><tspan
         sodipodi:role="line"
         x="401.70245"
         y="378.17081"
         style="font-style:normal;font-variant:normal;font-weight:bold;font-stretch:normal;line-height:150%;font-family:Purisa;-inkscape-font-specification:'Purisa Bold'"
         id="tspan4159">pas l'oublier j'ai toujours</tspan><tspan
         sodipodi:role="line"
         x="401.70245"
         y="412.29956"
         style="font-style:normal;font-variant:normal;font-weight:bold;font-stretch:normal;line-height:150%;font-family:Purisa;-inkscape-font-specification:'Purisa Bold'"
         id="tspan4161">ma clé privée avec moi. </tspan></text>
    <path
       style="fill:#000000"
       d="m 846.62281,1011.9453 c -27.64485,-3.1664 -39.88446,-11.8628 -41.4262,-29.4345 l -0.75037,-8.55056 -6.52946,-2.43301 c -12.35637,-4.60406 -20.24135,-13.83568 -20.24135,-23.69804 0,-11.19477 16.06079,-31.79733 29.38077,-37.68939 11.89251,-5.26066 15.58388,1.70054 4.16227,7.84933 -8.9263,4.80556 -15.92745,11.0271 -21.1714,18.81388 -7.93356,11.78059 -5.41658,20.37128 7.7668,26.51002 3.64775,1.69858 7.28349,3.09405 8.07917,3.1011 0.79568,0 3.60531,-3.48438 6.24361,-7.7587 9.261,-15.00406 28.79507,-31.00843 36.39733,-29.82046 3.18011,0.49689 2.34917,1.44523 -18.71998,21.36702 -13.5587,12.82022 -19.79943,28.22297 -15.57108,38.43096 3.59709,8.68411 19.141,14.18785 43.74494,15.48905 71.28427,3.77 145.10814,-20.33391 153.44204,-50.09962 1.4257,-5.0918 1.3469,-6.70067 -0.5737,-11.72979 -2.6214,-6.86404 -11.15359,-14.96018 -22.73373,-21.57192 -4.40295,-2.51384 -8.01165,-5.27058 -8.01949,-6.12594 -0.0326,-3.55243 3.42497,-3.03242 13.70457,2.06135 36.83485,18.25234 33.11825,51.06081 -8.20167,72.40168 -35.74595,18.46204 -93.94452,28.04624 -138.98307,22.88754 z m 86.45391,-130.01788 c -7.18398,-2.62616 -10.01672,-11.05295 -5.75886,-17.13189 1.68865,-2.41081 2.43445,-2.66755 3.99277,-1.37419 1.05399,0.87469 1.74964,3.17985 1.54579,5.1225 -0.75742,7.2212 5.0098,9.62979 14.03208,5.86006 4.51212,-1.88531 4.55195,-1.96915 2.4573,-5.16624 -3.95607,-6.03754 0.36931,-8.04012 5.90695,-2.7348 1.8609,1.7828 5.39112,3.64305 7.84515,4.13393 l 4.46172,0.89232 -2.87663,-3.65702 c -6.10557,-7.76197 -2.7553,-10.14327 5.45302,-3.87576 8.31789,6.35121 18.76843,10.99 24.79278,11.00528 9.50251,0.0235 19.23121,-7.97013 19.58601,-16.09383 0.2644,-6.05464 -5.6929,-8.70064 -19.59489,-8.70338 -8.65821,-10e-4 -10.78694,-0.40065 -11.45726,-2.14781 -0.45288,-1.18013 -0.51661,-2.45259 -0.14156,-2.82752 1.15467,-1.15467 21.12241,-1.93259 26.02041,-1.01376 6.2754,1.17726 12.2651,6.48036 13.2503,11.73123 1.5626,8.32964 -5.4385,19.3122 -15.6616,24.56816 -6.6388,3.41308 -19.65669,2.7553 -27.80416,-1.40501 -4.18525,-2.13709 -6.79156,-2.62445 -10.69657,-1.99998 -2.83979,0.45406 -6.98091,0.19197 -9.20263,-0.58256 -2.44581,-0.85261 -3.72819,-0.90446 -3.2505,-0.1315 2.10798,3.4106 -16.44315,7.89204 -22.89962,5.53177 z m -70.51823,-29.07389 c 0,-10.39321 1.25157,-26.66503 3.23927,-42.11505 4.68685,-36.42998 4.78035,-36.85453 8.22451,-37.34894 1.69936,-0.24381 3.2283,0.40456 3.67048,1.55662 0.41671,1.08598 -0.75677,13.61485 -2.60774,27.84178 -1.85097,14.22692 -4.26374,33.11458 -5.36174,41.97258 -1.79913,14.51291 -4.50729,25.03032 -6.44523,25.03032 -0.39569,0 -0.71955,-7.62185 -0.71955,-16.93731 z m 98.32749,-18.5395 c -5.35351,-13.75955 -9.52675,-46.94229 -9.52675,-75.75095 l 0,-16.74978 3.71383,0 3.71383,0 0.82193,21.87371 c 0.4521,12.03054 1.74362,29.25528 2.87009,38.2773 1.12646,9.02202 1.8767,21.65654 1.66723,28.0767 l -0.38093,11.67312 z m -121.83357,-113.529 c -11.67325,-1.77837 -21.49343,-6.4788 -24.77279,-11.85765 -3.13454,-5.1413 -3.46166,-15.79974 -0.85719,-27.92966 l 1.7021,-7.92703 -8.98833,-2.31535 c -16.79536,-4.32668 -25.89208,-14.93027 -31.30814,-36.49449 -2.69066,-10.71276 -2.9901,-14.88274 -2.9205,-40.66643 0.0784,-29.00937 2.15982,-50.54198 6.53574,-67.61523 l 1.93363,-7.54401 -6.2389,-7.22669 -6.23904,-7.22655 -1.63014,8.24123 c -1.93939,9.804 -5.34359,19.34133 -6.90387,19.34133 -1.8037,0 -2.95654,-11.1475 -1.99279,-19.26989 1.37119,-11.5586 3.16966,-17.11922 6.03218,-18.65116 4.21359,-2.25515 7.10549,-0.37897 12.24131,7.94166 4.59283,7.44098 7.24471,8.94249 7.26064,4.11095 0,-1.21461 0.59653,-4.32956 1.31673,-6.92228 1.13338,-4.08026 1.74506,-4.63057 4.55065,-4.09437 2.51985,0.48175 3.10097,1.24008 2.61152,3.40812 -2.25071,9.96684 -3.31632,13.87042 -5.13999,18.82876 -7.05509,19.18174 -11.00581,80.04433 -6.77276,104.33695 2.91933,16.75357 6.69179,26.14124 13.09811,32.59418 8.48804,8.54981 14.51513,9.87477 49.09362,10.79177 20.8922,0.55409 30.26851,1.28396 32.44844,2.52586 l 3.06572,1.74663 -3.06572,2.17105 c -2.54323,1.80109 -7.33115,2.24352 -28.08676,2.59599 l -25.02078,0.4248 -2.15459,11.72457 c -4.49763,24.47309 0.74344,27.22709 51.85062,27.24564 l 27.07808,0.0131 -2.58776,-4.24416 c -6.23786,-10.23089 0.17421,-23.62387 12.95851,-27.06633 12.22708,-3.29242 24.92676,7.7796 24.92676,21.73189 0,3.50867 -1.06535,5.68155 -4.44003,9.05624 -2.44202,2.44202 -5.43657,4.44003 -6.65444,4.44003 -1.21788,0 -3.91207,1.0028 -5.987,2.22851 -3.20884,1.89564 -4.43469,1.98901 -8.20571,0.62539 -3.36098,-1.21539 -5.34006,-1.24517 -8.18208,-0.12275 -4.93444,1.94787 -49.58489,2.72435 -60.55505,1.0532 z M 921.296,709.83315 c 4.95521,-2.56242 5.90068,-6.08624 3.17449,-11.83139 -4.31937,-9.10247 -13.56823,-11.65536 -19.7673,-5.45628 -4.63618,4.63631 -4.51709,10.28991 0.32347,15.34241 4.25538,4.44161 10.09233,5.13961 16.26934,1.94526 z m 42.62187,-51.8689 c -1.2308,-3.80054 -3.48112,-13.19801 -5.00066,-20.88319 -3.41491,-17.27135 -3.04534,-18.02133 8.88008,-18.02133 7.37137,0 8.78226,-0.43839 12.8193,-3.98297 6.02134,-5.28678 7.82021,-11.20091 6.94134,-22.82127 -0.81513,-10.77819 -6.20207,-25.57487 -7.42504,-20.39453 -0.60267,2.55329 -1.43218,1.70981 -5.82781,-5.92705 -2.8189,-4.89723 -8.19422,-13.41962 -11.9454,-18.93846 -6.52476,-9.59936 -7.16504,-11.51288 -3.85225,-11.51288 2.19298,0 13.0981,15.37206 17.48369,24.64534 2.48994,5.26484 4.06524,7.35831 4.56239,6.06287 3.8392,-10.00484 15.38721,17.53318 13.13468,31.32171 -2.01212,12.31667 -10.32727,21.65485 -21.39602,24.0287 -3.68314,0.78994 -7.58397,1.43622 -8.66825,1.43622 -1.08442,0 -1.67612,0.47835 -1.31478,1.063 1.38947,2.24809 6.02565,27.03904 6.00672,32.11883 -0.0326,8.79337 -1.88806,9.55483 -4.39799,1.80501 z M 824.98768,631.5506 c -5.69839,-7.24444 -7.09857,-23.85292 -2.7365,-32.45784 3.14956,-6.21266 4.51461,-7.40834 8.49066,-7.4368 4.88156,-0.0353 9.61647,15.06047 9.61647,30.65871 0,8.17254 -1.84562,10.93777 -7.96282,11.93051 -3.99577,0.64838 -5.09181,0.24969 -7.40781,-2.69458 z m 5.70375,-18.63026 -1.98156,-3.65481 -0.0522,4.81209 c -0.0287,2.64665 0.66013,6.46639 1.5309,8.4883 l 1.58314,3.67622 0.45066,-4.8335 c 0.25073,-2.68883 -0.42846,-6.45516 -1.53077,-8.4883 z m -25.81281,13.8964 c -3.25768,-1.85176 -6.8686,-12.59273 -6.8686,-20.43122 0,-11.55167 6.18993,-14.45833 10.79569,-5.06948 1.99083,4.05845 6.31869,23.86324 5.39229,24.67603 -1.61604,1.4178 -7.37895,1.92776 -9.31938,0.82467 z m 121.10475,-16.23369 c -2.45181,-5.86777 -7.27147,-23.02603 -7.27147,-25.88633 0,-1.31699 1.02943,-2.202 2.56125,-2.202 1.954,0 3.05592,1.62519 4.64845,6.85594 2.19247,7.20083 4.2038,25.79139 2.79057,25.79139 -0.45315,0 -1.68121,-2.05156 -2.7288,-4.559 z m -36.92073,-49.64314 c -1.95375,-4.09724 -1.99828,-4.87634 -0.33849,-5.92614 3.7897,-2.39697 5.17578,-1.35317 5.17578,3.89783 0,6.91222 -2.09022,7.78874 -4.83729,2.02831 z m 49.67657,-14.03078 c -6.74155,-7.53696 -9.59688,-15.34424 -5.61195,-15.34424 1.36544,0 6.30198,9.19466 7.86775,14.65408 1.25835,4.38728 1.09564,4.43703 -2.2558,0.69016 z"
       id="path4147-6"
       inkscape:connector-curvature="0"
       sodipodi:nodetypes="sscsssssscsssssssscssssccscsscsssccccscsssccsssscscsssccccssscscscsssscccssssscssssssscccscscccsssscssccsscssccssccssccssssccccsssccssssccsssssssssscsssssscssscs" />
    <text
       xml:space="preserve"
       style="font-style:normal;font-weight:normal;font-size:29.6849823px;line-height:150%;font-family:sans-serif;letter-spacing:0px;word-spacing:0px;fill:#000000;fill-opacity:1;stroke:none;stroke-width:1px;stroke-linecap:butt;stroke-linejoin:miter;stroke-opacity:1"
       x="806.3241"
       y="785.67786"
       id="text4184"
       sodipodi:linespacing="150%"><tspan
         sodipodi:role="line"
         id="tspan4186"
         x="806.3241"
         y="785.67786"
         style="font-style:normal;font-variant:normal;font-weight:bold;font-stretch:normal;line-height:150%;font-family:Purisa;-inkscape-font-specification:'Purisa Bold';text-align:end;text-anchor:end">Ne me dis pas</tspan><tspan
         sodipodi:role="line"
         x="806.3241"
         y="819.77521"
         id="tspan4188"
         style="font-style:normal;font-variant:normal;font-weight:bold;font-stretch:normal;line-height:150%;font-family:Purisa;-inkscape-font-specification:'Purisa Bold';text-align:end;text-anchor:end">que tu l'apprends</tspan><tspan
         sodipodi:role="line"
         x="806.3241"
         y="853.8725"
         style="font-style:normal;font-variant:normal;font-weight:bold;font-stretch:normal;line-height:150%;font-family:Purisa;-inkscape-font-specification:'Purisa Bold';text-align:end;text-anchor:end"
         id="tspan4198">par cœur...?</tspan></text>
  </g>
</svg>
