<?xml version="1.0" encoding="UTF-8" standalone="no"?>
<!-- Created with Inkscape (http://www.inkscape.org/) -->

<svg
   xmlns:dc="http://purl.org/dc/elements/1.1/"
   xmlns:cc="http://creativecommons.org/ns#"
   xmlns:rdf="http://www.w3.org/1999/02/22-rdf-syntax-ns#"
   xmlns:svg="http://www.w3.org/2000/svg"
   xmlns="http://www.w3.org/2000/svg"
   xmlns:sodipodi="http://sodipodi.sourceforge.net/DTD/sodipodi-0.dtd"
   xmlns:inkscape="http://www.inkscape.org/namespaces/inkscape"
   width="10cm"
   height="3.8cm"
   viewBox="0 0 354.33071 134.64565"
   id="svg2"
   version="1.1"
   inkscape:version="0.91 r13725"
   sodipodi:docname="configthunderbird4.svg"
   inkscape:export-filename="/media/h4ck3r/GrosDisque/Fichiersdetravail/Projets_Libres/LIVRESENCOURS/manueldumo/images/configthunderbird3NEW.png"
   inkscape:export-xdpi="300"
   inkscape:export-ydpi="300">
  <defs
     id="defs4" />
  <sodipodi:namedview
     id="base"
     pagecolor="#ffffff"
     bordercolor="#666666"
     borderopacity="1.0"
     inkscape:pageopacity="0.0"
     inkscape:pageshadow="2"
     inkscape:zoom="1.4"
     inkscape:cx="-106.21159"
     inkscape:cy="193.88165"
     inkscape:document-units="px"
     inkscape:current-layer="layer1"
     showgrid="false"
     units="cm"
     inkscape:window-width="1920"
     inkscape:window-height="1026"
     inkscape:window-x="0"
     inkscape:window-y="0"
     inkscape:window-maximized="1"
     fit-margin-top="0.1"
     fit-margin-left="0.1"
     fit-margin-bottom="0.1"
     fit-margin-right="0.1"
     borderlayer="true" />
  <metadata
     id="metadata7">
    <rdf:RDF>
      <cc:Work
         rdf:about="">
        <dc:format>image/svg+xml</dc:format>
        <dc:type
           rdf:resource="http://purl.org/dc/dcmitype/StillImage" />
        <dc:title></dc:title>
      </cc:Work>
    </rdf:RDF>
  </metadata>
  <g
     inkscape:label="Calque 1"
     inkscape:groupmode="layer"
     id="layer1"
     transform="translate(-2.3897126,-917.99284)">
    <rect
       style="opacity:1;fill:#ffffff;fill-opacity:1;stroke:none;stroke-width:1.5;stroke-linejoin:round;stroke-miterlimit:4;stroke-dasharray:none;stroke-dashoffset:0;stroke-opacity:1"
       id="rect4213"
       width="394.28571"
       height="194.28572"
       x="-17.610287"
       y="899.78137" />
    <rect
       style="opacity:1;fill:#ffffff;fill-opacity:1;stroke:#000000;stroke-width:1.29260957;stroke-linejoin:round;stroke-miterlimit:4;stroke-dasharray:none;stroke-dashoffset:0;stroke-opacity:1"
       id="rect4136"
       width="349.22098"
       height="125.84217"
       x="4.7263355"
       y="924.81805"
       ry="6.6232724" />
    <g
       id="g4189"
       transform="matrix(0.50209234,-0.51084925,0.51379304,0.4992156,158.61186,798.04667)">
      <path
         id="rect4148-3"
         d="m 37.079917,306.64048 c -0.95342,0 -1.72193,0.76699 -1.72193,1.72041 l 0,4.42652 -4.37632,0 c -0.95343,0 -1.72042,0.76699 -1.72042,1.72041 0,0.95342 0.76699,1.72041 1.72042,1.72041 l 4.37632,0 0,4.62275 c 0,0.95341 0.76851,1.72041 1.72193,1.72041 0.95341,0 1.72041,-0.767 1.72041,-1.72041 l 0,-4.62275 4.67142,0 c 0.95342,0 1.72041,-0.76699 1.72041,-1.72041 0,-0.95342 -0.76699,-1.72041 -1.72041,-1.72041 l -4.67142,0 0,-4.42652 c 0,-0.95342 -0.767,-1.72041 -1.72041,-1.72041 z"
         style="opacity:1;fill:#000000;fill-opacity:1;stroke:none;stroke-width:3.54330707;stroke-linejoin:round;stroke-miterlimit:4;stroke-dasharray:none;stroke-dashoffset:0;stroke-opacity:1"
         inkscape:connector-curvature="0" />
      <flowRoot
         xml:space="preserve"
         id="flowRoot4194"
         style="font-style:normal;font-weight:normal;font-size:40px;line-height:125%;font-family:sans-serif;letter-spacing:0px;word-spacing:0px;fill:#000000;fill-opacity:1;stroke:none;stroke-width:1px;stroke-linecap:butt;stroke-linejoin:miter;stroke-opacity:1"
         transform="matrix(0.69891616,0.71520361,-0.71520361,0.69891616,118.99393,338.67144)"><flowRegion
           id="flowRegion4196"><rect
             id="rect4198"
             width="145.46196"
             height="150.00766"
             x="43.941635"
             y="98.140587" /></flowRegion><flowPara
           id="flowPara4200" /></flowRoot>      <text
         xml:space="preserve"
         style="font-style:normal;font-weight:normal;font-size:40px;line-height:125%;font-family:sans-serif;letter-spacing:0px;word-spacing:0px;fill:#000000;fill-opacity:1;stroke:none;stroke-width:1px;stroke-linecap:butt;stroke-linejoin:miter;stroke-opacity:1"
         x="252.14975"
         y="141.14725"
         id="text4218"
         sodipodi:linespacing="125%"
         transform="matrix(0.69891616,0.71520361,-0.71520361,0.69891616,0,0)"><tspan
           sodipodi:role="line"
           id="tspan4220"
           x="252.14975"
           y="141.14725" /></text>
    </g>
    <text
       xml:space="preserve"
       style="font-style:normal;font-weight:normal;font-size:9.1354351px;line-height:125%;font-family:sans-serif;letter-spacing:0px;word-spacing:0px;fill:#000000;fill-opacity:1;stroke:none;stroke-width:1px;stroke-linecap:butt;stroke-linejoin:miter;stroke-opacity:1"
       x="74.251953"
       y="934.96558"
       id="text4620"
       sodipodi:linespacing="125%"><tspan
         sodipodi:role="line"
         id="tspan4622"
         x="74.251953"
         y="934.96558"
         style="font-style:italic;font-variant:normal;font-weight:normal;font-stretch:normal;font-family:sans-serif;-inkscape-font-specification:'sans-serif Italic'">Paramètres des comptes Courrier et Groupes</tspan></text>
    <flowRoot
       xml:space="preserve"
       id="flowRoot4532"
       style="font-style:normal;font-weight:normal;font-size:40px;line-height:125%;font-family:sans-serif;letter-spacing:0px;word-spacing:0px;fill:#000000;fill-opacity:1;stroke:none;stroke-width:1px;stroke-linecap:butt;stroke-linejoin:miter;stroke-opacity:1"
       transform="translate(2.3897126,875.4731)"><flowRegion
         id="flowRegion4534"><rect
           id="rect4536"
           width="387.39349"
           height="176.77669"
           x="-249.50768"
           y="76.655182" /></flowRegion><flowPara
         id="flowPara4560" /></flowRoot>    <rect
       style="opacity:1;fill:#e6e6e6;fill-opacity:1;stroke:#000000;stroke-width:0.61451316;stroke-linejoin:round;stroke-miterlimit:4;stroke-dasharray:none;stroke-dashoffset:0;stroke-opacity:1"
       id="rect4689"
       width="77.305748"
       height="8.0696573"
       x="10.659669"
       y="968.51575"
       ry="4.0348287" />
    <flowRoot
       xml:space="preserve"
       id="flowRoot4639"
       style="font-style:normal;font-weight:normal;font-size:40px;line-height:125%;font-family:sans-serif;letter-spacing:0px;word-spacing:0px;fill:#000000;fill-opacity:1;stroke:none;stroke-width:1px;stroke-linecap:butt;stroke-linejoin:miter;stroke-opacity:1"
       transform="matrix(0.61413713,0,0,0.61413713,170.57696,887.40399)"><flowRegion
         id="flowRegion4641"><rect
           id="rect4643"
           width="199.50513"
           height="174.75641"
           x="-265.16504"
           y="94.837929" /></flowRegion><flowPara
         id="flowPara4645"
         style="font-style:normal;font-variant:normal;font-weight:bold;font-stretch:normal;font-size:10px;font-family:sans-serif;-inkscape-font-specification:'sans-serif Bold'">Jean.dupont@youkoulele.fr</flowPara><flowPara
         id="flowPara4647"
         style="font-size:10px">   Paramètre serveur</flowPara><flowPara
         id="flowPara4649"
         style="font-size:10px">   Copies et dossiers</flowPara><flowPara
         style="font-size:10px"
         id="flowPara4671">   Rédaction et adressage</flowPara><flowPara
         style="font-size:10px"
         id="flowPara4673">   Paramètres des indésirables</flowPara><flowPara
         style="font-size:10px"
         id="flowPara4675">   Synchronisation et espace disque</flowPara><flowPara
         style="font-size:10px"
         id="flowPara4677">   Accusés de réceptions</flowPara><flowPara
         style="font-size:10px"
         id="flowPara4679">   Sécurité</flowPara><flowPara
         style="font-size:10px"
         id="flowPara4681">Dossiers locaux</flowPara><flowPara
         style="font-size:10px"
         id="flowPara4683">   Paramètres des indésirables</flowPara><flowPara
         style="font-size:10px"
         id="flowPara4685">   Espace disque</flowPara><flowPara
         style="font-size:10px"
         id="flowPara4687">Serveur sortant (SMTP)</flowPara><flowPara
         id="flowPara4651"
         style="font-size:10px" /><flowPara
         id="flowPara4653"
         style="font-size:10px" /><flowPara
         id="flowPara4655"
         style="font-size:10px" /><flowPara
         id="flowPara4657"
         style="font-size:10px" /><flowPara
         id="flowPara4659"
         style="font-size:10px" /><flowPara
         id="flowPara4661"
         style="font-size:10px" /><flowPara
         id="flowPara4663"
         style="font-size:10px" /><flowPara
         id="flowPara4665"
         style="font-size:10px" /><flowPara
         id="flowPara4667"
         style="font-size:10px" /><flowPara
         id="flowPara4669"
         style="font-size:10px" /></flowRoot>    <rect
       style="opacity:1;fill:#e6e6e6;fill-opacity:1;stroke:#000000;stroke-width:0.84325385;stroke-linejoin:round;stroke-miterlimit:4;stroke-dasharray:none;stroke-dashoffset:0;stroke-opacity:1"
       id="rect4689-2"
       width="114.47279"
       height="10.261694"
       x="121.17241"
       y="944.77917"
       ry="5.130847" />
    <path
       style="fill:none;fill-rule:evenodd;stroke:#000000;stroke-width:0.8445918px;stroke-linecap:butt;stroke-linejoin:miter;stroke-opacity:1"
       d="m 118.05217,942.96529 0,106.64551"
       id="path4867"
       inkscape:connector-curvature="0" />
    <flowRoot
       xml:space="preserve"
       id="flowRoot5148"
       style="font-style:normal;font-weight:normal;font-size:12.20619011px;line-height:125%;font-family:sans-serif;letter-spacing:0px;word-spacing:0px;fill:#000000;fill-opacity:1;stroke:none;stroke-width:1px;stroke-linecap:butt;stroke-linejoin:miter;stroke-opacity:1"
       transform="matrix(0.64439429,0,0,0.64439429,212.26752,340.66866)"><flowRegion
         id="flowRegion5150"><rect
           id="rect5152"
           width="172.94853"
           height="22.220554"
           x="-134.00603"
           y="936.98004" /></flowRegion><flowPara
         id="flowPara5154"
         style="font-style:normal;font-variant:normal;font-weight:bold;font-stretch:normal;font-family:sans-serif;-inkscape-font-specification:'sans-serif Bold'">Rédaction et adressage</flowPara></flowRoot>    <flowRoot
       xml:space="preserve"
       id="flowRoot5387"
       style="font-style:normal;font-weight:normal;font-size:40px;line-height:125%;font-family:sans-serif;letter-spacing:0px;word-spacing:0px;fill:#000000;fill-opacity:1;stroke:none;stroke-width:1px;stroke-linecap:butt;stroke-linejoin:miter;stroke-opacity:1"
       transform="matrix(0.82446838,0,0,0.82446838,353.02814,1078.7041)"><flowRegion
         id="flowRegion5389"><rect
           id="rect5391"
           width="254.99998"
           height="110.35714"
           x="-277.14285"
           y="-143.48141" /></flowRegion><flowPara
         id="flowPara5397"
         style="font-style:normal;font-variant:normal;font-weight:bold;font-stretch:normal;font-size:7.5px;line-height:160.00000238%;font-family:sans-serif;-inkscape-font-specification:'sans-serif Bold'">Rédaction des messages</flowPara><flowPara
         style="font-size:7.5px;line-height:160.00000238%"
         id="flowPara5423">     Rédiger les messages en HTML</flowPara><flowPara
         style="font-size:7.5px;line-height:160.00000238%"
         id="flowPara5425">     Citer le message original dans la réponse</flowPara><flowPara
         style="font-size:7.5px;line-height:160.00000238%"
         id="flowPara5427">         Lors de la rédaction     la réponse commence après la citation</flowPara><flowPara
         style="font-size:7.5px;line-height:160.00000238%"
         id="flowPara5429">         et placer la signature  sous la citation (recommandé)</flowPara><flowPara
         style="font-size:7.5px;line-height:160.00000238%"
         id="flowPara5431" /><flowPara
         style="font-size:7.5px;line-height:160.00000238%"
         id="flowPara5433">     Ajouter la signature pour les réponses</flowPara><flowPara
         style="font-size:7.5px;line-height:160.00000238%"
         id="flowPara5435">     Ajouter la signature pour les transferts</flowPara><flowPara
         id="flowPara5399"
         style="font-size:7.5px;line-height:160.00000238%" /><flowPara
         id="flowPara5401"
         style="font-size:7.5px;line-height:160.00000238%" /><flowPara
         id="flowPara5403"
         style="font-size:7.5px;line-height:160.00000238%" /><flowPara
         id="flowPara5405"
         style="font-size:7.5px;line-height:160.00000238%" /><flowPara
         id="flowPara5407"
         style="font-size:7.5px;line-height:160.00000238%" /><flowPara
         id="flowPara5409"
         style="font-size:7.5px;line-height:160.00000238%" /><flowPara
         id="flowPara5411"
         style="font-size:7.5px;line-height:160.00000238%" /><flowPara
         id="flowPara5413"
         style="font-size:7.5px;line-height:160.00000238%" /><flowPara
         id="flowPara5415"
         style="font-size:7.5px;line-height:160.00000238%" /><flowPara
         id="flowPara5417"
         style="font-size:7.5px;line-height:160.00000238%" /></flowRoot>    <rect
       style="opacity:1;fill:none;fill-opacity:1;stroke:#000000;stroke-width:0.44800001;stroke-linejoin:round;stroke-miterlimit:4;stroke-dasharray:none;stroke-dashoffset:0;stroke-opacity:1"
       id="rect5437"
       width="4.5801101"
       height="4.6693964"
       x="127.59966"
       y="1023.027"
       ry="0" />
    <rect
       style="opacity:1;fill:none;fill-opacity:1;stroke:#000000;stroke-width:0.44800001;stroke-linejoin:round;stroke-miterlimit:4;stroke-dasharray:none;stroke-dashoffset:0;stroke-opacity:1"
       id="rect5437-3"
       width="4.5801101"
       height="4.6693964"
       x="127.59966"
       y="1033.7859"
       ry="0" />
    <rect
       style="opacity:1;fill:none;fill-opacity:1;stroke:#000000;stroke-width:0.44800001;stroke-linejoin:round;stroke-miterlimit:4;stroke-dasharray:none;stroke-dashoffset:0;stroke-opacity:1"
       id="rect5437-9"
       width="4.5801101"
       height="4.6693964"
       x="127.59966"
       y="983.87518"
       ry="0" />
    <rect
       style="opacity:1;fill:none;fill-opacity:1;stroke:#000000;stroke-width:0.44800001;stroke-linejoin:round;stroke-miterlimit:4;stroke-dasharray:none;stroke-dashoffset:0;stroke-opacity:1"
       id="rect5437-0"
       width="4.5801101"
       height="4.6693964"
       x="127.59966"
       y="973.87518"
       ry="0" />
    <path
       style="fill:none;fill-rule:evenodd;stroke:#000000;stroke-width:1px;stroke-linecap:butt;stroke-linejoin:miter;stroke-opacity:1"
       d="m 127.70221,974.02239 4.19643,4.24107"
       id="path5468"
       inkscape:connector-curvature="0" />
    <path
       style="fill:none;fill-rule:evenodd;stroke:#000000;stroke-width:1px;stroke-linecap:butt;stroke-linejoin:miter;stroke-opacity:1"
       d="m 127.70221,978.48668 4.15179,-4.41965"
       id="path5470"
       inkscape:connector-curvature="0" />
    <path
       style="fill:none;fill-rule:evenodd;stroke:#000000;stroke-width:1px;stroke-linecap:butt;stroke-linejoin:miter;stroke-opacity:1"
       d="m 127.83614,984.11168 4.24107,4.375"
       id="path5472"
       inkscape:connector-curvature="0" />
    <path
       style="fill:none;fill-rule:evenodd;stroke:#000000;stroke-width:1px;stroke-linecap:butt;stroke-linejoin:miter;stroke-opacity:1"
       d="m 127.83614,988.48668 4.0625,-4.46429"
       id="path5474"
       inkscape:connector-curvature="0" />
    <path
       style="fill:none;fill-rule:evenodd;stroke:#000000;stroke-width:1px;stroke-linecap:butt;stroke-linejoin:miter;stroke-opacity:1"
       d="m 127.74685,1023.1742 4.28572,4.375"
       id="path5476"
       inkscape:connector-curvature="0" />
    <path
       style="fill:none;fill-rule:evenodd;stroke:#000000;stroke-width:1px;stroke-linecap:butt;stroke-linejoin:miter;stroke-opacity:1"
       d="m 127.52364,1027.5938 4.375,-4.4196"
       id="path5478"
       inkscape:connector-curvature="0" />
    <rect
       style="opacity:1;fill:none;fill-opacity:1;stroke:#000000;stroke-width:0.39987245;stroke-linejoin:round;stroke-miterlimit:4;stroke-dasharray:none;stroke-dashoffset:0;stroke-opacity:1"
       id="rect5480"
       width="125.81212"
       height="7.8435435"
       x="210.56693"
       y="991.89172"
       ry="3.9217718" />
    <rect
       style="opacity:1;fill:none;fill-opacity:1;stroke:#000000;stroke-width:0.39570275;stroke-linejoin:round;stroke-miterlimit:4;stroke-dasharray:none;stroke-dashoffset:0;stroke-opacity:1"
       id="rect5480-8"
       width="124.5536"
       height="7.7584281"
       x="210.14641"
       y="1002.1454"
       ry="3.879214" />
  </g>
</svg>
