{
  "bools_are_tristate": true,
  "user_categories": {},
  "saved_searches": {},
  "grouped_search_terms": {},
  "gui_view_history": [
    [
      1868,
      "KOMA-Script. Typographie universelle avec XeLaTeX"
    ],
    [
      1879,
      "Le souffle du dragon"
    ],
    [
      1888,
      "Untitled"
    ],
    [
      1861,
      "onlysql-Lozano-Georges-ArtLibre-juin2019"
    ],
    [
      1887,
      "Libert\u00e9s num\u00e9riques"
    ],
    [
      122,
      "Pas de bile\u20ac!"
    ],
    [
      39,
      "Avant de dormir"
    ],
    [
      21,
      "Libres conseils"
    ],
    [
      17,
      "Changer pour OpenOffice.org"
    ],
    [
      14,
      "Le C en 20 heures"
    ],
    [
      7,
      "Geektionnerd, tome 1. Rencontre du troisi\u00e8me type"
    ],
    [
      37,
      "livregehin"
    ],
    [
      36,
      "G\u00e9rardmer \u00e0 travers les \u00e2ges"
    ],
    [
      31,
      "Producing Open Source Software"
    ],
    [
      30,
      "Imagine There Is No Copyright and No Cultural Conglomerate Too"
    ]
  ],
  "tag_browser_hidden_categories": [],
  "library_view books view state": {
    "hidden_columns": [
      "last_modified",
      "languages"
    ],
    "last_modified_injected": true,
    "languages_injected": true,
    "sort_history": [
      [
        "authors",
        false
      ],
      [
        "title",
        true
      ],
      [
        "authors",
        true
      ],
      [
        "rating",
        false
      ],
      [
        "timestamp",
        false
      ]
    ],
    "column_positions": {
      "ondevice": 0,
      "title": 1,
      "authors": 2,
      "timestamp": 3,
      "size": 4,
      "rating": 5,
      "tags": 6,
      "series": 7,
      "publisher": 8,
      "pubdate": 9,
      "last_modified": 10,
      "languages": 11
    },
    "column_sizes": {
      "title": 316,
      "authors": 245,
      "timestamp": 94,
      "size": 113,
      "rating": 76,
      "tags": 262,
      "series": 78,
      "publisher": 91,
      "pubdate": 84,
      "last_modified": 0,
      "languages": 0
    },
    "column_alignment": {
      "timestamp": "center",
      "pubdate": "center",
      "size": "center"
    }
  },
  "field_metadata": {
    "authors": {
      "table": "authors",
      "column": "name",
      "link_column": "author",
      "category_sort": "sort",
      "datatype": "text",
      "is_multiple": {
        "cache_to_list": ",",
        "ui_to_list": "&",
        "list_to_ui": " & "
      },
      "kind": "field",
      "name": "Auteurs",
      "search_terms": [
        "authors",
        "author"
      ],
      "is_custom": false,
      "is_category": true,
      "is_csp": false,
      "label": "authors",
      "display": {},
      "is_editable": true,
      "rec_index": 2
    },
    "languages": {
      "table": "languages",
      "column": "lang_code",
      "link_column": "lang_code",
      "category_sort": "lang_code",
      "datatype": "text",
      "is_multiple": {
        "cache_to_list": ",",
        "ui_to_list": ",",
        "list_to_ui": ", "
      },
      "kind": "field",
      "name": "Langues",
      "search_terms": [
        "languages",
        "language"
      ],
      "is_custom": false,
      "is_category": true,
      "is_csp": false,
      "label": "languages",
      "display": {},
      "is_editable": true,
      "rec_index": 21
    },
    "series": {
      "table": "series",
      "column": "name",
      "link_column": "series",
      "category_sort": "(title_sort(name))",
      "datatype": "series",
      "is_multiple": {},
      "kind": "field",
      "name": "S\u00e9rie",
      "search_terms": [
        "series"
      ],
      "is_custom": false,
      "is_category": true,
      "is_csp": false,
      "label": "series",
      "display": {},
      "is_editable": true,
      "rec_index": 8
    },
    "formats": {
      "table": null,
      "column": null,
      "datatype": "text",
      "is_multiple": {
        "cache_to_list": ",",
        "ui_to_list": ",",
        "list_to_ui": ", "
      },
      "kind": "field",
      "name": "Formats",
      "search_terms": [
        "formats",
        "format"
      ],
      "is_custom": false,
      "is_category": true,
      "is_csp": false,
      "label": "formats",
      "display": {},
      "is_editable": true,
      "rec_index": 13
    },
    "publisher": {
      "table": "publishers",
      "column": "name",
      "link_column": "publisher",
      "category_sort": "name",
      "datatype": "text",
      "is_multiple": {},
      "kind": "field",
      "name": "\u00c9diteur",
      "search_terms": [
        "publisher"
      ],
      "is_custom": false,
      "is_category": true,
      "is_csp": false,
      "label": "publisher",
      "display": {},
      "is_editable": true,
      "rec_index": 9
    },
    "rating": {
      "table": "ratings",
      "column": "rating",
      "link_column": "rating",
      "category_sort": "rating",
      "datatype": "rating",
      "is_multiple": {},
      "kind": "field",
      "name": "Note",
      "search_terms": [
        "rating"
      ],
      "is_custom": false,
      "is_category": true,
      "is_csp": false,
      "label": "rating",
      "display": {},
      "is_editable": true,
      "rec_index": 5
    },
    "news": {
      "table": "news",
      "column": "name",
      "category_sort": "name",
      "datatype": null,
      "is_multiple": {},
      "kind": "category",
      "name": "Actualit\u00e9s",
      "search_terms": [],
      "is_custom": false,
      "is_category": true,
      "is_csp": false,
      "label": "news",
      "display": {},
      "is_editable": true
    },
    "tags": {
      "table": "tags",
      "column": "name",
      "link_column": "tag",
      "category_sort": "name",
      "datatype": "text",
      "is_multiple": {
        "cache_to_list": ",",
        "ui_to_list": ",",
        "list_to_ui": ", "
      },
      "kind": "field",
      "name": "\u00c9tiquettes",
      "search_terms": [
        "tags",
        "tag"
      ],
      "is_custom": false,
      "is_category": true,
      "is_csp": false,
      "label": "tags",
      "display": {},
      "is_editable": true,
      "rec_index": 6
    },
    "identifiers": {
      "table": null,
      "column": null,
      "datatype": "text",
      "is_multiple": {
        "cache_to_list": ",",
        "ui_to_list": ",",
        "list_to_ui": ", "
      },
      "kind": "field",
      "name": "Identifiants",
      "search_terms": [
        "identifiers",
        "identifier",
        "isbn"
      ],
      "is_custom": false,
      "is_category": true,
      "is_csp": true,
      "label": "identifiers",
      "display": {},
      "is_editable": true,
      "rec_index": 20
    },
    "author_sort": {
      "table": null,
      "column": null,
      "datatype": "text",
      "is_multiple": {},
      "kind": "field",
      "name": "Cl\u00e9 de tri par auteur",
      "search_terms": [
        "author_sort"
      ],
      "is_custom": false,
      "is_category": false,
      "is_csp": false,
      "label": "author_sort",
      "display": {},
      "is_editable": true,
      "rec_index": 12
    },
    "au_map": {
      "table": null,
      "column": null,
      "datatype": "text",
      "is_multiple": {
        "cache_to_list": ",",
        "ui_to_list": null,
        "list_to_ui": null
      },
      "kind": "field",
      "name": null,
      "search_terms": [],
      "is_custom": false,
      "is_category": false,
      "is_csp": false,
      "label": "au_map",
      "display": {},
      "is_editable": true,
      "rec_index": 18
    },
    "comments": {
      "table": null,
      "column": null,
      "datatype": "text",
      "is_multiple": {},
      "kind": "field",
      "name": "Commentaires",
      "search_terms": [
        "comments",
        "comment"
      ],
      "is_custom": false,
      "is_category": false,
      "is_csp": false,
      "label": "comments",
      "display": {},
      "is_editable": true,
      "rec_index": 7
    },
    "cover": {
      "table": null,
      "column": null,
      "datatype": "int",
      "is_multiple": {},
      "kind": "field",
      "name": "Couverture",
      "search_terms": [
        "cover"
      ],
      "is_custom": false,
      "is_category": false,
      "is_csp": false,
      "label": "cover",
      "display": {},
      "is_editable": true,
      "rec_index": 17
    },
    "id": {
      "table": null,
      "column": null,
      "datatype": "int",
      "is_multiple": {},
      "kind": "field",
      "name": null,
      "search_terms": [
        "id"
      ],
      "is_custom": false,
      "is_category": false,
      "is_csp": false,
      "label": "id",
      "display": {},
      "is_editable": true,
      "rec_index": 0
    },
    "last_modified": {
      "table": null,
      "column": null,
      "datatype": "datetime",
      "is_multiple": {},
      "kind": "field",
      "name": "Modifi\u00e9",
      "search_terms": [
        "last_modified"
      ],
      "is_custom": false,
      "is_category": false,
      "is_csp": false,
      "label": "last_modified",
      "display": {
        "date_format": "dd MMM yyyy"
      },
      "is_editable": true,
      "rec_index": 19
    },
    "ondevice": {
      "table": null,
      "column": null,
      "datatype": "text",
      "is_multiple": {},
      "kind": "field",
      "name": "Sur le p\u00e9riph\u00e9rique",
      "search_terms": [
        "ondevice"
      ],
      "is_custom": false,
      "is_category": false,
      "is_csp": false,
      "label": "ondevice",
      "display": {},
      "is_editable": true,
      "rec_index": 22
    },
    "path": {
      "table": null,
      "column": null,
      "datatype": "text",
      "is_multiple": {},
      "kind": "field",
      "name": "Chemin",
      "search_terms": [],
      "is_custom": false,
      "is_category": false,
      "is_csp": false,
      "label": "path",
      "display": {},
      "is_editable": true,
      "rec_index": 14
    },
    "pubdate": {
      "table": null,
      "column": null,
      "datatype": "datetime",
      "is_multiple": {},
      "kind": "field",
      "name": "Publi\u00e9",
      "search_terms": [
        "pubdate"
      ],
      "is_custom": false,
      "is_category": false,
      "is_csp": false,
      "label": "pubdate",
      "display": {
        "date_format": "MMM yyyy"
      },
      "is_editable": true,
      "rec_index": 15
    },
    "marked": {
      "table": null,
      "column": null,
      "datatype": "text",
      "is_multiple": {},
      "kind": "field",
      "name": null,
      "search_terms": [
        "marked"
      ],
      "is_custom": false,
      "is_category": false,
      "is_csp": false,
      "label": "marked",
      "display": {},
      "is_editable": true,
      "rec_index": 23
    },
    "series_index": {
      "table": null,
      "column": null,
      "datatype": "float",
      "is_multiple": {},
      "kind": "field",
      "name": null,
      "search_terms": [
        "series_index"
      ],
      "is_custom": false,
      "is_category": false,
      "is_csp": false,
      "label": "series_index",
      "display": {},
      "is_editable": true,
      "rec_index": 10
    },
    "series_sort": {
      "table": null,
      "column": null,
      "datatype": "text",
      "is_multiple": {},
      "kind": "field",
      "name": "Tri par s\u00e9rie",
      "search_terms": [
        "series_sort"
      ],
      "is_custom": false,
      "is_category": false,
      "is_csp": false,
      "label": "series_sort",
      "display": {},
      "is_editable": true,
      "rec_index": 24
    },
    "sort": {
      "table": null,
      "column": null,
      "datatype": "text",
      "is_multiple": {},
      "kind": "field",
      "name": "Tri par titre",
      "search_terms": [
        "title_sort"
      ],
      "is_custom": false,
      "is_category": false,
      "is_csp": false,
      "label": "sort",
      "display": {},
      "is_editable": true,
      "rec_index": 11
    },
    "size": {
      "table": null,
      "column": null,
      "datatype": "float",
      "is_multiple": {},
      "kind": "field",
      "name": "Taille",
      "search_terms": [
        "size"
      ],
      "is_custom": false,
      "is_category": false,
      "is_csp": false,
      "label": "size",
      "display": {},
      "is_editable": true,
      "rec_index": 4
    },
    "timestamp": {
      "table": null,
      "column": null,
      "datatype": "datetime",
      "is_multiple": {},
      "kind": "field",
      "name": "Date",
      "search_terms": [
        "date"
      ],
      "is_custom": false,
      "is_category": false,
      "is_csp": false,
      "label": "timestamp",
      "display": {
        "date_format": "dd MMM yyyy"
      },
      "is_editable": true,
      "rec_index": 3
    },
    "title": {
      "table": null,
      "column": null,
      "datatype": "text",
      "is_multiple": {},
      "kind": "field",
      "name": "Titre",
      "search_terms": [
        "title"
      ],
      "is_custom": false,
      "is_category": false,
      "is_csp": false,
      "label": "title",
      "display": {},
      "is_editable": true,
      "rec_index": 1
    },
    "uuid": {
      "table": null,
      "column": null,
      "datatype": "text",
      "is_multiple": {},
      "kind": "field",
      "name": null,
      "search_terms": [
        "uuid"
      ],
      "is_custom": false,
      "is_category": false,
      "is_csp": false,
      "label": "uuid",
      "display": {},
      "is_editable": true,
      "rec_index": 16
    }
  },
  "books view split pane state": {
    "hidden_columns": [],
    "column_positions": {
      "ondevice": 0,
      "title": 1,
      "authors": 2,
      "timestamp": 3,
      "size": 4,
      "rating": 5,
      "tags": 6,
      "series": 7,
      "publisher": 8,
      "pubdate": 9,
      "last_modified": 10,
      "languages": 11
    },
    "column_sizes": {
      "title": 100,
      "authors": 100,
      "timestamp": 100,
      "size": 100,
      "rating": 100,
      "tags": 100,
      "series": 100,
      "publisher": 100,
      "pubdate": 100,
      "last_modified": 100,
      "languages": 100
    }
  }
}