Merge branch 'feedback-button' into 'develop'

Feedback button

See merge request !38
1 job for feedback-button in 3 minutes and 44 seconds (queued for 2 seconds)
latest
Status Name Job ID Coverage
  Test
failed test #1016034

00:03:44

 
Name Stage Failure
failed
test Test
npm ERR! Failed at the framadate-funky-frontend@1.0.0 test:ci script.
npm ERR! This is probably not a problem with npm. There is likely additional logging output above.

npm ERR! A complete log of this run can be found in:
npm ERR! /root/.npm/_logs/2020-06-07T11_52_26_439Z-debug.log
Running after_script
Uploading artifacts for failed job
Authenticating with credentials from /root/.docker/config.json
ERROR: Job failed: exit code 1