🐛 fix window global object in visibility

1 job for feature/ui-cutting-elements in 1 minute and 35 seconds (queued for 1 second)
latest
Status Name Job ID Coverage
  Test
failed test #972672

00:01:35

 
Name Stage Failure
failed
test Test
npm ERR! 
npm ERR! Failed at the framadate-funky-frontend@1.0.0 test:ci script.
npm ERR! This is probably not a problem with npm. There is likely additional logging output above.

npm ERR! A complete log of this run can be found in:
npm ERR! /root/.npm/_logs/2020-04-23T13_08_28_794Z-debug.log
Running after_script
Uploading artifacts for failed job
ERROR: Job failed: exit code 1