<svg xmlns="http://www.w3.org/2000/svg" width="16" height="12" viewBox="0 0 16 12">
    <path fill="#429A00" fill-rule="evenodd" d="M6.133 12L.281 5.903a1.257 1.257 0 0 1 .062-1.656 1.136 1.136 0 0 1 1.589-.064l4.201 4.378L14.068.293a1.136 1.136 0 0 1 1.59.064c.432.45.458 1.172.06 1.656L6.134 12z"/>
</svg>
