Passage à python-3.8 et pytest-monitor

Signed-off-by: Vincent-Xavier JUMEL <endymion@thetys-retz.net>
2 jobs for 45-ajout-pytest-monitor in 1 minute and 25 seconds (queued for 2 seconds)
latest
Status Job ID Name Coverage
  Test
passed run #960878

00:01:21

failed test #960877

00:01:25

 
Name Stage Failure
failed
test Test
FAILED src/main.py::src.main.run - AttributeError: 'DoctestItem' object has n...
FAILED src/main.py::src.main.score_popularite - AttributeError: 'DoctestItem'...
FAILED src/main.py::src.main.tous_les_chemins_long_3 - AttributeError: 'Docte...
FAILED src/main.py::src.main.trinomes_parfaits - AttributeError: 'DoctestItem...
======================== 11 failed, 18 passed in 3.18s =========================
Running after_script
Uploading artifacts for failed job
Authenticating with credentials from /root/.docker/config.json
ERROR: Job failed: exit code 1