<?xml version="1.0" encoding="UTF-8" standalone="no"?>
<svg
   xmlns:dc="http://purl.org/dc/elements/1.1/"
   xmlns:cc="http://creativecommons.org/ns#"
   xmlns:rdf="http://www.w3.org/1999/02/22-rdf-syntax-ns#"
   xmlns:svg="http://www.w3.org/2000/svg"
   xmlns="http://www.w3.org/2000/svg"
   xmlns:sodipodi="http://sodipodi.sourceforge.net/DTD/sodipodi-0.dtd"
   xmlns:inkscape="http://www.inkscape.org/namespaces/inkscape"
   version="1.1"
   viewBox="46 193 552 258"
   width="46pc"
   height="258pt"
   id="svg2"
   inkscape:version="0.91 r"
   sodipodi:docname="tasklet.svg">
  <sodipodi:namedview
     pagecolor="#ffffff"
     bordercolor="#666666"
     borderopacity="1"
     objecttolerance="10"
     gridtolerance="10"
     guidetolerance="10"
     inkscape:pageopacity="0"
     inkscape:pageshadow="2"
     inkscape:window-width="1366"
     inkscape:window-height="716"
     id="namedview121"
     showgrid="false"
     inkscape:zoom="1.7544447"
     inkscape:cx="444.15889"
     inkscape:cy="200.61115"
     inkscape:window-x="0"
     inkscape:window-y="132"
     inkscape:window-maximized="1"
     inkscape:current-layer="svg2" />
  <metadata
     id="metadata4"> Produced by OmniGraffle 7.2.1 
    <dc:date>2016-11-30 14:23:15 +0000</dc:date>
<rdf:RDF>
  <cc:Work
     rdf:about="">
    <dc:format>image/svg+xml</dc:format>
    <dc:type
       rdf:resource="http://purl.org/dc/dcmitype/StillImage" />
  </cc:Work>
</rdf:RDF>
</metadata>
  <defs
     id="defs6">
    <inkscape:path-effect
       effect="spiro"
       id="path-effect4450"
       is_visible="true" />
    <inkscape:path-effect
       effect="spiro"
       id="path-effect4446"
       is_visible="true" />
    <inkscape:path-effect
       effect="spiro"
       id="path-effect4442"
       is_visible="true" />
    <inkscape:path-effect
       effect="spiro"
       id="path-effect4438"
       is_visible="true" />
    <inkscape:path-effect
       effect="spiro"
       id="path-effect4424"
       is_visible="true" />
    <filter
       id="Shadow"
       filterUnits="userSpaceOnUse">
      <feGaussianBlur
         in="SourceAlpha"
         result="blur"
         stdDeviation="1.308"
         id="feGaussianBlur9" />
      <feOffset
         in="blur"
         result="offset"
         dx="3"
         dy="3"
         id="feOffset11" />
      <feFlood
         flood-color="black"
         flood-opacity=".5"
         result="flood"
         id="feFlood13" />
      <feComposite
         in="flood"
         in2="offset"
         operator="in"
         result="color"
         id="feComposite15" />
      <feMerge
         id="feMerge17">
        <feMergeNode
           in="color"
           id="feMergeNode19" />
        <feMergeNode
           in="SourceGraphic"
           id="feMergeNode21" />
      </feMerge>
    </filter>
    <font-face
       font-family="Helvetica Neue"
       font-size="16"
       panose-1="2 0 5 3 0 0 0 2 0 4"
       units-per-em="1000"
       underline-position="-100"
       underline-thickness="50"
       slope="0"
       x-height="517"
       cap-height="714"
       ascent="951.9958"
       descent="-212.99744"
       font-weight="500"
       id="font-face23">
      <font-face-src>
        <font-face-name
           name="HelveticaNeue" />
      </font-face-src>
    </font-face>
    <marker
       orient="auto"
       overflow="visible"
       markerUnits="strokeWidth"
       id="FilledArrow_Marker"
       viewBox="-1 -4 10 8"
       markerWidth="10"
       markerHeight="8"
       color="black">
      <g
         id="g26">
        <path
           d="M 8 0 L 0 -3 L 0 3 Z"
           fill="currentColor"
           stroke="currentColor"
           stroke-width="1"
           id="path28" />
      </g>
    </marker>
    <marker
       orient="auto"
       overflow="visible"
       markerUnits="strokeWidth"
       id="FilledArrow_Marker_2"
       viewBox="-9 -4 10 8"
       markerWidth="10"
       markerHeight="8"
       color="black">
      <g
         id="g31">
        <path
           d="M -8 0 L 0 3 L 0 -3 Z"
           fill="currentColor"
           stroke="currentColor"
           stroke-width="1"
           id="path33" />
      </g>
    </marker>
  </defs>
  <text
     xml:space="preserve"
     style="font-style:normal;font-weight:normal;font-size:12px;line-height:125%;font-family:sans-serif;letter-spacing:0px;word-spacing:0px;fill:#000000;fill-opacity:1;stroke:none;stroke-width:1px;stroke-linecap:butt;stroke-linejoin:miter;stroke-opacity:1;"
     x="212.63747"
     y="248.09157"
     id="text4287"
     sodipodi:linespacing="125%"
     transform="scale(1.095233,0.91304772)"><tspan
       sodipodi:role="line"
       x="212.63747"
       y="248.09157"
       id="tspan4291">CPU</tspan></text>
  <text
     xml:space="preserve"
     style="font-style:normal;font-weight:normal;font-size:10px;line-height:125%;font-family:sans-serif;text-align:center;letter-spacing:0px;word-spacing:0px;text-anchor:middle;fill:#000000;fill-opacity:1;stroke:none;stroke-width:1px;stroke-linecap:butt;stroke-linejoin:miter;stroke-opacity:1"
     x="481.81226"
     y="262.23886"
     id="text4301"
     sodipodi:linespacing="125%"
     transform="scale(0.99891349,1.0010877)"><tspan
       sodipodi:role="line"
       id="tspan4303"
       x="481.81226"
       y="262.23886">performs</tspan><tspan
       sodipodi:role="line"
       x="481.81226"
       y="274.73886"
       id="tspan4305">data-intensive</tspan><tspan
       sodipodi:role="line"
       x="481.81226"
       y="287.23886"
       id="tspan4307">operations</tspan></text>
  <text
     xml:space="preserve"
     style="font-style:normal;font-weight:normal;font-size:10px;line-height:125%;font-family:sans-serif;text-align:center;letter-spacing:0px;word-spacing:0px;text-anchor:middle;fill:#000000;fill-opacity:1;stroke:none;stroke-width:1px;stroke-linecap:butt;stroke-linejoin:miter;stroke-opacity:1"
     x="140.30945"
     y="268.27585"
     id="text4317"
     sodipodi:linespacing="125%"
     transform="scale(0.99457143,1.0054582)"><tspan
       sodipodi:role="line"
       id="tspan4319"
       x="140.30945"
       y="268.27585">orchestrates</tspan><tspan
       sodipodi:role="line"
       x="140.30945"
       y="280.77585"
       id="tspan4321">the execution</tspan></text>
  <rect
     style="fill:#ffffff;fill-opacity:1;stroke:#000000;stroke-width:1.6;stroke-linecap:butt;stroke-miterlimit:4;stroke-dasharray:none;stroke-dashoffset:0;stroke-opacity:1"
     id="rect4285-6"
     width="71.917572"
     height="79.080872"
     x="335.30243"
     y="226.22873"
     rx="0.11309631" />
  <rect
     style="fill:#ffffff;fill-opacity:1;stroke:#000000;stroke-width:1.6;stroke-linecap:butt;stroke-miterlimit:4;stroke-dasharray:none;stroke-dashoffset:0;stroke-opacity:1"
     id="rect4285-6-5"
     width="71.917572"
     height="79.080872"
     x="332.04123"
     y="229.85956"
     rx="0.11309631" />
  <rect
     style="fill:#ffffff;fill-opacity:1;stroke:#000000;stroke-width:1.6;stroke-linecap:butt;stroke-miterlimit:4;stroke-dasharray:none;stroke-dashoffset:0;stroke-opacity:1"
     id="rect4285-6-3"
     width="71.917572"
     height="79.080872"
     x="328.73038"
     y="233.8082"
     rx="0.11309631" />
  <rect
     style="fill:#ffffff;fill-opacity:1;stroke:none;stroke-width:0.71540999;stroke-linecap:butt;stroke-miterlimit:4;stroke-dasharray:none;stroke-dashoffset:0;stroke-opacity:1"
     id="rect4350"
     width="35.296616"
     height="10.666128"
     x="347.39441"
     y="216.63617"
     rx="0.087861918" />
  <text
     xml:space="preserve"
     style="font-style:normal;font-weight:normal;font-size:12px;line-height:125%;font-family:sans-serif;letter-spacing:0px;word-spacing:0px;fill:#000000;fill-opacity:1;stroke:none;stroke-width:1px;stroke-linecap:butt;stroke-linejoin:miter;stroke-opacity:1;"
     x="322.90454"
     y="244.09653"
     id="text4309"
     sodipodi:linespacing="125%"
     transform="scale(1.077609,0.92798038)"><tspan
       sodipodi:role="line"
       id="tspan4311"
       x="322.90454"
       y="244.09653">DPUs</tspan></text>
  <rect
     style="fill:#ffffff;fill-opacity:1;stroke:#000000;stroke-width:1.6;stroke-linecap:butt;stroke-miterlimit:4;stroke-dasharray:none;stroke-dashoffset:0;stroke-opacity:1;stroke-linejoin:miter"
     id="rect4285-6-3-5"
     width="71.917572"
     height="79.080872"
     x="209.64122"
     y="233.8082"
     rx="0.11309631" />
  <text
     xml:space="preserve"
     style="font-style:normal;font-weight:normal;font-size:12px;line-height:125%;font-family:sans-serif;letter-spacing:0px;word-spacing:0px;fill:#000000;fill-opacity:1;stroke:none;stroke-width:1px;stroke-linecap:butt;stroke-linejoin:miter;stroke-opacity:1;"
     x="380.25137"
     y="253.106"
     id="text4313"
     sodipodi:linespacing="125%"
     transform="scale(0.90935404,1.0996817)"><tspan
       sodipodi:role="line"
       id="tspan4315"
       x="380.25137"
       y="253.106">Tasklet</tspan></text>
  <flowRoot
     xml:space="preserve"
     id="flowRoot4388"
     style="fill:black;stroke:none;stroke-opacity:1;stroke-width:1px;stroke-linejoin:miter;stroke-linecap:butt;fill-opacity:1;font-family:sans-serif;font-style:normal;font-weight:normal;font-size:40px;line-height:125%;letter-spacing:0px;word-spacing:0px"><flowRegion
       id="flowRegion4390"><rect
         id="rect4392"
         width="128.69344"
         height="152.73506"
         x="321.02649"
         y="48.14257" /></flowRegion><flowPara
       id="flowPara4394"></flowPara></flowRoot>  <text
     xml:space="preserve"
     style="font-style:normal;font-weight:normal;font-size:12px;line-height:125%;font-family:sans-serif;text-align:center;letter-spacing:0px;word-spacing:0px;text-anchor:middle;fill:#000000;fill-opacity:1;stroke:none;stroke-width:1px;stroke-linecap:butt;stroke-linejoin:miter;stroke-opacity:1"
     x="230.45274"
     y="286.90063"
     id="text4295"
     sodipodi:linespacing="125%"
     transform="scale(1.0655793,0.93845667)"><tspan
       sodipodi:role="line"
       id="tspan4297"
       x="230.45274"
       y="286.90063">Host</tspan><tspan
       sodipodi:role="line"
       x="230.45274"
       y="301.90063"
       id="tspan4299">program</tspan></text>
  <text
     xml:space="preserve"
     style="font-style:normal;font-weight:normal;font-size:51.89749908px;line-height:125%;font-family:sans-serif;letter-spacing:0px;word-spacing:0px;fill:#000000;fill-opacity:1;stroke:none;stroke-width:1px;stroke-linecap:butt;stroke-linejoin:miter;stroke-opacity:1"
     x="306.92587"
     y="179.16153"
     id="text4396"
     sodipodi:linespacing="125%"
     transform="scale(0.59867111,1.6703662)"><tspan
       sodipodi:role="line"
       id="tspan4398"
       x="306.92587"
       y="179.16153">{</tspan></text>
  <text
     xml:space="preserve"
     style="font-style:normal;font-weight:normal;font-size:51.89749908px;line-height:125%;font-family:sans-serif;letter-spacing:0px;word-spacing:0px;fill:#000000;fill-opacity:1;stroke:none;stroke-width:1px;stroke-linecap:butt;stroke-linejoin:miter;stroke-opacity:1"
     x="-729.76025"
     y="179.16151"
     id="text4396-6"
     sodipodi:linespacing="125%"
     transform="scale(-0.59867109,1.6703663)"><tspan
       sodipodi:role="line"
       id="tspan4398-2"
       x="-729.76025"
       y="179.16151">{</tspan></text>
  <path
     style="fill:none;fill-rule:evenodd;stroke:#000000;stroke-width:0.72301388px;stroke-linecap:butt;stroke-linejoin:miter;stroke-opacity:1;marker-start:url(#FilledArrow_Marker_2);marker-end:url(#FilledArrow_Marker)"
     d="m 244.17992,323.65878 c -0.38199,27.84347 125.17731,26.27494 124.48025,0"
     id="path4556"
     inkscape:connector-curvature="0"
     sodipodi:nodetypes="cc" />
  <text
     xml:space="preserve"
     style="font-style:normal;font-weight:normal;font-size:9px;line-height:125%;font-family:sans-serif;letter-spacing:0px;word-spacing:0px;fill:#000000;fill-opacity:1;stroke:none;stroke-width:1px;stroke-linecap:butt;stroke-linejoin:miter;stroke-opacity:1"
     x="295.92633"
     y="311.62531"
     id="text4558"
     sodipodi:linespacing="125%"
     transform="scale(0.9288469,1.0766037)"><tspan
       sodipodi:role="line"
       id="tspan4560"
       x="295.92633"
       y="311.62531">communication</tspan></text>
  <text
     xml:space="preserve"
     style="font-style:normal;font-weight:normal;font-size:8px;line-height:125%;font-family:sans-serif;letter-spacing:0px;word-spacing:0px;fill:#000000;fill-opacity:1;stroke:none;stroke-width:1px;stroke-linecap:butt;stroke-linejoin:miter;stroke-opacity:1"
     x="284.1507"
     y="355.0152"
     id="text4562"
     sodipodi:linespacing="125%"><tspan
       sodipodi:role="line"
       id="tspan4564"
       x="284.1507"
       y="355.0152">- MRAM</tspan><tspan
       sodipodi:role="line"
       x="284.1507"
       y="365.0152"
       id="tspan4570">- Mailboxes</tspan></text>
</svg>
